<?xml version="1.0" encoding="UTF-8" standalone="no"?>
<svg
   xmlns:dc="http://purl.org/dc/elements/1.1/"
   xmlns:cc="http://creativecommons.org/ns#"
   xmlns:rdf="http://www.w3.org/1999/02/22-rdf-syntax-ns#"
   xmlns:svg="http://www.w3.org/2000/svg"
   xmlns="http://www.w3.org/2000/svg"
   xmlns:sodipodi="http://sodipodi.sourceforge.net/DTD/sodipodi-0.dtd"
   xmlns:inkscape="http://www.inkscape.org/namespaces/inkscape"
   id="svg3821"
   version="1.1"
   viewBox="0 0 105.83333 105.83334"
   height="400"
   width="400"
   sodipodi:docname="financial_situation_blue.svg"
   inkscape:version="0.92.2 5c3e80d, 2017-08-06">
  <sodipodi:namedview
     pagecolor="#ffffff"
     bordercolor="#666666"
     borderopacity="1"
     objecttolerance="10"
     gridtolerance="10"
     guidetolerance="10"
     inkscape:pageopacity="0"
     inkscape:pageshadow="2"
     inkscape:window-width="1366"
     inkscape:window-height="683"
     id="namedview9"
     showgrid="false"
     inkscape:zoom="1.18"
     inkscape:cx="155.50847"
     inkscape:cy="200"
     inkscape:window-x="0"
     inkscape:window-y="20"
     inkscape:window-maximized="1"
     inkscape:current-layer="svg3821" />
  <defs
     id="defs3815" />
  <metadata
     id="metadata3818">
    <rdf:RDF>
      <cc:Work
         rdf:about="">
        <dc:format>image/svg+xml</dc:format>
        <dc:type
           rdf:resource="http://purl.org/dc/dcmitype/StillImage" />
        <dc:title />
      </cc:Work>
    </rdf:RDF>
  </metadata>
  <g
     transform="translate(0,-191.16665)"
     id="layer1">
    <ellipse
       style="stroke-width:0.26458836;fill:#ff0000"
       ry="53.053001"
       rx="52.919369"
       cy="243.67972"
       cx="52.919365"
       id="path3823" />
    <path
       transform="matrix(0.26458333,0,0,0.26458333,0,191.16665)"
       id="path816"
       d="M 171.85336,396.52878 C 89.223988,384.57424 21.58007,321.05346 4.9184262,239.76911 -2.5601597,203.2846 -0.55683043,169.2253 11.101385,134.65046 28.377366,83.414981 65.11173,41.796156 113.7457,18.357823 c 55.5958,-26.7934639 119.5765,-26.4710541 174.54119,0.879544 39.7525,19.780962 71.47879,51.72668 90.91992,91.548743 55.65028,113.99073 -8.01384,250.74253 -131.18202,281.78163 -22.00167,5.54455 -53.79768,7.19799 -76.17143,3.96104 z"
       style="fill:#0000ff;fill-opacity:0.47673687;stroke:#000000;stroke-width:4.06606293;stroke-linejoin:round;stroke-miterlimit:4;stroke-dasharray:8.13212571, 4.06606285999999972;stroke-dashoffset:0;stroke-opacity:1" />
    <path
       transform="matrix(0.26458333,0,0,0.26458333,0,191.16665)"
       id="path818"
       d="m 193.9774,396.65928 c -0.7125,-1.85675 -5.93927,-2.00726 -8.7706,-0.25254 -1.45006,0.89867 -2.24694,0.94447 -2.76421,0.15885 -1.11843,-1.69866 -7.37768,-2.60862 -8.95263,-1.30152 -0.94857,0.78725 -1.37061,0.80247 -1.37061,0.0494 0,-1.46662 -7.36632,-2.81926 -7.82699,-1.43724 -0.19311,0.57932 -1.23333,0.82259 -2.31161,0.54062 -1.07828,-0.28197 -1.74468,-0.86189 -1.4809,-1.2887 0.26378,-0.42681 -1.43319,-1.26153 -3.77104,-1.85494 -3.18531,-0.80852 -4.43631,-0.77852 -4.99144,0.11971 -0.52337,0.84682 -1.3586,0.5355 -2.84567,-1.06067 -2.10061,-2.25474 -4.10115,-2.75693 -9.34977,-2.34702 -1.80762,0.14117 -2.77792,-0.27567 -2.77792,-1.19341 0,-1.62162 -7.40351,-4.24847 -7.89395,-2.80087 -0.45516,1.34348 -3.21773,0.0781 -3.21773,-1.47388 0,-1.49677 -7.41504,-4.77648 -7.89395,-3.49154 -0.47158,1.26532 -3.21773,-0.053 -3.21773,-1.54471 0,-1.45006 -5.51592,-4.05509 -8.58629,-4.05509 -1.11117,0 -1.90999,-0.55825 -1.77514,-1.24057 0.2909,-1.472 -5.444464,-4.78125 -8.326388,-4.80423 -1.111168,-0.009 -1.91691,-0.55359 -1.790538,-1.21049 0.278404,-1.44721 -6.384994,-5.74472 -7.673032,-4.94867 -1.042314,0.64419 -3.43788,-1.83199 -2.591337,-2.67854 0.878215,-0.87821 -5.817227,-5.24474 -8.103128,-5.28457 -1.353746,-0.0235 -1.969878,-0.61533 -1.788301,-1.71753 0.28723,-1.74352 -5.477113,-6.58706 -6.55569,-5.50848 -0.950533,0.95053 -3.252591,-1.40091 -2.722886,-2.7813 0.601257,-1.56685 -4.210962,-6.16139 -6.471071,-6.17835 -0.934982,-0.007 -1.706081,-0.76729 -1.713554,-1.68949 -0.01768,-2.18179 -3.387339,-5.8867 -6.402553,-7.03954 -1.408351,-0.53847 -2.159874,-1.47025 -1.845847,-2.2886 0.291326,-0.75918 -0.780411,-2.91206 -2.38164,-4.78418 -1.60123,-1.87212 -2.929799,-3.00726 -2.952378,-2.52255 -0.02258,0.48472 -0.717902,0.31957 -1.545161,-0.36699 -0.827258,-0.68657 -1.255576,-1.65043 -0.951817,-2.14192 0.909956,-1.4723 -2.891494,-6.95864 -4.821625,-6.95864 -1.238528,0 -1.734514,-0.70128 -1.607495,-2.27284 0.22278,-2.75638 -2.931381,-7.82868 -4.868193,-7.82868 -1.350976,0 -1.811587,-1.17122 -1.480095,-3.76352 0.280703,-2.19511 -2.951031,-7.34816 -4.608399,-7.34816 -1.136468,0 -1.444272,-0.62267 -1.051076,-2.12625 0.698042,-2.66932 -2.226726,-8.98543 -4.160839,-8.98543 -0.983823,0 -1.263796,-0.69656 -0.876007,-2.17947 0.670748,-2.56494 -1.89718,-9.33416 -3.228758,-8.5112 -0.504062,0.31154 -1.147185,-0.31581 -1.429162,-1.39409 -0.281976,-1.07827 -0.113285,-2.09594 0.374869,-2.26148 1.425025,-0.48323 -1.293549,-7.87711 -2.8962467,-7.87711 -1.0569334,0 -1.2776112,-0.70779 -0.806242,-2.58587 0.9110857,-3.63006 -0.3632755,-9.53597 -2.0576434,-9.53597 -0.7715444,0 -1.402808,-0.68185 -1.402808,-1.51522 0,-0.83338 0.4632291,-1.51523 1.0293979,-1.51523 0.9398628,0 0.7479402,-2.03837 -0.6909376,-7.33828 -0.2661533,-0.98034 -0.9057563,-1.52172 -1.4213402,-1.20307 -0.5155839,0.31864 -0.9374252,-0.3566 -0.9374252,-1.50056 0,-1.14396 0.4259896,-2.07992 0.9466436,-2.07992 1.3331556,0 0.00703,-7.27186 -1.623471,-8.90236 -1.5879632,-1.58797 -1.75688023,-3.21947 -0.3333252,-3.21947 0.5555839,0 1.0101526,-1.81828 1.0101526,-4.04061 0,-2.22234 -0.4545687,-4.04061 -1.0101526,-4.04061 -0.5555839,0 -1.0101525,-0.90914 -1.0101525,-2.02031 0,-1.11117 0.4545686,-2.0203 1.0101525,-2.0203 0.5555839,0 1.0101526,-1.81828 1.0101526,-4.04061 0,-2.22234 -0.4545687,-4.04061 -1.0101526,-4.04061 -0.5555839,0 -1.0101525,-0.90914 -1.0101525,-2.02031 0,-1.11117 0.4545686,-2.0203 1.0101525,-2.0203 0.5555839,0 1.0101526,-1.81828 1.0101526,-4.04062 0,-2.22233 -0.4545687,-4.04061 -1.0101526,-4.04061 -1.60292954,0 -1.1716108,-3.7625 0.5050763,-4.40591 1.7953287,-0.68892 2.1059988,-7.35063 0.369788,-7.92937 -0.7276797,-0.24256 -0.4774336,-1.04982 0.6861387,-2.2134 1.2683372,-1.26833 1.8535595,-3.42894 1.9030553,-7.02596 0.04373,-3.17803 0.6206359,-5.62441 1.4861752,-6.30215 0.8437165,-0.66065 1.4498042,-3.10689 1.5016768,-6.06092 0.047838,-2.72424 0.6031696,-5.40773 1.2340705,-5.96331 1.970778,-1.7355 3.453718,-7.38303 2.089639,-7.95804 -0.810426,-0.34162 -0.629559,-0.95681 0.567727,-1.93101 2.338218,-1.90256 5.070579,-8.51784 3.833884,-9.28216 -0.526358,-0.32531 -0.701949,-1.25615 -0.390205,-2.06854 0.311744,-0.8124 0.954385,-1.23754 1.428091,-0.94478 1.085744,0.67103 4.144165,-5.12227 3.915688,-7.41713 -0.303362,-3.04703 0.04125,-4.37056 0.985969,-3.7867 0.508131,0.31405 1.937489,-1.06908 3.176351,-3.07359 1.696817,-2.74551 1.94427,-3.83507 1.003101,-4.41674 -0.877863,-0.54256 -0.338256,-1.42093 1.81467,-2.953951 3.238912,-2.306309 4.377213,-4.543767 5.049973,-9.92628 0.08462,-0.677043 0.732396,-1.008982 1.439496,-0.737642 1.448885,0.555989 5.389259,-5.387601 4.941434,-7.45357 -0.159871,-0.737539 0.625311,-1.580515 1.744848,-1.873281 1.119538,-0.292765 2.852187,-1.734883 3.850332,-3.204707 1.733118,-2.55211 1.935802,-3.097023 2.203365,-5.923698 0.06408,-0.677044 0.70212,-1.006272 1.417854,-0.731619 1.675311,0.642877 7.217318,-5.098682 6.321134,-6.548739 -0.373698,-0.604655 0.144856,-1.391183 1.152342,-1.74784 2.724276,-0.964412 6.469685,-4.576766 7.492917,-7.226731 0.496429,-1.285655 1.38915,-2.031988 1.987907,-1.661936 1.347092,0.832549 5.887716,-3.270738 7.103466,-6.419285 0.495596,-1.283495 1.343664,-2.060099 1.884596,-1.725785 1.475488,0.911902 6.146672,-2.520595 7.199829,-5.290605 0.508335,-1.337023 1.48966,-2.226974 2.180721,-1.977669 1.948531,0.702947 6.922658,-2.547034 7.943314,-5.189979 0.607066,-1.571973 1.446829,-2.172364 2.482563,-1.774915 2.244254,0.8612 7.141812,-1.95409 7.803912,-4.485967 0.42286,-1.617015 1.06943,-1.990465 2.60329,-1.503635 2.58756,0.821258 8.20259,-2.016756 8.20259,-4.145845 0,-1.136468 0.62267,-1.444271 2.12625,-1.051076 2.66932,0.698043 8.98543,-2.226725 8.98543,-4.160838 0,-1.002551 0.69696,-1.263304 2.27284,-0.850328 2.94332,0.771328 8.83884,-1.361616 8.83884,-3.19781 0,-0.9811632 0.72347,-1.2402299 2.33439,-0.8359154 2.78764,0.6996514 10.0625,-1.1248836 9.31402,-2.3359548 -0.74661,-1.2080512 2.06178,-2.099416 3.15866,-1.0025359 1.00562,1.0056287 8.42644,-0.6765768 8.42644,-1.9101692 0,-0.4104156 2.43518,-0.7462102 5.41152,-0.7462102 3.91653,0 5.92732,-0.515779 7.27852,-1.8669783 1.17955,-1.17955286 2.00756,-1.44522459 2.24879,-0.7215376 0.58584,1.7575258 8.24477,1.4407102 8.93953,-0.36978793 0.64634,-1.68434257 3.39576,-2.09328347 3.39576,-0.50507627 0,0.5555839 2.04555,1.0101525 4.54568,1.0101525 2.50013,0 4.54569,-0.4545686 4.54569,-1.0101525 0,-0.5555839 0.68185,-1.01015255 1.51523,-1.01015255 0.83337,0 1.51523,0.45456865 1.51523,1.01015255 0,0.5555839 2.04555,1.0101525 4.54568,1.0101525 2.50013,0 4.54569,-0.4545686 4.54569,-1.0101525 0,-1.2630051 2.74131,-1.3402002 3.19882,-0.09007833 0.43879,1.19900333 6.87274,1.60666823 9.27749,0.58783635 1.08926,-0.46148869 2.14438,-0.34774814 2.52771,0.27248259 1.14397,1.85100169 8.32499,2.71760009 9.36945,1.13069899 0.75097,-1.14097507 1.19208,-1.0375921 2.41563,0.5661637 1.1493,1.506408 2.72823,1.9595092 6.79934,1.9511845 3.65018,-0.00746 5.67066,0.4828449 6.48415,1.5735069 0.79573,1.0668417 2.69295,1.5527102 5.80838,1.4874861 2.93213,-0.061387 4.62666,0.3390039 4.62666,1.0932061 0,1.5629247 7.23595,3.7885137 8.43124,2.5932267 1.13423,-1.134231 3.8848,-0.175356 3.10701,1.083135 -0.72134,1.167146 5.88281,3.988865 8.55846,3.656728 1.09976,-0.136517 2.0474,0.206357 2.10586,0.76194 0.14142,1.343894 6.91144,4.776421 8.04221,4.07756 1.22401,-0.756476 4.20606,0.490077 3.58323,1.497851 -0.27806,0.449914 1.17224,1.854967 3.22289,3.122339 2.64869,1.636977 3.84912,1.942295 4.14514,1.054268 0.50754,-1.522635 3.25067,0.397752 3.25067,2.275704 0,1.717517 5.61191,4.748688 7.47097,4.035303 1.08727,-0.41723 1.90183,0.20304 2.56816,1.955615 0.53671,1.411657 2.02038,3.160394 3.29703,3.886079 2.26645,1.28831 2.89773,1.478098 5.71227,1.717345 0.76994,0.06545 1.12202,0.76476 0.80325,1.595456 -0.61917,1.613509 4.77921,6.046814 7.40182,6.078596 0.84471,0.01024 1.53585,0.700466 1.53585,1.533842 0,1.873118 5.32737,6.52694 7.49736,6.549454 0.8767,0.0091 1.45962,0.647004 1.29536,1.417574 -0.37194,1.744822 3.57912,6.095788 6.59281,7.260099 1.23945,0.478851 2.04756,1.453401 1.79579,2.165667 -0.5867,1.65981 3.68288,6.531241 6.17029,7.040067 1.12833,0.230814 1.7828,1.087496 1.60871,2.105773 -0.3924,2.295159 3.90713,7.99273 5.55447,7.360583 1.19609,-0.458977 1.76782,0.690179 1.39576,2.805413 -0.27358,1.555397 4.07175,7.699376 5.28087,7.466773 0.6569,-0.126372 1.23901,0.930985 1.29358,2.349682 0.12584,3.2719 3.19774,8.027157 5.18555,8.027157 1.04473,0 1.3438,0.66181 0.96083,2.12625 -0.67458,2.57961 2.19967,8.98542 4.03171,8.98542 0.75725,0 1.23493,0.98956 1.1241,2.32866 -0.27432,3.31464 2.20549,8.78302 3.98295,8.78302 1.08648,0 1.33166,0.67946 0.88595,2.45528 -0.73881,2.94363 0.82753,7.48088 3.21485,9.31249 1.18481,0.90902 1.37715,1.57003 0.61183,2.10264 -1.40938,0.98081 0.74598,8.96309 2.33468,8.64636 0.64745,-0.12908 1.01099,1.86847 0.93177,5.1197 -0.096,3.93664 0.35207,5.8142 1.71249,7.17698 1.3319,1.33423 1.51137,2.05022 0.64771,2.584 -1.34682,0.83237 -0.38299,9.06957 1.06122,9.06957 0.4666,0 0.58573,2.54479 0.26471,5.65509 -0.41933,4.06302 -0.21515,5.88283 0.72526,6.46404 0.83313,0.5149 1.02097,1.4886 0.51677,2.67867 -1.01883,2.40475 -0.61117,8.83871 0.58784,9.2775 1.18644,0.4342 1.2041,3.19882 0.0204,3.19882 -1.38864,0 -1.94151,7.35207 -0.70498,9.37473 0.80313,1.31373 0.78571,1.99451 -0.0645,2.52538 -1.40629,0.87797 -1.94988,7.06888 -0.84888,9.66757 0.5175,1.22143 0.3033,2.17234 -0.61772,2.74247 -0.94347,0.58402 -1.39222,2.72248 -1.35646,6.46404 0.0294,3.07521 -0.29017,5.5913 -0.71013,5.5913 -1.54011,0 -2.88609,7.36041 -1.62406,8.88106 0.94214,1.1352 0.82108,1.71203 -0.57329,2.73161 -2.29147,1.67556 -4.10086,7.72571 -2.5898,8.6596 0.71634,0.44273 0.41389,1.33595 -0.8726,2.57703 -2.39171,2.30727 -4.53209,8.19668 -3.26379,8.98053 0.49814,0.30786 0.65064,1.22443 0.3389,2.03683 -0.31175,0.81239 -0.95094,1.23967 -1.42043,0.94951 -1.30187,-0.80461 -3.25995,3.56063 -3.3961,7.57106 -0.075,2.20854 -0.58838,3.48102 -1.34337,3.32955 -1.55501,-0.31197 -4.62157,5.51776 -3.89646,7.4074 0.7672,1.99927 -0.33288,4.41697 -1.7605,3.86914 -1.19142,-0.45718 -4.98343,5.4421 -4.64188,7.22146 0.41569,2.16567 -0.14118,3.37043 -1.34445,2.90868 -1.56955,-0.60229 -5.15996,5.16835 -4.41825,7.1012 0.55484,1.44589 -1.6419,3.9558 -2.61262,2.98509 -0.60801,-0.60801 -5.21196,5.45945 -5.40062,7.11737 -0.0645,0.56692 -0.18652,1.58472 -0.27115,2.26176 -0.0847,0.67704 -0.7842,0.9891 -1.55463,0.69346 -1.48167,-0.56857 -6.35201,5.30671 -5.28419,6.37453 0.95054,0.95053 -1.40091,3.25259 -2.78129,2.72289 -1.53502,-0.58905 -5.3551,3.42449 -5.85426,6.15072 -0.20344,1.11117 -1.12745,2.02605 -2.05335,2.03307 -2.21065,0.0168 -7.05786,4.60613 -6.47344,6.12912 0.63161,1.64594 -1.35022,3.41276 -3.08246,2.74804 -1.73752,-0.66674 -5.29872,2.37345 -6.51931,5.56553 -0.49078,1.2835 -1.35604,2.04705 -1.92279,1.69678 -1.58368,-0.97877 -8.27786,3.55353 -7.65313,5.18155 0.51682,1.34682 -0.52108,1.81939 -3.21551,1.46408 -1.85323,-0.24439 -7.30387,3.85878 -7.02652,5.28946 0.1287,0.6639 -0.68736,1.22359 -1.81347,1.24374 -3.56757,0.0638 -8.34715,2.5792 -8.89713,4.68233 -0.39229,1.50014 -1.06166,1.85954 -2.57108,1.38046 -2.42526,-0.76974 -7.69421,1.72534 -8.59377,4.06955 -0.39815,1.03756 -1.25712,1.41904 -2.29688,1.02005 -2.25588,-0.86566 -8.42362,1.27483 -8.42362,2.92337 0,1.67846 -2.77422,2.81876 -3.26628,1.34256 -0.52256,-1.56765 -7.49536,0.86364 -8.27056,2.8838 -0.41621,1.08462 -1.35486,1.38501 -3.02111,0.9668 -3.40791,-0.85532 -8.67554,0.37962 -8.67554,2.03391 0,1.5422 -2.59304,1.90381 -3.47055,0.48398 -0.71807,-1.16188 -7.99037,0.43749 -8.46511,1.8617 -0.40662,1.21986 -3.21663,1.46384 -3.21663,0.27928 0,-1.43534 -8.52974,0.005 -9.89507,1.67046 -0.9971,1.21656 -1.4791,1.31365 -1.86932,0.37654 -0.2892,-0.69448 -2.08508,-1.26269 -3.99086,-1.26269 -1.90579,0 -4.3819,0.56821 -5.50248,1.26269 -1.63887,1.01568 -2.19597,1.00806 -2.8479,-0.0389 -0.90833,-1.45878 -9.22941,-0.62421 -9.22941,0.92566 0,1.49199 -2.77903,0.97299 -3.39576,-0.63418 z"
       style="fill:#0000ff;fill-opacity:0.47673687;stroke:#000000;stroke-width:4.06606293;stroke-linejoin:round;stroke-miterlimit:4;stroke-dasharray:8.13212571, 4.06606286;stroke-dashoffset:0;stroke-opacity:1" />
  </g>
  <flowRoot
     xml:space="preserve"
     id="flowRoot819"
     style="font-style:normal;font-weight:normal;font-size:40px;line-height:1.25;font-family:sans-serif;letter-spacing:0px;word-spacing:0px;fill:#ffffff;fill-opacity:1;stroke:none;"
     transform="matrix(3.1400654,0,0,2.8737257,-248.93668,-122.07821)"><flowRegion
       id="flowRegion821"
       style="fill:#ffffff;"><rect
         id="rect823"
         width="250"
         height="276.27118"
         x="83.898308"
         y="37.288136"
         style="fill:#ffffff;" /></flowRegion><flowPara
       id="flowPara825">S</flowPara></flowRoot></svg>
