<?xml version="1.0" encoding="UTF-8" standalone="no"?>
<svg
   xmlns:dc="http://purl.org/dc/elements/1.1/"
   xmlns:cc="http://creativecommons.org/ns#"
   xmlns:rdf="http://www.w3.org/1999/02/22-rdf-syntax-ns#"
   xmlns:svg="http://www.w3.org/2000/svg"
   xmlns="http://www.w3.org/2000/svg"
   xml:space="preserve"
   enable-background="new 0 0 515 80"
   viewBox="0 0 80.170914 75.103111"
   height="75.103111"
   width="80.170914"
   y="0px"
   x="0px"
   id="Capa_1"
   version="1.1"><metadata
     id="metadata61"><rdf:RDF><cc:Work
         rdf:about=""><dc:format>image/svg+xml</dc:format><dc:type
           rdf:resource="http://purl.org/dc/dcmitype/StillImage" /><dc:title></dc:title></cc:Work></rdf:RDF></metadata><defs
     id="defs59" /><g
     transform="translate(-430.10634,-0.94107567)"
     id="g45"><path
       stroke-miterlimit="10"
       d="m 488.106,22.298 c 0,-5.502 -3.952,-9.455 -3.952,-9.455 l 0,-6.244 -3.838,4.468 c 0,0 -5.957,-2.063 -20.161,-0.115 L 456.204,7 l 0.057,6.703 c 0,0 -3.322,2.176 -4.01,7.907 -0.687,5.729 3.896,7.792 3.896,7.792 0,0 -9.852,29.098 14.09,46.167 0,0 22.452,-13.287 13.86,-46.397 0,-0.001 4.009,-1.374 4.009,-6.874 z m -26.919,6.301 c -3.543,0 -6.415,-2.872 -6.415,-6.416 0,-3.544 2.872,-6.418 6.415,-6.418 3.543,0 6.415,2.874 6.415,6.418 0,3.544 -2.873,6.416 -6.415,6.416 z m 9.164,6.762 -3.895,-7.334 3.665,-2.749 3.552,2.862 -3.322,7.221 z m 8.934,-6.762 c -3.543,0 -6.414,-2.872 -6.414,-6.416 0,-3.544 2.871,-6.418 6.414,-6.418 3.543,0 6.415,2.874 6.415,6.418 0,3.544 -2.872,6.416 -6.415,6.416 z"
       id="path47"
       style="fill:none;stroke:#211915;stroke-width:0.79729998;stroke-miterlimit:10" /><circle
       stroke-miterlimit="10"
       cx="463.936"
       cy="24.129999"
       r="2.5209999"
       id="circle49"
       style="fill:none;stroke:#211915;stroke-width:0.79729998;stroke-miterlimit:10" /><circle
       stroke-miterlimit="10"
       cx="476.53601"
       cy="24.129999"
       r="2.5209999"
       id="circle51"
       style="fill:none;stroke:#211915;stroke-width:0.79729998;stroke-miterlimit:10" /><path
       stroke-miterlimit="10"
       d="M 453.515,17.024 432.207,1.559 c 0,0 -10.774,25.092 21.873,44.57"
       id="path53"
       style="fill:none;stroke:#211915;stroke-width:0.79729998;stroke-miterlimit:10" /><path
       stroke-miterlimit="10"
       d="m 486.155,46.129 c 32.647,-19.478 22.1,-44.57 22.1,-44.57 l -21.308,15.465"
       id="path55"
       style="fill:none;stroke:#211915;stroke-width:0.79729998;stroke-miterlimit:10" /></g><path
     id="path4215"
     d="m 56.425252,42.083684 c 0,-3.010025 -0.378199,-6.414429 -1.145102,-10.307776 l -0.631935,-3.208157 0.576737,-0.396812 c 1.016305,-0.699247 2.011075,-1.885643 2.54827,-3.039148 0.439713,-0.944183 0.519918,-1.577881 0.505102,-3.990794 -0.01205,-1.963333 -0.140215,-3.185644 -0.406179,-3.873879 L 57.483578,16.261622 67.492607,9.0008397 c 5.504965,-3.9934301 10.114117,-7.3010336 10.24256,-7.35023 0.367927,-0.1409243 1.100064,3.14333 1.357229,6.0883236 C 79.772819,15.53096 77.572024,22.994227 72.47312,30.186023 69.570316,34.280311 62.957369,40.292974 57.936617,43.402995 l -1.511365,0.936188 0,-2.255499 z"
     style="fill:#336699;fill-opacity:1;stroke:#000000;stroke-width:0.24942465;stroke-opacity:0" /><path
     id="path4227"
     d="M 38.965526,73.108142 C 37.019661,71.626747 33.519548,68.043592 31.865389,65.839553 28.637628,61.538809 26.251377,55.918052 25.214535,50.173627 24.169697,44.384903 24.525317,36.123971 26.067445,30.36083 l 0.569685,-2.128988 -1.050542,-0.684481 c -1.340913,-0.873674 -2.48326,-2.598368 -2.831233,-4.274544 -0.628145,-3.02576 0.97333,-7.793644 3.265681,-9.722531 0.715019,-0.601648 0.722682,-0.636618 0.722682,-3.297707 l 0,-2.6896098 1.481121,1.4656654 1.48112,1.4656654 3.445016,-0.351062 c 4.824697,-0.4916581 12.870588,-0.431248 15.292688,0.11482 l 1.870685,0.421751 1.552204,-1.6909403 1.552205,-1.6909399 0.0067,2.3145156 0.0067,2.3145156 0.992521,1.255633 c 3.910504,4.947158 4.000684,11.319432 0.199677,14.109627 -0.817964,0.60044 -1.168892,1.0194 -1.085886,1.296396 0.847603,2.828501 1.641793,8.216334 1.806725,12.256929 0.451127,11.051909 -3.008071,21.019237 -9.883529,28.478376 -1.479996,1.605639 -4.180164,3.977079 -5.124302,4.500451 -0.137184,0.07605 -0.75451,-0.246259 -1.371836,-0.71623 l -2e-5,0 z M 42.30357,31.201154 c 1.054108,-2.286377 1.828625,-4.23161 1.721149,-4.322739 -0.107477,-0.09113 -1.052476,-0.854872 -2.099999,-1.697203 L 40.020132,23.6497 37.856717,25.281532 c -1.189879,0.897507 -2.128672,1.708002 -2.086207,1.8011 0.58876,1.290777 4.356902,8.26804 4.466964,8.271233 0.08225,0.0025 1.011988,-1.866335 2.066096,-4.152711 z m -8.168289,-3.775476 c 2.285275,-1.171511 3.587744,-3.187689 3.778814,-5.849475 0.109142,-1.520468 0.04354,-1.842136 -0.672193,-3.295998 -1.306025,-2.652914 -3.316047,-3.873674 -6.378136,-3.873674 -2.673106,0 -5.02856,1.600332 -6.177112,4.196825 -0.691105,1.562357 -0.543743,4.221442 0.32785,5.915916 0.672806,1.30801 2.447881,2.850982 3.81741,3.318261 1.236631,0.421934 4.112565,0.198591 5.303367,-0.411855 z m 17.352677,0.311535 c 1.5337,-0.522584 3.070824,-1.889956 3.871587,-3.444024 0.530788,-1.030124 0.659676,-1.624001 0.657047,-3.02748 -0.0039,-2.059591 -0.414317,-3.144861 -1.749569,-4.62595 -2.742295,-3.041807 -7.405933,-3.00567 -10.238104,0.07933 -2.38489,2.597791 -2.355642,6.465579 0.06919,9.149576 1.890821,2.092913 4.669419,2.79549 7.389851,1.868546 z"
     style="fill:#336699;fill-opacity:1;stroke:#000000;stroke-width:0.24942465;stroke-opacity:0" /><path
     id="path4229"
     d="M 20.486623,42.305103 C 13.832249,37.737412 8.9781683,32.776335 5.5126165,27.001042 1.3048928,19.988927 -0.13851828,10.875393 1.786018,3.4717205 2.0477671,2.4647744 2.2985755,1.6054756 2.3433701,1.5621675 2.408542,1.4991582 22.228862,15.794725 22.623546,16.189409 c 0.06007,0.06007 -0.125513,0.833969 -0.412408,1.719773 -0.347258,1.07218 -0.530037,2.319263 -0.546784,3.730664 -0.02135,1.799434 0.07421,2.333468 0.631815,3.530702 0.590182,1.267184 2.461192,3.453189 2.955598,3.453189 0.106629,0 -0.02205,0.842845 -0.285944,1.872989 -0.722815,2.821557 -1.201619,6.344642 -1.381027,10.16175 -0.08866,1.886274 -0.237582,3.429589 -0.330944,3.429589 -0.09336,0 -1.338615,-0.802332 -2.767229,-1.782962 z"
     style="fill:#336699;fill-opacity:1;stroke:#000000;stroke-width:0.24942465;stroke-opacity:0" /><path
     id="path4231"
     d="m 32.708296,24.812078 c -1.124997,-0.863745 -1.14385,-2.309014 -0.04143,-3.176177 0.845028,-0.664698 1.70309,-0.623507 2.443918,0.11732 0.81008,0.810081 0.825888,2.093188 0.03494,2.836243 -0.635077,0.596624 -1.810475,0.703975 -2.437429,0.222614 z"
     style="fill:#336699;fill-opacity:1;stroke:#000000;stroke-width:0.24942465;stroke-opacity:0" /><path
     id="path4233"
     d=""
     style="fill:#336699;fill-opacity:1;stroke:#000000;stroke-width:0.24942465;stroke-opacity:0" /><path
     id="path4235"
     d="m 45.065093,24.519567 c -1.041269,-1.041269 -0.737203,-2.560802 0.625367,-3.125197 1.354295,-0.560968 2.753203,0.462615 2.753203,2.014523 0,0.769017 -1.104751,1.722898 -1.995397,1.722898 -0.485972,0 -0.997254,-0.226305 -1.383173,-0.612224 z"
     style="fill:#336699;fill-opacity:1;stroke:#000000;stroke-width:0.24942465;stroke-opacity:0" /></svg>