<?xml version="1.0" encoding="UTF-8" standalone="no"?>
<!-- Created with Inkscape (http://www.inkscape.org/) -->

<svg
   xmlns:dc="http://purl.org/dc/elements/1.1/"
   xmlns:cc="http://creativecommons.org/ns#"
   xmlns:rdf="http://www.w3.org/1999/02/22-rdf-syntax-ns#"
   xmlns:svg="http://www.w3.org/2000/svg"
   xmlns="http://www.w3.org/2000/svg"
   xmlns:sodipodi="http://sodipodi.sourceforge.net/DTD/sodipodi-0.dtd"
   xmlns:inkscape="http://www.inkscape.org/namespaces/inkscape"
   width="400"
   height="400"
   viewBox="0 0 105.83333 105.83334"
   version="1.1"
   id="svg3821"
   inkscape:version="0.92.2 5c3e80d, 2017-08-06"
   sodipodi:docname="financial_situation_pia.svg">
  <defs
     id="defs3815" />
  <sodipodi:namedview
     id="base"
     pagecolor="#ffffff"
     bordercolor="#666666"
     borderopacity="1.0"
     inkscape:pageopacity="0.0"
     inkscape:pageshadow="2"
     inkscape:zoom="0.98994949"
     inkscape:cx="250.00211"
     inkscape:cy="199.00727"
     inkscape:document-units="mm"
     inkscape:current-layer="layer1"
     showgrid="false"
     units="px"
     inkscape:window-width="1366"
     inkscape:window-height="683"
     inkscape:window-x="0"
     inkscape:window-y="20"
     inkscape:window-maximized="1" />
  <metadata
     id="metadata3818">
    <rdf:RDF>
      <cc:Work
         rdf:about="">
        <dc:format>image/svg+xml</dc:format>
        <dc:type
           rdf:resource="http://purl.org/dc/dcmitype/StillImage" />
        <dc:title />
      </cc:Work>
    </rdf:RDF>
  </metadata>
  <g
     inkscape:label="Capa 1"
     inkscape:groupmode="layer"
     id="layer1"
     transform="translate(0,-191.16665)">
    <flowRoot
       xml:space="preserve"
       id="flowRoot850"
       style="fill:black;fill-opacity:1;stroke:none;font-family:sans-serif;font-style:normal;font-weight:normal;font-size:40px;line-height:1.25;letter-spacing:0px;word-spacing:0px"><flowRegion
         id="flowRegion852"><rect
           id="rect854"
           width="257.5889"
           height="241.42645"
           x="52.527931"
           y="91.903473" /></flowRegion><flowPara
         id="flowPara856" /></flowRoot>    <rect
       style="fill:#0000ff;fill-rule:evenodd;stroke-width:0.26458332"
       id="rect817"
       width="105.83874"
       height="106.37327"
       x="0.26726952"
       y="190.89398" />
    <text
       xml:space="preserve"
       style="font-style:normal;font-weight:normal;font-size:79.4185791px;line-height:1.25;font-family:sans-serif;letter-spacing:0px;word-spacing:0px;fill:#008000;fill-opacity:1;stroke:none;stroke-width:0.41363844"
       x="36.726181"
       y="211.14685"
       id="text861"
       transform="scale(0.75144956,1.3307613)"><tspan
         sodipodi:role="line"
         id="tspan859"
         x="36.726181"
         y="211.14685"
         style="fill:#008000;stroke-width:0.41363844">P</tspan></text>
  </g>
</svg>
