{'controls': 
	[ 
		{'name': 'rows', 
		 'definition': {'type': 'error', 'interval': {'ok': [-0.2,0.2], 'warn': [[-0.5,-0.2],[0.2,0.5]]}},
		 'subcontrols': 
			[
				{'name': 'last_duration_seconds', 'definition': {'type': 'warning', 'interval': {'ok': [-0.1,0.1]}}, 'subcontrols': []}
			]
		}
	]
}
