<svg width="478" height="575" viewBox="0 0 478 575" fill="none" xmlns="http://www.w3.org/2000/svg">
<path d="M2.37571e-06 0L423.147 110.5L451.553 110.5L472.123 129.636L478 151.715L472.123 175.267L451.553 184.59L4.7875e-06 575L2.37571e-06 0Z" fill="url(#paint0_linear_1446_12568)"/>
<defs>
<linearGradient id="paint0_linear_1446_12568" x1="14.6924" y1="145.828" x2="473.592" y2="145.828" gradientUnits="userSpaceOnUse">
<stop offset="0.0779266" stop-color="white"/>
<stop offset="1" stop-color="#1B24FC" stop-opacity="0"/>
</linearGradient>
</defs>
</svg>
