<svg width="57" height="66" viewBox="0 0 57 66" fill="none" xmlns="http://www.w3.org/2000/svg">
<path d="M1 26.2632L7.34615 31.3158V46.4737L11.5769 65H17.9231L24.2692 46.4737H32.7308L39.0769 65H45.4231L49.6538 46.4737V31.3158L56 26.2632V9.42105L47.5385 1H9.46154L1 9.42105V26.2632Z" stroke="white"/>
<path d="M19.1026 14H28.3333H37.5641L41.6667 19.1852V29.5556L38.5897 32.6667L30.3846 29.5556H28.3333H26.2821L18.0769 32.6667L15 29.5556V19.1852L19.1026 14Z" fill="white"/>
</svg>
