<svg width="142" height="141" viewBox="0 0 142 141" fill="none" xmlns="http://www.w3.org/2000/svg">
<path d="M130.692 0.97995L136.328 11.0581L124.782 10.8999L130.692 0.97995ZM0.764648 137.141C2.10668 137.141 3.44388 137.119 4.77596 137.076L4.84047 139.075C3.4869 139.119 2.12819 139.141 0.764648 139.141V137.141ZM12.7597 136.56C15.4286 136.3 18.0738 135.954 20.693 135.525L21.0164 137.498C18.3544 137.934 15.666 138.286 12.9536 138.55L12.7597 136.56ZM28.5477 133.972C31.156 133.367 33.7347 132.678 36.2812 131.909L36.8594 133.824C34.2714 134.606 31.6505 135.305 28.9996 135.92L28.5477 133.972ZM43.8626 129.348C46.3658 128.41 48.8335 127.393 51.263 126.3L52.0838 128.124C49.6153 129.235 47.1078 130.268 44.564 131.221L43.8626 129.348ZM58.4547 122.783C60.8146 121.533 63.1333 120.21 65.408 118.815L66.4535 120.52C64.1431 121.937 61.7878 123.281 59.3903 124.55L58.4547 122.783ZM72.099 114.418C74.2819 112.884 76.418 111.281 78.5046 109.613L79.7534 111.175C77.6348 112.869 75.4657 114.496 73.249 116.054L72.099 114.418ZM84.6031 104.424C86.5803 102.635 88.5056 100.784 90.3764 98.8733L91.8054 100.273C89.9065 102.212 87.9522 104.091 85.945 105.907L84.6031 104.424ZM95.807 92.9844C97.5543 90.9723 99.2451 88.9045 100.877 86.7838L102.462 88.0034C100.806 90.1553 99.0904 92.2537 97.3171 94.2958L95.807 92.9844ZM105.572 80.295C107.069 78.0919 108.506 75.8396 109.879 73.5408L111.596 74.5666C110.203 76.8988 108.745 79.1839 107.226 81.4193L105.572 80.295ZM113.788 66.5455C115.018 64.1845 116.184 61.7809 117.284 59.3371L119.108 60.1576C117.993 62.6365 116.81 65.0748 115.561 67.4699L113.788 66.5455ZM120.358 51.9413C121.309 49.4563 122.191 46.9349 123.005 44.3797L124.91 44.9861C124.086 47.5778 123.19 50.1351 122.226 52.6557L120.358 51.9413ZM125.216 36.6773C125.877 34.1009 126.468 31.4941 126.987 28.8593L128.949 29.2459C128.423 31.9178 127.823 34.5614 127.153 37.1743L125.216 36.6773ZM128.314 20.9582C128.68 18.3283 128.975 15.6738 129.197 12.9971L131.19 13.1621C130.965 15.8759 130.666 18.5673 130.295 21.234L128.314 20.9582ZM130.692 0.97995L141.964 21.1362L118.872 20.8199L130.692 0.97995ZM0.764648 136.141C2.09592 136.141 3.42237 136.12 4.7437 136.077L4.87272 140.075C3.50841 140.119 2.13895 140.141 0.764648 140.141V136.141ZM12.6627 135.564C15.3099 135.306 17.9335 134.963 20.5312 134.538L21.1781 138.485C18.4947 138.925 15.7847 139.279 13.0506 139.546L12.6627 135.564ZM28.3217 132.998C30.9087 132.398 33.4664 131.715 35.9921 130.952L37.1485 134.781C34.5397 135.569 31.8978 136.274 29.2255 136.894L28.3217 132.998ZM43.5119 128.411C45.9949 127.481 48.4427 126.473 50.8527 125.388L52.4942 129.036C50.0062 130.156 47.4788 131.197 44.9148 132.157L43.5119 128.411ZM57.9869 121.899C60.3281 120.659 62.6284 119.346 64.8853 117.963L66.9763 121.372C64.648 122.8 62.2744 124.155 59.8582 125.434L57.9869 121.899ZM71.524 113.6C73.6899 112.077 75.8095 110.487 77.8802 108.832L80.3779 111.956C78.2432 113.663 76.0577 115.302 73.824 116.872L71.524 113.6ZM83.9322 103.682C85.8944 101.907 87.8052 100.07 89.6619 98.1737L92.5199 100.972C90.607 102.926 88.6381 104.819 86.616 106.648L83.9322 103.682ZM95.052 92.3288C96.7863 90.3316 98.4646 88.2791 100.084 86.174L103.254 88.6131C101.587 90.7807 99.8584 92.8945 98.0722 94.9515L95.052 92.3288ZM104.745 79.7328C106.231 77.5458 107.657 75.31 109.021 73.0279L112.455 75.0795C111.051 77.4284 109.583 79.73 108.053 81.9814L104.745 79.7328ZM112.901 66.0833C114.123 63.7394 115.28 61.3531 116.372 58.9269L120.02 60.5679C118.897 63.0643 117.705 65.52 116.448 67.9321L112.901 66.0833ZM119.424 51.5841C120.368 49.1169 121.244 46.6135 122.052 44.0764L125.863 45.2893C125.033 47.8992 124.131 50.4745 123.16 53.0129L119.424 51.5841ZM124.247 36.4288C124.903 33.8706 125.491 31.2822 126.006 28.666L129.93 29.4392C129.4 32.1296 128.797 34.7916 128.122 37.4228L124.247 36.4288ZM127.324 20.8203C127.687 18.2087 127.98 15.5727 128.2 12.9145L132.186 13.2446C131.96 15.9769 131.659 18.6868 131.285 21.3719L127.324 20.8203Z" fill="#1B24FC"/>
</svg>
