{
    "name": "Gloxinia.Xbagger.Core",
    "rootNamespace": "Gloxinia.Xbagger.Core",
    "references": [
        "GUID:175d04d68d525f84e8846524f0748694",
        "GUID:00c8965f570c79b42b914091c60e9f77",
        "GUID:6055be8ebefd69e48b49212b09b47b2f"
    ],
    "includePlatforms": [],
    "excludePlatforms": [],
    "allowUnsafeCode": false,
    "overrideReferences": false,
    "precompiledReferences": [],
    "autoReferenced": false,
    "defineConstraints": [],
    "versionDefines": [],
    "noEngineReferences": false
}