%YAML 1.1
%TAG !u! tag:unity3d.com,2011:
--- !u!114 &11400000
MonoBehaviour:
  m_ObjectHideFlags: 0
  m_CorrespondingSourceObject: {fileID: 0}
  m_PrefabInstance: {fileID: 0}
  m_PrefabAsset: {fileID: 0}
  m_GameObject: {fileID: 0}
  m_Enabled: 1
  m_EditorHideFlags: 0
  m_Script: {fileID: 11500000, guid: 27801262c03faae43a71eaac15fa345f, type: 3}
  m_Name: EDIS
  m_EditorClassIdentifier: 
  m_tickerSymbol: EDIS
  m_companyIconSprite: {fileID: 21300000, guid: 1a77f14530a610c458204303033b7ab8, type: 3}
  m_firstPriceRangeMin: 300
  m_firstPriceRangeMax: 500
  m_priceMovementType: 2
  m_priceMovementIntensity: 5
  m_priceMovementFluency: 1
