%YAML 1.1
%TAG !u! tag:unity3d.com,2011:
--- !u!114 &11400000
MonoBehaviour:
  m_ObjectHideFlags: 0
  m_CorrespondingSourceObject: {fileID: 0}
  m_PrefabInstance: {fileID: 0}
  m_PrefabAsset: {fileID: 0}
  m_GameObject: {fileID: 0}
  m_Enabled: 1
  m_EditorHideFlags: 0
  m_Script: {fileID: 11500000, guid: 27801262c03faae43a71eaac15fa345f, type: 3}
  m_Name: AIR
  m_EditorClassIdentifier: 
  m_tickerSymbol: AIR
  m_companyIconSprite: {fileID: 21300000, guid: cc7832baf7336de4d83a9f5c9160836b, type: 3}
  m_firstPriceRangeMin: 200
  m_firstPriceRangeMax: 300
  m_priceMovementType: 2
  m_priceMovementIntensity: 3
  m_priceMovementFluency: 2
