{
    "name": "GV Input Actions",
    "maps": [
        {
            "name": "LeftHand",
            "id": "512659c4-cf86-44c6-a071-0e839b703a3f",
            "actions": [
                {
                    "name": "Lever (Clutch)",
                    "type": "Value",
                    "id": "8e158c86-8d93-4a7d-8a91-1e1705f238f2",
                    "expectedControlType": "Axis",
                    "processors": "",
                    "interactions": "",
                    "initialStateCheck": true
                },
                {
                    "name": "Scene Reset",
                    "type": "Button",
                    "id": "f4e12334-ae2a-483f-a1c3-418ff87e2bb2",
                    "expectedControlType": "Button",
                    "processors": "",
                    "interactions": "",
                    "initialStateCheck": false
                },
                {
                    "name": "Camera Reset",
                    "type": "Button",
                    "id": "c4ec230a-7ba9-4537-b982-d05040db7661",
                    "expectedControlType": "Button",
                    "processors": "",
                    "interactions": "",
                    "initialStateCheck": false
                }
            ],
            "bindings": [
                {
                    "name": "",
                    "id": "5b5be383-0600-4a9d-b731-f61b78635361",
                    "path": "<XRController>{LeftHand}/trigger",
                    "interactions": "",
                    "processors": "",
                    "groups": "",
                    "action": "Lever (Clutch)",
                    "isComposite": false,
                    "isPartOfComposite": false
                },
                {
                    "name": "",
                    "id": "461fd142-ed70-421d-ba86-37ef657c751c",
                    "path": "<XRController>{LeftHand}/secondaryButton",
                    "interactions": "",
                    "processors": "",
                    "groups": "",
                    "action": "Camera Reset",
                    "isComposite": false,
                    "isPartOfComposite": false
                },
                {
                    "name": "",
                    "id": "f9bd98b2-e3e1-49a0-80de-4ebdb5c8e409",
                    "path": "<XRController>{LeftHand}/primaryButton",
                    "interactions": "",
                    "processors": "",
                    "groups": "",
                    "action": "Scene Reset",
                    "isComposite": false,
                    "isPartOfComposite": false
                }
            ]
        },
        {
            "name": "RightHand",
            "id": "8dd7d9be-18f0-4250-b6fb-707812cf4635",
            "actions": [
                {
                    "name": "Lever (Hand Brake)",
                    "type": "Value",
                    "id": "0e22d43c-6728-411c-8572-51f92ff9c1b1",
                    "expectedControlType": "Axis",
                    "processors": "",
                    "interactions": "",
                    "initialStateCheck": true
                }
            ],
            "bindings": [
                {
                    "name": "",
                    "id": "51d675a1-8c4d-4d27-af5a-88611c1d59cc",
                    "path": "<XRController>{RightHand}/trigger",
                    "interactions": "",
                    "processors": "",
                    "groups": "",
                    "action": "Lever (Hand Brake)",
                    "isComposite": false,
                    "isPartOfComposite": false
                }
            ]
        }
    ],
    "controlSchemes": []
}