%YAML 1.1
%TAG !u! tag:unity3d.com,2011:
--- !u!74 &7400000
AnimationClip:
  m_ObjectHideFlags: 0
  m_CorrespondingSourceObject: {fileID: 0}
  m_PrefabInstance: {fileID: 0}
  m_PrefabAsset: {fileID: 0}
  m_Name: Egg
  serializedVersion: 6
  m_Legacy: 0
  m_Compressed: 0
  m_UseHighQualityCurve: 1
  m_RotationCurves: []
  m_CompressedRotationCurves: []
  m_EulerCurves: []
  m_PositionCurves: []
  m_ScaleCurves: []
  m_FloatCurves: []
  m_PPtrCurves:
  - curve:
    - time: 0
      value: {fileID: 21300000, guid: 5b374523c86e6b248a4fa34ade1f454d, type: 3}
    - time: 1
      value: {fileID: 21300000, guid: 52248fdcc95e5ce4e9868b68c6a6b762, type: 3}
    - time: 1.0833334
      value: {fileID: 21300000, guid: eafca083760a022408b8ca7a58b68abf, type: 3}
    - time: 1.1666666
      value: {fileID: 21300000, guid: 52248fdcc95e5ce4e9868b68c6a6b762, type: 3}
    - time: 1.25
      value: {fileID: 21300000, guid: 5b374523c86e6b248a4fa34ade1f454d, type: 3}
    - time: 2
      value: {fileID: 21300000, guid: 52248fdcc95e5ce4e9868b68c6a6b762, type: 3}
    - time: 2.0833333
      value: {fileID: 21300000, guid: eafca083760a022408b8ca7a58b68abf, type: 3}
    - time: 2.1666667
      value: {fileID: 21300000, guid: 52248fdcc95e5ce4e9868b68c6a6b762, type: 3}
    - time: 2.25
      value: {fileID: 21300000, guid: 5b374523c86e6b248a4fa34ade1f454d, type: 3}
    - time: 3
      value: {fileID: 21300000, guid: 52248fdcc95e5ce4e9868b68c6a6b762, type: 3}
    - time: 3.0833333
      value: {fileID: 21300000, guid: eafca083760a022408b8ca7a58b68abf, type: 3}
    - time: 3.1666667
      value: {fileID: 21300000, guid: 52248fdcc95e5ce4e9868b68c6a6b762, type: 3}
    - time: 3.25
      value: {fileID: 21300000, guid: 5b374523c86e6b248a4fa34ade1f454d, type: 3}
    - time: 4
      value: {fileID: 21300000, guid: 94634d4a7855b184f88b09e6ddccafc8, type: 3}
    - time: 4.0833335
      value: {fileID: 21300000, guid: 5b374523c86e6b248a4fa34ade1f454d, type: 3}
    - time: 4.1666665
      value: {fileID: 21300000, guid: 94634d4a7855b184f88b09e6ddccafc8, type: 3}
    - time: 4.25
      value: {fileID: 21300000, guid: 5b374523c86e6b248a4fa34ade1f454d, type: 3}
    - time: 4.3333335
      value: {fileID: 21300000, guid: 94634d4a7855b184f88b09e6ddccafc8, type: 3}
    - time: 4.983333
      value: {fileID: 21300000, guid: 94634d4a7855b184f88b09e6ddccafc8, type: 3}
    attribute: m_Sprite
    path: 
    classID: 212
    script: {fileID: 0}
  m_SampleRate: 60
  m_WrapMode: 0
  m_Bounds:
    m_Center: {x: 0, y: 0, z: 0}
    m_Extent: {x: 0, y: 0, z: 0}
  m_ClipBindingConstant:
    genericBindings:
    - serializedVersion: 2
      path: 0
      attribute: 0
      script: {fileID: 0}
      typeID: 212
      customType: 23
      isPPtrCurve: 1
    pptrCurveMapping:
    - {fileID: 21300000, guid: 5b374523c86e6b248a4fa34ade1f454d, type: 3}
    - {fileID: 21300000, guid: 52248fdcc95e5ce4e9868b68c6a6b762, type: 3}
    - {fileID: 21300000, guid: eafca083760a022408b8ca7a58b68abf, type: 3}
    - {fileID: 21300000, guid: 52248fdcc95e5ce4e9868b68c6a6b762, type: 3}
    - {fileID: 21300000, guid: 5b374523c86e6b248a4fa34ade1f454d, type: 3}
    - {fileID: 21300000, guid: 52248fdcc95e5ce4e9868b68c6a6b762, type: 3}
    - {fileID: 21300000, guid: eafca083760a022408b8ca7a58b68abf, type: 3}
    - {fileID: 21300000, guid: 52248fdcc95e5ce4e9868b68c6a6b762, type: 3}
    - {fileID: 21300000, guid: 5b374523c86e6b248a4fa34ade1f454d, type: 3}
    - {fileID: 21300000, guid: 52248fdcc95e5ce4e9868b68c6a6b762, type: 3}
    - {fileID: 21300000, guid: eafca083760a022408b8ca7a58b68abf, type: 3}
    - {fileID: 21300000, guid: 52248fdcc95e5ce4e9868b68c6a6b762, type: 3}
    - {fileID: 21300000, guid: 5b374523c86e6b248a4fa34ade1f454d, type: 3}
    - {fileID: 21300000, guid: 94634d4a7855b184f88b09e6ddccafc8, type: 3}
    - {fileID: 21300000, guid: 5b374523c86e6b248a4fa34ade1f454d, type: 3}
    - {fileID: 21300000, guid: 94634d4a7855b184f88b09e6ddccafc8, type: 3}
    - {fileID: 21300000, guid: 5b374523c86e6b248a4fa34ade1f454d, type: 3}
    - {fileID: 21300000, guid: 94634d4a7855b184f88b09e6ddccafc8, type: 3}
    - {fileID: 21300000, guid: 94634d4a7855b184f88b09e6ddccafc8, type: 3}
  m_AnimationClipSettings:
    serializedVersion: 2
    m_AdditiveReferencePoseClip: {fileID: 0}
    m_AdditiveReferencePoseTime: 0
    m_StartTime: 0
    m_StopTime: 5
    m_OrientationOffsetY: 0
    m_Level: 0
    m_CycleOffset: 0
    m_HasAdditiveReferencePose: 0
    m_LoopTime: 0
    m_LoopBlend: 0
    m_LoopBlendOrientation: 0
    m_LoopBlendPositionY: 0
    m_LoopBlendPositionXZ: 0
    m_KeepOriginalOrientation: 0
    m_KeepOriginalPositionY: 1
    m_KeepOriginalPositionXZ: 0
    m_HeightFromFeet: 0
    m_Mirror: 0
  m_EditorCurves: []
  m_EulerEditorCurves: []
  m_HasGenericRootTransform: 0
  m_HasMotionFloatCurves: 0
  m_Events: []
