<svg width="28" height="28" viewBox="0 0 28 28" fill="none" xmlns="http://www.w3.org/2000/svg">
<path fill-rule="evenodd" clip-rule="evenodd" d="M26.8334 14.0003V12.9503C26.8334 12.2503 26.3667 11.7837 25.6667 11.7837C24.9667 11.7837 24.5001 12.2503 24.5001 12.9503V14.0003C24.5001 19.8337 19.8334 24.5003 14.0001 24.5003C8.16675 24.5003 3.50008 19.8337 3.50008 14.0003C3.50008 8.16699 8.16675 3.50033 14.0001 3.50033C15.5167 3.50033 16.9167 3.85033 18.3167 4.43366C18.9001 4.66699 19.6001 4.43366 19.8334 3.85033C20.0667 3.26699 19.8334 2.56699 19.2501 2.33366C17.6167 1.51699 15.7501 1.16699 14.0001 1.16699C6.88341 1.16699 1.16675 6.88366 1.16675 14.0003C1.16675 21.117 6.88341 26.8337 14.0001 26.8337C21.1167 26.8337 26.8334 21.117 26.8334 14.0003ZM26.0168 2.68409C26.4835 2.21743 27.1835 2.21743 27.6501 2.68409C28.1168 3.15076 28.1168 3.85076 27.6501 4.31743L14.8168 17.1508C14.5835 17.3841 14.2335 17.5008 14.0001 17.5008C13.7668 17.5008 13.4168 17.3841 13.1835 17.1508L9.68346 13.6508C9.21679 13.1841 9.21679 12.4841 9.68346 12.0174C10.1501 11.5508 10.8501 11.5508 11.3168 12.0174L14.0001 14.7008L26.0168 2.68409Z" fill="black"/>
<mask id="mask0" mask-type="alpha" maskUnits="userSpaceOnUse" x="1" y="1" width="28" height="26">
<path fill-rule="evenodd" clip-rule="evenodd" d="M26.8334 14.0003V12.9503C26.8334 12.2503 26.3667 11.7837 25.6667 11.7837C24.9667 11.7837 24.5001 12.2503 24.5001 12.9503V14.0003C24.5001 19.8337 19.8334 24.5003 14.0001 24.5003C8.16675 24.5003 3.50008 19.8337 3.50008 14.0003C3.50008 8.16699 8.16675 3.50033 14.0001 3.50033C15.5167 3.50033 16.9167 3.85033 18.3167 4.43366C18.9001 4.66699 19.6001 4.43366 19.8334 3.85033C20.0667 3.26699 19.8334 2.56699 19.2501 2.33366C17.6167 1.51699 15.7501 1.16699 14.0001 1.16699C6.88341 1.16699 1.16675 6.88366 1.16675 14.0003C1.16675 21.117 6.88341 26.8337 14.0001 26.8337C21.1167 26.8337 26.8334 21.117 26.8334 14.0003ZM26.0168 2.68409C26.4835 2.21743 27.1835 2.21743 27.6501 2.68409C28.1168 3.15076 28.1168 3.85076 27.6501 4.31743L14.8168 17.1508C14.5835 17.3841 14.2335 17.5008 14.0001 17.5008C13.7668 17.5008 13.4168 17.3841 13.1835 17.1508L9.68346 13.6508C9.21679 13.1841 9.21679 12.4841 9.68346 12.0174C10.1501 11.5508 10.8501 11.5508 11.3168 12.0174L14.0001 14.7008L26.0168 2.68409Z" fill="white"/>
</mask>
<g mask="url(#mask0)">
<rect width="28" height="28" fill="#1C1C1C"/>
</g>
</svg>

