<svg width="33" height="33" viewBox="0 0 33 33" fill="none" xmlns="http://www.w3.org/2000/svg">
<path d="M29.9444 7.79167H5.66798C5.14017 7.79167 4.73611 7.40178 4.73611 6.95139C4.73611 6.501 5.14017 6.11111 5.66798 6.11111H26.0484C26.9766 6.11111 27.729 5.3587 27.729 4.43056C27.729 3.50241 26.9766 2.75 26.0484 2.75H5.66798C3.31019 2.75 1.375 4.61734 1.375 6.95139C1.375 9.28544 3.31019 11.1528 5.66798 11.1528H29.9444C30.8726 11.1528 31.625 10.4004 31.625 9.47222C31.625 8.54408 30.8726 7.79167 29.9444 7.79167Z" fill="#C4C4C4"/>
<path d="M28.2639 26.2778H6.41667C5.48852 26.2778 4.73611 25.5254 4.73611 24.5972V6.95139C4.73611 6.02324 3.9837 5.27083 3.05556 5.27083C2.12741 5.27083 1.375 6.02324 1.375 6.95139L1.375 24.5972C1.375 27.3817 3.63223 29.6389 6.41667 29.6389H29.9444C30.8726 29.6389 31.625 28.8865 31.625 27.9583V9.47222C31.625 8.54408 30.8726 7.79167 29.9444 7.79167C29.0163 7.79167 28.2639 8.54408 28.2639 9.47222V26.2778Z" fill="#C4C4C4"/>
</svg>
