<svg width="47" height="47" viewBox="0 0 47 47" fill="none" xmlns="http://www.w3.org/2000/svg">
<path fill-rule="evenodd" clip-rule="evenodd" d="M35.6869 11.1408C39.0462 14.4491 40.7259 18.7944 40.7259 23.1401H47C47 17.2181 44.7059 11.2962 40.1177 6.77773L40.1173 6.77734C35.5295 2.25886 29.5158 0 23.5029 0V6.1784C27.9153 6.1784 32.328 7.83253 35.6869 11.1408Z" fill="white"/>
<path fill-rule="evenodd" clip-rule="evenodd" d="M3.16857 34.7338L8.59755 31.6381C6.38374 27.8716 5.62714 23.2741 6.85877 18.7479C8.08649 14.236 11.0608 10.6354 14.8736 8.46134L11.7301 3.11444C6.53412 6.07714 2.48324 10.9882 0.806331 17.1508C-0.875664 23.3327 0.150764 29.6006 3.16857 34.7338Z" fill="white"/>
<path fill-rule="evenodd" clip-rule="evenodd" d="M12.0491 43.3385C17.2012 46.1727 23.4334 47.1149 29.5841 45.4916C35.8418 43.8402 40.8286 39.8509 43.837 34.7338L38.4076 31.6381C36.2001 35.3929 32.544 38.3221 27.9624 39.5311C23.4592 40.7194 18.8879 40.0252 15.1076 37.9453L12.0491 43.3385Z" fill="white"/>
</svg>
