<svg width="24" height="24" viewBox="0 0 24 24" fill="none" xmlns="http://www.w3.org/2000/svg">
<path fill-rule="evenodd" clip-rule="evenodd" d="M3 6C3 6.6 3.4 7 4 7L20 7C20.6 7 21 6.6 21 6C21 5.4 20.6 5 20 5L4 5C3.4 5 3 5.4 3 6ZM9 12C9 11.4 9.4 11 10 11H20C20.6 11 21 11.4 21 12C21 12.6 20.6 13 20 13H10C9.4 13 9 12.6 9 12ZM16 19C15.4 19 15 18.6 15 18C15 17.4 15.4 17 16 17H20C20.6 17 21 17.4 21 18C21 18.6 20.6 19 20 19H16Z" fill="black"/>
<mask id="mask0" mask-type="alpha" maskUnits="userSpaceOnUse" x="3" y="5" width="18" height="14">
<path fill-rule="evenodd" clip-rule="evenodd" d="M3 6C3 6.6 3.4 7 4 7L20 7C20.6 7 21 6.6 21 6C21 5.4 20.6 5 20 5L4 5C3.4 5 3 5.4 3 6ZM9 12C9 11.4 9.4 11 10 11H20C20.6 11 21 11.4 21 12C21 12.6 20.6 13 20 13H10C9.4 13 9 12.6 9 12ZM16 19C15.4 19 15 18.6 15 18C15 17.4 15.4 17 16 17H20C20.6 17 21 17.4 21 18C21 18.6 20.6 19 20 19H16Z" fill="white"/>
</mask>
<g mask="url(#mask0)">
<rect y="24" width="24" height="24" transform="rotate(-90 0 24)" fill="#1C1C1C"/>
</g>
</svg>

