<svg width="48" height="48" viewBox="0 0 48 48" fill="none" xmlns="http://www.w3.org/2000/svg">
<path d="M19.3287 14.5052C18.5032 13.7713 17.239 13.8457 16.5052 14.6713C15.7714 15.4968 15.8457 16.761 16.6713 17.4948L22.627 22.7888L31.4591 13.3679C32.2145 12.562 32.1737 11.2964 31.3679 10.5409C30.5621 9.78546 29.2964 9.82628 28.5409 10.6321L22.373 17.2112L19.3287 14.5052Z" fill="#C4C4C4"/>
<path fill-rule="evenodd" clip-rule="evenodd" d="M40 15.9667C40 7.18503 32.8 0 24 0C15.2 0 8 7.18503 8 15.9667C8 21.1559 10.4 25.7464 14.2 28.5405L12 45.7048C11.8 46.5031 12.2 47.3015 12.8 47.7006C13.4 48.0998 14.2 48.0998 15 47.7006L24 42.3119L33 47.7006C33.2 47.9002 33.6 47.9002 34 47.9002C34.4 47.9002 34.8 47.7006 35 47.501C35.6 47.1019 36 46.3035 35.8 45.5052L33.6 28.5405C37.6 25.7464 40 21.1559 40 15.9667ZM12 15.9667C12 9.38038 17.4 3.9916 24 3.9916C30.6 3.9916 36 9.38038 36 15.9667C36 22.5529 30.6 27.9417 24 27.9417C17.4 27.9417 12 22.5529 12 15.9667ZM16.5052 14.6713C17.239 13.8457 18.5032 13.7713 19.3287 14.5052L22.373 17.2112L28.5409 10.6321C29.2964 9.82628 30.5621 9.78546 31.3679 10.5409C32.1737 11.2964 32.2145 12.562 31.4591 13.3679L22.627 22.7888L16.6713 17.4948C15.8457 16.761 15.7714 15.4968 16.5052 14.6713ZM25.0001 38.3201L31.4001 42.1122L30.0001 30.7359C28.2001 31.5342 26.2001 31.9334 24.0001 31.9334C21.8001 31.9334 19.8001 31.5342 18.0001 30.7359L16.6001 42.1122L23.0001 38.3201C23.6001 37.9209 24.4001 37.9209 25.0001 38.3201Z" fill="#C4C4C4"/>
</svg>
