<?xml version="1.0" encoding="UTF-8"?>
<svg xmlns="http://www.w3.org/2000/svg">
<rect width="21" height="15" fill="#009246"/>
<rect width="14" height="15" fill="#fff"/>
<rect width="7" height="15" fill="#ce2b37"/>
</svg>
