<svg width="102" height="100" viewBox="0 0 102 100" fill="none" xmlns="http://www.w3.org/2000/svg">
<g clip-path="url(#clip0)">
<path d="M10.5099 46.51C10.2476 46.5089 9.9962 46.4047 9.80994 46.22L0.289939 36.71C0.196211 36.617 0.121816 36.5064 0.0710475 36.3846C0.0202789 36.2627 -0.00585938 36.132 -0.00585938 36C-0.00585938 35.868 0.0202789 35.7373 0.0710475 35.6154C0.121816 35.4936 0.196211 35.383 0.289939 35.29L22.8599 12.73C23.0473 12.5438 23.3008 12.4392 23.5649 12.4392C23.8291 12.4392 24.0826 12.5438 24.2699 12.73L33.7799 22.24C33.8744 22.3326 33.9496 22.4431 34.0011 22.5649C34.0526 22.6868 34.0794 22.8177 34.0799 22.95C34.0794 23.0823 34.0526 23.2132 34.0011 23.3351C33.9496 23.4569 33.8744 23.5674 33.7799 23.66L11.2199 46.22C11.1265 46.3127 11.0157 46.386 10.8938 46.4358C10.772 46.4855 10.6415 46.5108 10.5099 46.51ZM2.40994 36L10.5099 44.1L31.6599 23L23.5599 14.9L2.40994 36Z" fill="black"/>
<path d="M9.97009 38.45C10.8703 38.45 11.6001 37.7202 11.6001 36.82C11.6001 35.9198 10.8703 35.19 9.97009 35.19C9.06986 35.19 8.34009 35.9198 8.34009 36.82C8.34009 37.7202 9.06986 38.45 9.97009 38.45Z" fill="black"/>
<path d="M91.4899 44.12C91.3583 44.1207 91.2279 44.0955 91.106 44.0458C90.9842 43.996 90.8734 43.9227 90.7799 43.83L70.7799 23.83C70.6862 23.737 70.6118 23.6264 70.561 23.5046C70.5103 23.3827 70.4841 23.252 70.4841 23.12C70.4841 22.988 70.5103 22.8573 70.561 22.7354C70.6118 22.6136 70.6862 22.5029 70.7799 22.41L80.2899 12.9C80.3829 12.8063 80.4935 12.7319 80.6154 12.6811C80.7372 12.6303 80.8679 12.6042 80.9999 12.6042C81.1319 12.6042 81.2626 12.6303 81.3845 12.6811C81.5064 12.7319 81.617 12.8063 81.7099 12.9L101.71 32.9C101.896 33.0873 102.001 33.3408 102.001 33.605C102.001 33.8692 101.896 34.1226 101.71 34.31L92.1899 43.83C92.0037 44.0147 91.7523 44.1189 91.4899 44.12ZM72.8799 23.12L91.4899 41.71L99.5899 33.61L80.9999 15L72.8799 23.12Z" fill="black"/>
<path d="M92.0001 36.48C92.9003 36.48 93.6301 35.7502 93.6301 34.85C93.6301 33.9497 92.9003 33.22 92.0001 33.22C91.0999 33.22 90.3701 33.9497 90.3701 34.85C90.3701 35.7502 91.0999 36.48 92.0001 36.48Z" fill="black"/>
<path d="M41.07 32.76C40.4589 32.7668 39.853 32.6476 39.29 32.41C36.29 31.13 31.06 25.41 30.84 25.12C30.7427 25.0245 30.6659 24.9102 30.6144 24.784C30.5629 24.6578 30.5378 24.5224 30.5405 24.3861C30.5432 24.2498 30.5738 24.1156 30.6303 23.9915C30.6868 23.8675 30.7681 23.7563 30.8691 23.6648C30.9702 23.5733 31.0888 23.5035 31.2179 23.4595C31.3469 23.4156 31.4835 23.3985 31.6194 23.4093C31.7553 23.42 31.8875 23.4585 32.008 23.5222C32.1285 23.586 32.2346 23.6737 32.32 23.78C33.75 25.36 37.92 29.65 40.08 30.57C41.08 30.99 42.35 30.62 43.71 30.23C45.62 29.68 48 28.99 49.63 31.03C49.7958 31.2382 49.872 31.5037 49.842 31.7681C49.812 32.0325 49.6782 32.2742 49.47 32.44C49.2618 32.6057 48.9963 32.682 48.7319 32.652C48.4674 32.622 48.2258 32.4882 48.06 32.28C47.34 31.38 46.35 31.54 44.27 32.15C43.2365 32.4997 42.1597 32.7049 41.07 32.76Z" fill="black"/>
<path d="M27.5501 66.52C27.4137 66.5208 27.2786 66.4938 27.1531 66.4404C27.0275 66.3871 26.9142 66.3087 26.8201 66.21C18.7001 57.7 17.8201 53.21 17.3601 50.5C17.3016 49.9872 17.1807 49.4835 17.0001 49C16.2001 47.4 13.2101 45 12.1301 44.21C12.0237 44.1325 11.9337 44.0348 11.8651 43.9225C11.7964 43.8103 11.7506 43.6856 11.7302 43.5556C11.7097 43.4256 11.7151 43.2928 11.746 43.1649C11.7769 43.0369 11.8326 42.9164 11.9101 42.81C11.9876 42.7036 12.0853 42.6135 12.1976 42.5449C12.3098 42.4763 12.4346 42.4305 12.5646 42.41C12.6946 42.3896 12.8273 42.395 12.9552 42.4259C13.0832 42.4567 13.2037 42.5125 13.3101 42.59C13.7501 42.91 17.6301 45.78 18.7901 48.11C19.0743 48.7712 19.2694 49.4673 19.3701 50.18C19.8301 52.65 20.6001 56.8 28.3101 64.88C28.445 65.0214 28.5354 65.1993 28.5703 65.3916C28.6051 65.5839 28.5829 65.7822 28.5063 65.9619C28.4297 66.1417 28.3021 66.2951 28.1393 66.4032C27.9765 66.5113 27.7855 66.5692 27.5901 66.57L27.5501 66.52Z" fill="black"/>
<path d="M40.6899 52.41C39.5424 52.4087 38.4209 52.0676 37.467 51.4297C36.513 50.7919 35.7693 49.8858 35.3297 48.8258C34.8901 47.7658 34.7742 46.5993 34.9967 45.4735C35.2192 44.3477 35.7701 43.3131 36.5799 42.5L47.5799 31.5L47.6799 31.41C49.3677 29.9723 51.4287 29.0428 53.6236 28.7295C55.8185 28.4162 58.0573 28.7319 60.0799 29.64C61.1466 30.123 62.304 30.3729 63.4749 30.3729C64.6458 30.3729 65.8033 30.123 66.8699 29.64C68.4899 28.83 71.1799 25.72 72.0799 24.58C72.2457 24.3718 72.4874 24.238 72.7518 24.208C73.0162 24.178 73.2817 24.2542 73.4899 24.42C73.6981 24.5858 73.8319 24.8274 73.8619 25.0919C73.8919 25.3563 73.8157 25.6218 73.6499 25.83C73.2899 26.28 70.0699 30.28 67.7699 31.43C66.4456 32.0295 65.0086 32.3397 63.5549 32.3397C62.1012 32.3397 60.6642 32.0295 59.3399 31.43C57.6453 30.6825 55.7728 30.4332 53.9416 30.7113C52.1104 30.9893 50.3963 31.7832 48.9999 33L37.9999 44C37.6462 44.353 37.3655 44.7722 37.174 45.2338C36.9825 45.6954 36.8839 46.1903 36.8839 46.69C36.8839 47.1897 36.9825 47.6846 37.174 48.1461C37.3655 48.6077 37.6462 49.027 37.9999 49.38C38.724 50.0731 39.6876 50.46 40.6899 50.46C41.6922 50.46 42.6559 50.0731 43.3799 49.38L51.9399 40.82C52.0329 40.7263 52.1435 40.6519 52.2653 40.6011C52.3872 40.5503 52.5179 40.5242 52.6499 40.5242C52.7819 40.5242 52.9126 40.5503 53.0345 40.6011C53.1564 40.6519 53.267 40.7263 53.3599 40.82C53.5462 41.0074 53.6507 41.2608 53.6507 41.525C53.6507 41.7892 53.5462 42.0426 53.3599 42.23L44.7899 50.8C43.6899 51.8577 42.2157 52.4366 40.6899 52.41Z" fill="black"/>
<path d="M68.9299 72.8C68.3451 72.8014 67.7658 72.6873 67.2253 72.4642C66.6847 72.2411 66.1935 71.9134 65.7799 71.5L48.9099 54.63C48.7237 54.4426 48.6191 54.1892 48.6191 53.925C48.6191 53.6608 48.7237 53.4073 48.9099 53.22C49.0973 53.0337 49.3508 52.9292 49.6149 52.9292C49.8791 52.9292 50.1326 53.0337 50.3199 53.22L67.1999 70.09C67.4224 70.3372 67.6929 70.5366 67.9949 70.676C68.2969 70.8153 68.6242 70.8917 68.9567 70.9005C69.2892 70.9093 69.62 70.8503 69.9289 70.727C70.2379 70.6038 70.5185 70.419 70.7537 70.1838C70.9889 69.9486 71.1738 69.6679 71.297 69.359C71.4202 69.05 71.4792 68.7192 71.4705 68.3867C71.4617 68.0542 71.3853 67.727 71.2459 67.4249C71.1066 67.1229 70.9072 66.8524 70.6599 66.63L49.0599 45C48.9662 44.907 48.8918 44.7964 48.841 44.6746C48.7903 44.5527 48.7641 44.422 48.7641 44.29C48.7641 44.158 48.7903 44.0273 48.841 43.9054C48.8918 43.7835 48.9662 43.6729 49.0599 43.58C49.2473 43.3937 49.5007 43.2892 49.7649 43.2892C50.0291 43.2892 50.2826 43.3937 50.4699 43.58L72.0699 65.18C72.4839 65.5925 72.8123 66.0826 73.0364 66.6223C73.2605 67.162 73.3758 67.7406 73.3758 68.325C73.3758 68.9093 73.2605 69.488 73.0364 70.0276C72.8123 70.5673 72.4839 71.0575 72.0699 71.47C71.6614 71.8895 71.1732 72.2232 70.634 72.4515C70.0948 72.6799 69.5155 72.7984 68.9299 72.8Z" fill="black"/>
<path d="M65.15 80.41C64.4781 80.4129 63.8123 80.2827 63.191 80.0269C62.5697 79.7712 62.0052 79.395 61.53 78.92L44.33 61.72C44.1417 61.5317 44.0359 61.2763 44.0359 61.01C44.0359 60.7437 44.1417 60.4883 44.33 60.3C44.5183 60.1117 44.7737 60.0059 45.04 60.0059C45.3063 60.0059 45.5617 60.1117 45.75 60.3L63 77.5C63.5861 78.0848 64.3805 78.4128 65.2085 78.4119C66.0365 78.4109 66.8302 78.0811 67.415 77.495C67.9998 76.9089 68.3278 76.1144 68.3269 75.2865C68.3259 74.4585 67.9961 73.6648 67.41 73.08L65.71 71.38C65.5954 71.1898 65.5474 70.9669 65.5736 70.7463C65.5997 70.5258 65.6985 70.3203 65.8544 70.1622C66.0102 70.004 66.2143 69.9022 66.4344 69.8729C66.6545 69.8435 66.8781 69.8882 67.07 70L68.78 71.7C69.4965 72.4167 69.9842 73.3298 70.1814 74.3238C70.3785 75.3178 70.2763 76.348 69.8876 77.2839C69.4989 78.2197 68.8412 79.0192 67.9979 79.5811C67.1545 80.1429 66.1634 80.4418 65.15 80.44V80.41Z" fill="black"/>
<path d="M57.81 84.07C57.1745 84.0699 56.5453 83.9444 55.9585 83.7008C55.3716 83.4571 54.8386 83.1 54.39 82.65L37.81 66.07C37.7162 65.977 37.6418 65.8664 37.5911 65.7446C37.5403 65.6227 37.5142 65.492 37.5142 65.36C37.5142 65.228 37.5403 65.0973 37.5911 64.9754C37.6418 64.8536 37.7162 64.7429 37.81 64.65C37.9973 64.4637 38.2508 64.3592 38.515 64.3592C38.7791 64.3592 39.0326 64.4637 39.22 64.65L55.8 81.23C56.0483 81.5484 56.3614 81.8105 56.7187 81.9987C57.0759 82.187 57.4691 82.2972 57.8721 82.3221C58.2752 82.3469 58.6789 82.2858 59.0565 82.1428C59.4342 81.9999 59.7772 81.7783 60.0627 81.4927C60.3482 81.2072 60.5698 80.8642 60.7128 80.4866C60.8558 80.1089 60.9169 79.7052 60.892 79.3021C60.8672 78.8991 60.757 78.5059 60.5687 78.1487C60.3804 77.7914 60.1184 77.4783 59.8 77.23L59 76.39C58.8906 76.3011 58.8013 76.1902 58.7378 76.0644C58.6743 75.9386 58.6382 75.8008 58.6317 75.6601C58.6251 75.5193 58.6485 75.3788 58.7001 75.2477C58.7517 75.1166 58.8304 74.9978 58.9311 74.8993C59.0318 74.8007 59.1521 74.7246 59.2843 74.6758C59.4165 74.627 59.5575 74.6067 59.6981 74.6162C59.8386 74.6257 59.9756 74.6648 60.1 74.7309C60.2244 74.7971 60.3335 74.8888 60.42 75L61.24 75.82C61.915 76.4988 62.3741 77.3622 62.5594 78.3015C62.7446 79.2407 62.6478 80.2138 62.281 81.0981C61.9143 81.9824 61.294 82.7383 60.4983 83.2708C59.7027 83.8032 58.7673 84.0882 57.81 84.09V84.07Z" fill="black"/>
<path d="M47.2101 85.27C46.1607 85.2702 45.1358 84.953 44.2701 84.36C44.0549 84.2087 43.9079 83.9786 43.8612 83.7197C43.8144 83.4608 43.8715 83.1939 44.0202 82.9769C44.1688 82.7598 44.397 82.61 44.6553 82.5601C44.9137 82.5101 45.1812 82.564 45.4001 82.71C46.0648 83.1563 46.8715 83.3399 47.6638 83.2251C48.4562 83.1104 49.1777 82.7054 49.6884 82.0889C50.1991 81.4723 50.4626 80.688 50.4278 79.8882C50.393 79.0883 50.0624 78.3299 49.5001 77.76L47.7701 76C47.6764 75.907 47.602 75.7964 47.5512 75.6746C47.5005 75.5527 47.4743 75.422 47.4743 75.29C47.4743 75.158 47.5005 75.0273 47.5512 74.9054C47.602 74.7835 47.6764 74.6729 47.7701 74.58C47.9575 74.3937 48.2109 74.2892 48.4751 74.2892C48.7393 74.2892 48.9928 74.3937 49.1801 74.58L50.9101 76.31C51.6423 77.0414 52.141 77.9736 52.3431 78.9886C52.5452 80.0037 52.4416 81.0558 52.0455 82.0119C51.6493 82.968 50.9784 83.7851 50.1177 84.3597C49.2569 84.9344 48.245 85.2407 47.2101 85.24V85.27Z" fill="black"/>
<path d="M40.69 87.56C39.6303 87.5679 38.592 87.2609 37.7069 86.6779C36.8219 86.0949 36.1299 85.2621 35.7189 84.2852C35.3078 83.3084 35.1961 82.2314 35.398 81.191C35.5999 80.1506 36.1063 79.1936 36.8529 78.4414C37.5995 77.6892 38.5526 77.1756 39.5915 76.9659C40.6304 76.7562 41.7081 76.8598 42.6881 77.2636C43.668 77.6673 44.5059 78.353 45.0956 79.2336C45.6852 80.1143 46 81.1502 46.0001 82.21C45.9975 83.6212 45.4385 84.9745 44.4443 85.9761C43.4502 86.9777 42.1012 87.5469 40.69 87.56ZM40.69 78.86C40.0258 78.8521 39.3743 79.0418 38.8181 79.4051C38.262 79.7683 37.8264 80.2887 37.5667 80.9001C37.307 81.5115 37.2349 82.1863 37.3596 82.8387C37.4843 83.4912 37.8002 84.0918 38.2671 84.5643C38.7339 85.0368 39.3307 85.3599 39.9816 85.4924C40.6325 85.625 41.3082 85.561 41.9226 85.3087C42.5371 85.0563 43.0627 84.627 43.4326 84.0753C43.8025 83.5235 44 82.8743 44.0001 82.21C43.9975 81.3292 43.6492 80.4846 43.0302 79.8581C42.4111 79.2315 41.5708 78.8731 40.69 78.86Z" fill="black"/>
<path d="M34.7101 81.58C33.5269 81.5838 32.3759 81.1952 31.4371 80.4752C30.4982 79.7551 29.8246 78.7441 29.5215 77.6004C29.2184 76.4567 29.303 75.2448 29.7621 74.1543C30.2211 73.0638 31.0287 72.1563 32.0585 71.5736C33.0883 70.991 34.2821 70.7662 35.4533 70.9343C36.6245 71.1024 37.7069 71.6541 38.5311 72.5029C39.3554 73.3517 39.875 74.4498 40.0087 75.6254C40.1425 76.801 39.8827 77.9877 39.2701 79C39.2182 79.1358 39.1373 79.2586 39.0331 79.3599C38.9289 79.4612 38.8038 79.5386 38.6667 79.5867C38.5295 79.6347 38.3835 79.6523 38.2388 79.6382C38.0941 79.6241 37.9543 79.5785 37.829 79.5049C37.7037 79.4312 37.596 79.331 37.5134 79.2115C37.4307 79.0919 37.3752 78.9557 37.3505 78.8125C37.3259 78.6692 37.3327 78.5223 37.3707 78.382C37.4086 78.2417 37.4767 78.1113 37.5701 78C37.9961 77.3024 38.1514 76.4728 38.0068 75.6683C37.8621 74.8638 37.4275 74.1403 36.7852 73.6348C36.1429 73.1293 35.3375 72.8768 34.5216 72.9253C33.7056 72.9737 32.9358 73.3197 32.3578 73.8977C31.7798 74.4756 31.4338 75.2455 31.3854 76.0614C31.3369 76.8774 31.5894 77.6828 32.0949 78.3251C32.6004 78.9674 33.3239 79.402 34.1284 79.5467C34.9329 79.6913 35.7625 79.536 36.4601 79.11C36.6858 78.973 36.9565 78.9308 37.2131 78.9927C37.4698 79.0545 37.6915 79.2153 37.8301 79.44C37.8995 79.5521 37.946 79.6769 37.967 79.8071C37.9879 79.9373 37.9829 80.0704 37.9523 80.1987C37.9216 80.3269 37.8658 80.4478 37.7882 80.5545C37.7106 80.6611 37.6127 80.7513 37.5001 80.82C36.6573 81.3241 35.6922 81.587 34.7101 81.58Z" fill="black"/>
<path d="M28.7299 75.06C27.6718 75.06 26.6374 74.7462 25.7576 74.1584C24.8778 73.5705 24.1921 72.7349 23.7871 71.7573C23.3822 70.7798 23.2763 69.7041 23.4827 68.6663C23.6891 67.6285 24.1987 66.6752 24.9469 65.927C25.6951 65.1788 26.6484 64.6692 27.6862 64.4628C28.7239 64.2564 29.7997 64.3623 30.7772 64.7672C31.7548 65.1722 32.5904 65.8579 33.1782 66.7377C33.7661 67.6175 34.0799 68.6519 34.0799 69.71C34.0772 71.1281 33.5127 72.4873 32.51 73.4901C31.5072 74.4928 30.148 75.0573 28.7299 75.06ZM28.7299 66.36C28.0673 66.36 27.4196 66.5565 26.8687 66.9246C26.3178 67.2927 25.8884 67.8159 25.6349 68.428C25.3813 69.0401 25.315 69.7137 25.4443 70.3635C25.5735 71.0134 25.8926 71.6103 26.3611 72.0788C26.8296 72.5473 27.4265 72.8664 28.0763 72.9956C28.7262 73.1249 29.3997 73.0585 30.0119 72.805C30.624 72.5514 31.1472 72.1221 31.5153 71.5711C31.8834 71.0202 32.0799 70.3726 32.0799 69.71C32.0799 68.8215 31.7269 67.9694 31.0987 67.3412C30.4704 66.7129 29.6184 66.36 28.7299 66.36Z" fill="black"/>
<path d="M61.52 53.13C57.29 53.13 53.41 49.79 49.15 44.83C49.0509 44.7332 48.9729 44.6168 48.9211 44.4882C48.8693 44.3597 48.8448 44.2217 48.8491 44.0832C48.8535 43.9447 48.8866 43.8085 48.9463 43.6835C49.006 43.5584 49.0911 43.4471 49.1962 43.3567C49.3012 43.2662 49.4239 43.1986 49.5565 43.1581C49.6891 43.1176 49.8286 43.1051 49.9662 43.1214C50.1039 43.1377 50.2366 43.1825 50.3561 43.2528C50.4755 43.3232 50.579 43.4176 50.66 43.53C56.71 50.53 60.52 52.4 64.66 50.32C64.7782 50.2454 64.9106 50.1964 65.0488 50.1762C65.1871 50.1559 65.328 50.1648 65.4626 50.2023C65.5971 50.2399 65.7223 50.3052 65.8301 50.3941C65.9379 50.4829 66.0259 50.5934 66.0884 50.7184C66.1508 50.8433 66.1864 50.98 66.1929 51.1195C66.1993 51.2591 66.1764 51.3984 66.1257 51.5286C66.075 51.6588 65.9976 51.7769 65.8984 51.8753C65.7993 51.9737 65.6806 52.0503 65.55 52.1C64.3056 52.7533 62.9254 53.1061 61.52 53.13Z" fill="black"/>
<path d="M71.37 66.92C71.1683 66.9195 70.9716 66.858 70.8055 66.7437C70.6394 66.6294 70.5118 66.4675 70.4394 66.2794C70.3669 66.0912 70.353 65.8855 70.3995 65.6894C70.446 65.4932 70.5508 65.3156 70.7 65.18C76.7 59.79 79.12 52.34 80.16 49.18C81.68 44.49 88.51 39.99 88.58 39.94C88.8016 39.7962 89.0712 39.746 89.3298 39.8004C89.5884 39.8547 89.8149 40.0092 89.96 40.23C90.0327 40.3402 90.0829 40.4636 90.1077 40.5933C90.1326 40.7229 90.1314 40.8562 90.1045 40.9854C90.0775 41.1146 90.0253 41.2372 89.9507 41.3462C89.8761 41.4551 89.7807 41.5482 89.67 41.62C87.92 42.76 83.14 46.45 82.06 49.8C80.98 53.15 78.44 60.92 72 66.66C71.8269 66.8178 71.6039 66.9098 71.37 66.92Z" fill="black"/>
</g>
<defs>
<clipPath id="clip0">
<rect width="102" height="100" fill="white"/>
</clipPath>
</defs>
</svg>
