<svg width="16" height="16" viewBox="0 0 16 16" fill="none" xmlns="http://www.w3.org/2000/svg">
<g clip-path="url(#clip0)">
<path d="M14.4446 0H1.555C1.13874 0 0.799805 0.338933 0.799805 0.7552V15.2448C0.799805 15.6611 1.13874 16 1.555 16H14.4446C14.8609 16 15.1998 15.6611 15.1998 15.2448V0.7552C15.1998 0.338933 14.8609 0 14.4446 0ZM1.555 0.533333H14.4446C14.567 0.533333 14.6665 0.6328 14.6665 0.7552V7.73333H1.33314V0.7552C1.33314 0.6328 1.4326 0.533333 1.555 0.533333ZM14.4446 15.4667H1.555C1.4326 15.4667 1.33314 15.3672 1.33314 15.2448V8.26667H14.6665V15.2448C14.6665 15.3672 14.567 15.4667 14.4446 15.4667Z" fill="#2F2F2F"/>
<path d="M6.53428 4.79995H9.46494C9.98041 4.79995 10.3996 4.38075 10.3996 3.86528V3.46662C10.3996 3.31915 10.2804 3.19995 10.1329 3.19995C9.98548 3.19995 9.86628 3.31915 9.86628 3.46662V3.86528C9.86628 4.08662 9.68628 4.26662 9.46494 4.26662H6.53428C6.31294 4.26662 6.13294 4.08662 6.13294 3.86528V3.46662C6.13294 3.31915 6.01374 3.19995 5.86628 3.19995C5.71881 3.19995 5.59961 3.31915 5.59961 3.46662V3.86528C5.59961 4.38075 6.01881 4.79995 6.53428 4.79995Z" fill="#2F2F2F"/>
<path d="M10.1329 10.9333C9.98548 10.9333 9.86628 11.0525 9.86628 11.2V11.5987C9.86628 11.82 9.68628 12 9.46494 12H6.53428C6.31294 12 6.13294 11.82 6.13294 11.5987V11.2C6.13294 11.0525 6.01374 10.9333 5.86628 10.9333C5.71881 10.9333 5.59961 11.0525 5.59961 11.2V11.5987C5.59961 12.1141 6.01881 12.5333 6.53428 12.5333H9.46494C9.98041 12.5333 10.3996 12.1141 10.3996 11.5987V11.2C10.3996 11.0525 10.2804 10.9333 10.1329 10.9333Z" fill="#2F2F2F"/>
</g>
<defs>
</defs>
</svg>
