<svg width="100" height="100" viewBox="0 0 100 100" fill="none" xmlns="http://www.w3.org/2000/svg">
<g clip-path="url(#clip0)">
<path d="M38.58 30H5.93C5.284 30.004 4.6436 29.8801 4.04564 29.6357C3.44767 29.3912 2.90396 29.0309 2.44577 28.5755C1.98758 28.1201 1.62396 27.5786 1.37584 26.9821C1.12772 26.3856 0.999988 25.746 1 25.1V4.9C0.999988 4.25399 1.12772 3.61436 1.37584 3.0179C1.62396 2.42144 1.98758 1.87993 2.44577 1.42453C2.90396 0.969126 3.44767 0.608821 4.04564 0.364345C4.6436 0.119868 5.284 -0.00395487 5.93 2.92697e-07H38.58C39.8787 0.00264272 41.1235 0.51974 42.0419 1.4381C42.9603 2.35645 43.4774 3.60125 43.48 4.9V25.1C43.48 26.3996 42.9638 27.6459 42.0448 28.5648C41.1259 29.4838 39.8796 30 38.58 30ZM5.93 2C5.15888 2.00255 4.41963 2.30796 3.87156 2.85042C3.32349 3.39288 3.01049 4.12895 3 4.9V25.1C3.01049 25.8711 3.32349 26.6071 3.87156 27.1496C4.41963 27.692 5.15888 27.9974 5.93 28H38.58C39.3597 28 40.1075 27.6903 40.6589 27.1389C41.2103 26.5875 41.52 25.8397 41.52 25.06V4.9C41.5095 4.12722 41.1951 3.38965 40.6449 2.84692C40.0947 2.30418 39.3529 1.99993 38.58 2H5.93Z" fill="black"/>
<path d="M94.07 100H61.42C60.1213 99.9974 58.8765 99.4803 57.9581 98.5619C57.0398 97.6435 56.5227 96.3987 56.52 95.1V74.9C56.5227 73.6013 57.0398 72.3565 57.9581 71.4381C58.8765 70.5197 60.1213 70.0026 61.42 70H94.07C94.716 69.996 95.3564 70.1199 95.9544 70.3643C96.5523 70.6088 97.0961 70.9691 97.5542 71.4245C98.0124 71.8799 98.3761 72.4214 98.6242 73.0179C98.8723 73.6144 99 74.254 99 74.9V95.1C99 95.746 98.8723 96.3856 98.6242 96.9821C98.3761 97.5786 98.0124 98.1201 97.5542 98.5755C97.0961 99.0309 96.5523 99.3912 95.9544 99.6357C95.3564 99.8801 94.716 100.004 94.07 100ZM61.42 72C60.6403 72 59.8925 72.3098 59.3411 72.8611C58.7898 73.4125 58.48 74.1603 58.48 74.94V95.1C58.4905 95.8728 58.8049 96.6103 59.3551 97.1531C59.9054 97.6958 60.6472 98.0001 61.42 98H94.07C94.8411 97.9974 95.5804 97.692 96.1285 97.1496C96.6765 96.6071 96.9895 95.8711 97 95.1V74.9C96.9895 74.1289 96.6765 73.3929 96.1285 72.8504C95.5804 72.308 94.8411 72.0026 94.07 72H61.42Z" fill="black"/>
<path d="M94.07 56.27H61.42C60.1213 56.2674 58.8765 55.7503 57.9581 54.8319C57.0398 53.9135 56.5227 52.6687 56.52 51.37V4.9C56.5227 3.60125 57.0398 2.35645 57.9581 1.4381C58.8765 0.51974 60.1213 0.00264272 61.42 2.92697e-07H94.07C94.716 -0.00395487 95.3564 0.119868 95.9544 0.364345C96.5523 0.608821 97.0961 0.969126 97.5542 1.42453C98.0124 1.87993 98.3761 2.42144 98.6242 3.0179C98.8723 3.61436 99 4.25399 99 4.9V51.37C99 52.016 98.8723 52.6556 98.6242 53.2521C98.3761 53.8486 98.0124 54.3901 97.5542 54.8455C97.0961 55.3009 96.5523 55.6612 95.9544 55.9057C95.3564 56.1501 94.716 56.274 94.07 56.27ZM61.42 2C60.6472 1.99993 59.9054 2.30418 59.3551 2.84692C58.8049 3.38965 58.4905 4.12722 58.48 4.9V51.37C58.48 52.1497 58.7898 52.8975 59.3411 53.4489C59.8925 54.0003 60.6403 54.31 61.42 54.31H94.07C94.848 54.3074 95.5933 53.9964 96.1425 53.4454C96.6916 52.8943 97 52.148 97 51.37V4.9C96.9895 4.12895 96.6765 3.39288 96.1285 2.85042C95.5804 2.30796 94.8411 2.00255 94.07 2H61.42Z" fill="black"/>
<path d="M38.58 100H5.93C5.284 100.004 4.6436 99.8801 4.04564 99.6357C3.44767 99.3912 2.90396 99.0309 2.44577 98.5755C1.98758 98.1201 1.62396 97.5786 1.37584 96.9821C1.12772 96.3856 0.999988 95.746 1 95.1V48.63C1 47.3304 1.51625 46.0841 2.43518 45.1652C3.3541 44.2462 4.60044 43.73 5.9 43.73H38.58C39.8787 43.7326 41.1235 44.2497 42.0419 45.1681C42.9603 46.0864 43.4774 47.3312 43.48 48.63V95.1C43.4774 96.3987 42.9603 97.6435 42.0419 98.5619C41.1235 99.4803 39.8787 99.9974 38.58 100ZM5.93 45.69C5.152 45.6926 4.40676 46.0036 3.85757 46.5546C3.30837 47.1057 3 47.852 3 48.63V95.1C3.01049 95.8711 3.32349 96.6071 3.87156 97.1496C4.41963 97.692 5.15888 97.9974 5.93 98H38.58C39.3597 98 40.1075 97.6902 40.6589 97.1389C41.2103 96.5875 41.52 95.8397 41.52 95.06V48.63C41.52 47.8503 41.2103 47.1025 40.6589 46.5511C40.1075 45.9997 39.3597 45.69 38.58 45.69H5.93Z" fill="black"/>
</g>
<defs>
<clipPath id="clip0">
<rect width="100" height="100" fill="white"/>
</clipPath>
</defs>
</svg>
