<svg width="20" height="20" viewBox="0 0 20 20" fill="none" xmlns="http://www.w3.org/2000/svg">
<path d="M16.6667 10.6666C17.5857 10.6666 18.3333 9.91892 18.3333 8.99992C18.3333 8.08092 17.5857 7.33325 16.6667 7.33325C15.7477 7.33325 15 8.08092 15 8.99992C15 9.91892 15.7477 10.6666 16.6667 10.6666ZM16.6667 7.99992C17.218 7.99992 17.6667 8.44859 17.6667 8.99992C17.6667 9.55125 17.218 9.99992 16.6667 9.99992C16.1153 9.99992 15.6667 9.55125 15.6667 8.99992C15.6667 8.44859 16.1153 7.99992 16.6667 7.99992Z" fill="#2F2F2F"/>
<path d="M13.9993 14.3333H5.99935C5.81502 14.3333 5.66602 14.4823 5.66602 14.6666C5.66602 14.8509 5.81502 14.9999 5.99935 14.9999H13.9993C14.1837 14.9999 14.3327 14.8509 14.3327 14.6666C14.3327 14.4823 14.1837 14.3333 13.9993 14.3333Z" fill="#2F2F2F"/>
<path d="M13.9993 16H5.99935C5.81502 16 5.66602 16.149 5.66602 16.3333C5.66602 16.5177 5.81502 16.6667 5.99935 16.6667H13.9993C14.1837 16.6667 14.3327 16.5177 14.3327 16.3333C14.3327 16.149 14.1837 16 13.9993 16Z" fill="#2F2F2F"/>
<path d="M17 5.66667V0H3V5.66667H0V17H2V18H3V20H17V18H18V17H20V5.66667H17ZM3.66667 0.666667H16.3333V5.66667H3.66667V0.666667ZM3 6.33333H17H19.3333V11.6667H0.666667V6.33333H3ZM2.66667 17.3333V16.6667V16.3333V15C2.66667 14.8157 2.51767 14.6667 2.33333 14.6667C2.149 14.6667 2 14.8157 2 15V16.3333H0.666667V12.3333H3V17.3333H2.66667ZM16.3333 19.3333H3.66667V18V12.3333H16.3333V18V19.3333ZM18 16.3333V15C18 14.8157 17.851 14.6667 17.6667 14.6667C17.4823 14.6667 17.3333 14.8157 17.3333 15V16.3333V16.6667V17.3333H17V12.3333H19.3333V16.3333H18Z" fill="#2F2F2F"/>
</svg>
