{
    "Version": "2012-10-17",
    "Statement": [
        {
            "Effect": "Allow",
            "Action": "dynamodb:UpdateItem",
            "Resource": "arn:aws:dynamodb:us-east-1:988646599334:table/marketegy",
            "Condition": {
                "ForAllValues:StringEquals": {
                    "dynamodb:LeadingKeys": "project"
                }
            }
        },
        {
            "Effect": "Allow",
            "Action": [
                "logs:CreateLogGroup",
                "logs:CreateLogStream",
                "logs:PutLogEvents"
            ],
            "Resource": "*"
        }
    ]
}

