http://www.taro.lv//images/uploads/161x242/7516c05509490f5af91a65d8d112af95.jpg
http://www.taro.lv//images/uploads/161x242/c09b31352f1ffcb2092c4ba2cfa06023.JPG
http://www.taro.lv//images/uploads/161x242/72977928ca66d0fe313c5711f5d6bc74.JPG
