http://www.taro.lv//images/uploads/161x242/3bb3e2600474a9417905a4497d90748d.jpg
http://www.taro.lv//images/uploads/161x242/c440aef93975e418371b9a37583990e7.jpg
http://www.taro.lv//images/uploads/161x242/17f4c4ae8982b34fd47c00b0b88c3555.jpg
