{
    "bars": [
        280.0,
        506.95530550119565,
        823.9741519895631,
        1143.7237583532649,
        1459.739979198379,
        1768.6480982822375,
        2089.628349351309,
        2399.627855330868,
        2716.036668043775,
        3031.358009277375,
        3349.6852602377317,
        3679.2087914401677,
        3995.0673954845206,
        4313.811348445313,
        4632.609661049506,
        4940.364156592025,
        5271.6529628542585,
        5592.47884891645,
        5901.107620388517,
        6214.181616365907,
        6532.267088135137,
        6850.829889215083,
        7166.61366648551,
        7484.324453540673,
        7800.192143908152,
        8110.893942668722,
        8422.038359860882,
        8738.63450068866,
        9049.758353627702,
        9128.12214358204
    ],
    "onset-x": [
        {
            "onset": 0.0,
            "x": 308.8281430745814
        },
        {
            "onset": 1.0,
            "x": 341.55261796042623
        },
        {
            "onset": 1.5,
            "x": 368.5853881278539
        },
        {
            "onset": 2.0,
            "x": 396.7757382039574
        },
        {
            "onset": 3.0,
            "x": 433.7019482496195
        },
        {
            "onset": 3.25,
            "x": 452.3633181126332
        },
        {
            "onset": 3.5,
            "x": 471.42124809741244
        },
        {
            "onset": 3.75,
            "x": 490.4791780821918
        },
        {
            "onset": 4.0,
            "x": 518.8164318330068
        },
        {
            "onset": 4.25,
            "x": 538.5482887584253
        },
        {
            "onset": 4.5,
            "x": 557.6062187432055
        },
        {
            "onset": 4.75,
            "x": 576.6641487279848
        },
        {
            "onset": 5.0,
            "x": 594.5644988040883
        },
        {
            "onset": 5.25,
            "x": 614.7800086975435
        },
        {
            "onset": 5.5,
            "x": 633.8379386823226
        },
        {
            "onset": 5.75,
            "x": 650.9932811480761
        },
        {
            "onset": 6.0,
            "x": 668.1486236138296
        },
        {
            "onset": 6.25,
            "x": 687.2065535986089
        },
        {
            "onset": 6.5,
            "x": 706.2644835833883
        },
        {
            "onset": 6.75,
            "x": 725.3224135681675
        },
        {
            "onset": 7.0,
            "x": 743.9837834311811
        },
        {
            "onset": 7.25,
            "x": 763.0417134159604
        },
        {
            "onset": 7.5,
            "x": 782.0996434007398
        },
        {
            "onset": 7.75,
            "x": 807.6263709502072
        },
        {
            "onset": 8.0,
            "x": 837.3125222149741
        },
        {
            "onset": 8.25,
            "x": 862.8392497644418
        },
        {
            "onset": 8.5,
            "x": 881.8971797492208
        },
        {
            "onset": 8.75,
            "x": 900.955109734
        },
        {
            "onset": 9.0,
            "x": 920.0130397187794
        },
        {
            "onset": 9.25,
            "x": 939.0709697035587
        },
        {
            "onset": 9.5,
            "x": 958.1288996883395
        },
        {
            "onset": 9.75,
            "x": 975.2842421540943
        },
        {
            "onset": 10.0,
            "x": 993.3908783793607
        },
        {
            "onset": 10.25,
            "x": 1015.8430244980823
        },
        {
            "onset": 10.5,
            "x": 1034.9009544828616
        },
        {
            "onset": 10.75,
            "x": 1053.958884467641
        },
        {
            "onset": 11.0,
            "x": 1073.01681445242
        },
        {
            "onset": 11.25,
            "x": 1092.0747444371996
        },
        {
            "onset": 11.5,
            "x": 1111.1326744219787
        },
        {
            "onset": 11.75,
            "x": 1130.190604406758
        },
        {
            "onset": 12.0,
            "x": 1157.497005725883
        },
        {
            "onset": 12.25,
            "x": 1176.554935710662
        },
        {
            "onset": 12.5,
            "x": 1195.6128656954413
        },
        {
            "onset": 12.75,
            "x": 1214.6707956802206
        },
        {
            "onset": 13.0,
            "x": 1233.7287256650002
        },
        {
            "onset": 13.25,
            "x": 1252.3900955280137
        },
        {
            "onset": 13.5,
            "x": 1271.448025512793
        },
        {
            "onset": 13.75,
            "x": 1290.5059554975721
        },
        {
            "onset": 14.0,
            "x": 1308.68205682395
        },
        {
            "onset": 14.25,
            "x": 1327.739986808729
        },
        {
            "onset": 14.5,
            "x": 1346.7979167935084
        },
        {
            "onset": 14.75,
            "x": 1372.324644342976
        },
        {
            "onset": 15.0,
            "x": 1391.4520394288586
        },
        {
            "onset": 15.25,
            "x": 1410.509969413638
        },
        {
            "onset": 15.5,
            "x": 1429.567899398417
        },
        {
            "onset": 15.75,
            "x": 1446.7232418641706
        },
        {
            "onset": 16.0,
            "x": 1473.2957879973899
        },
        {
            "onset": 16.25,
            "x": 1492.353717982169
        },
        {
            "onset": 16.5,
            "x": 1511.4116479669483
        },
        {
            "onset": 16.75,
            "x": 1530.4695779517278
        },
        {
            "onset": 17.0,
            "x": 1549.527507936507
        },
        {
            "onset": 17.25,
            "x": 1568.5854379212863
        },
        {
            "onset": 17.5,
            "x": 1587.6433679060654
        },
        {
            "onset": 17.75,
            "x": 1606.701297890845
        },
        {
            "onset": 18.0,
            "x": 1623.856640356598
        },
        {
            "onset": 18.25,
            "x": 1642.9145703413776
        },
        {
            "onset": 18.5,
            "x": 1661.9725003261567
        },
        {
            "onset": 18.75,
            "x": 1681.0304303109363
        },
        {
            "onset": 19.0,
            "x": 1700.0883602957153
        },
        {
            "onset": 19.25,
            "x": 1719.1462902804947
        },
        {
            "onset": 19.5,
            "x": 1738.2042202652742
        },
        {
            "onset": 19.75,
            "x": 1755.3595627310276
        },
        {
            "onset": 20.0,
            "x": 1782.1991381097337
        },
        {
            "onset": 20.25,
            "x": 1801.6967142132344
        },
        {
            "onset": 20.5,
            "x": 1820.7546441980137
        },
        {
            "onset": 20.75,
            "x": 1839.8125741827932
        },
        {
            "onset": 21.0,
            "x": 1858.8705041675726
        },
        {
            "onset": 21.25,
            "x": 1877.9284341523517
        },
        {
            "onset": 21.5,
            "x": 1900.3805802710733
        },
        {
            "onset": 21.75,
            "x": 1917.535922736827
        },
        {
            "onset": 22.0,
            "x": 1936.5938527216058
        },
        {
            "onset": 22.25,
            "x": 1955.6517827063853
        },
        {
            "onset": 22.5,
            "x": 1974.7097126911644
        },
        {
            "onset": 22.75,
            "x": 2000.236440240632
        },
        {
            "onset": 23.0,
            "x": 2019.2943702254113
        },
        {
            "onset": 23.25,
            "x": 2038.3523002101902
        },
        {
            "onset": 23.5,
            "x": 2057.4102301949697
        },
        {
            "onset": 23.75,
            "x": 2076.468160179749
        },
        {
            "onset": 24.0,
            "x": 2103.8219779662254
        },
        {
            "onset": 24.25,
            "x": 2122.8799079510045
        },
        {
            "onset": 24.5,
            "x": 2141.937837935784
        },
        {
            "onset": 24.75,
            "x": 2160.9957679205627
        },
        {
            "onset": 25.0,
            "x": 2179.8554178444597
        },
        {
            "onset": 25.25,
            "x": 2198.715067768356
        },
        {
            "onset": 25.5,
            "x": 2217.7729977531353
        },
        {
            "onset": 25.75,
            "x": 2236.830927737915
        },
        {
            "onset": 26.0,
            "x": 2254.9375639631817
        },
        {
            "onset": 26.25,
            "x": 2273.9954939479603
        },
        {
            "onset": 26.5,
            "x": 2293.05342393274
        },
        {
            "onset": 26.75,
            "x": 2312.1113539175194
        },
        {
            "onset": 27.0,
            "x": 2331.169283902298
        },
        {
            "onset": 27.25,
            "x": 2350.227213887078
        },
        {
            "onset": 27.5,
            "x": 2369.285143871857
        },
        {
            "onset": 27.75,
            "x": 2386.4404863376108
        },
        {
            "onset": 28.0,
            "x": 2413.6185412770856
        },
        {
            "onset": 28.25,
            "x": 2432.676471261864
        },
        {
            "onset": 28.5,
            "x": 2451.7344012466438
        },
        {
            "onset": 28.75,
            "x": 2470.7923312314233
        },
        {
            "onset": 29.0,
            "x": 2489.850261216203
        },
        {
            "onset": 29.25,
            "x": 2508.5116310792164
        },
        {
            "onset": 29.5,
            "x": 2527.569561063996
        },
        {
            "onset": 29.75,
            "x": 2553.096288613463
        },
        {
            "onset": 30.0,
            "x": 2571.27238993984
        },
        {
            "onset": 30.25,
            "x": 2590.3303199246193
        },
        {
            "onset": 30.5,
            "x": 2609.388249909399
        },
        {
            "onset": 30.75,
            "x": 2628.4461798941784
        },
        {
            "onset": 31.0,
            "x": 2647.504109878957
        },
        {
            "onset": 31.25,
            "x": 2666.562039863737
        },
        {
            "onset": 31.5,
            "x": 2685.619969848516
        },
        {
            "onset": 31.75,
            "x": 2702.7753123142697
        },
        {
            "onset": 32.0,
            "x": 2730.340221714863
        },
        {
            "onset": 32.25,
            "x": 2749.3981516996428
        },
        {
            "onset": 32.5,
            "x": 2768.456081684422
        },
        {
            "onset": 32.75,
            "x": 2787.5140116692014
        },
        {
            "onset": 33.0,
            "x": 2806.5719416539805
        },
        {
            "onset": 33.25,
            "x": 2825.6298716387596
        },
        {
            "onset": 33.5,
            "x": 2844.687801623539
        },
        {
            "onset": 33.75,
            "x": 2863.7457316083182
        },
        {
            "onset": 34.0,
            "x": 2882.1211349568725
        },
        {
            "onset": 34.25,
            "x": 2901.1790649416516
        },
        {
            "onset": 34.5,
            "x": 2920.236994926431
        },
        {
            "onset": 34.75,
            "x": 2939.2949249112103
        },
        {
            "onset": 35.0,
            "x": 2958.3528548959894
        },
        {
            "onset": 35.25,
            "x": 2977.410784880769
        },
        {
            "onset": 35.5,
            "x": 2996.468714865548
        },
        {
            "onset": 35.75,
            "x": 3015.526644850327
        },
        {
            "onset": 36.0,
            "x": 3045.3486952236003
        },
        {
            "onset": 36.25,
            "x": 3064.4066252083794
        },
        {
            "onset": 36.5,
            "x": 3083.4645551931585
        },
        {
            "onset": 36.75,
            "x": 3102.5224851779376
        },
        {
            "onset": 37.0,
            "x": 3121.7195589983335
        },
        {
            "onset": 37.25,
            "x": 3140.2417850257307
        },
        {
            "onset": 37.5,
            "x": 3159.29971501051
        },
        {
            "onset": 37.75,
            "x": 3178.3576449952893
        },
        {
            "onset": 38.0,
            "x": 3196.464281220555
        },
        {
            "onset": 38.25,
            "x": 3215.522211205335
        },
        {
            "onset": 38.5,
            "x": 3234.5801411901143
        },
        {
            "onset": 38.75,
            "x": 3253.6380711748934
        },
        {
            "onset": 39.0,
            "x": 3272.6960011596725
        },
        {
            "onset": 39.25,
            "x": 3298.22272870914
        },
        {
            "onset": 39.5,
            "x": 3317.280658693919
        },
        {
            "onset": 39.75,
            "x": 3336.3385886786987
        },
        {
            "onset": 40.0,
            "x": 3370.9722160977017
        },
        {
            "onset": 40.25,
            "x": 3388.1275585634553
        },
        {
            "onset": 40.5,
            "x": 3413.654286112923
        },
        {
            "onset": 40.75,
            "x": 3432.712216097702
        },
        {
            "onset": 41.0,
            "x": 3451.7701460824815
        },
        {
            "onset": 41.25,
            "x": 3470.82807606726
        },
        {
            "onset": 41.5,
            "x": 3489.8860060520396
        },
        {
            "onset": 41.75,
            "x": 3507.041348517793
        },
        {
            "onset": 42.0,
            "x": 3529.4934946365142
        },
        {
            "onset": 42.25,
            "x": 3548.551424621294
        },
        {
            "onset": 42.5,
            "x": 3567.6093546060733
        },
        {
            "onset": 42.75,
            "x": 3590.0615007247948
        },
        {
            "onset": 43.0,
            "x": 3609.1194307095743
        },
        {
            "onset": 43.25,
            "x": 3628.1773606943534
        },
        {
            "onset": 43.5,
            "x": 3647.2352906791325
        },
        {
            "onset": 43.75,
            "x": 3666.293220663912
        },
        {
            "onset": 44.0,
            "x": 3700.4957473001373
        },
        {
            "onset": 44.25,
            "x": 3717.6510897658904
        },
        {
            "onset": 44.5,
            "x": 3736.70901975067
        },
        {
            "onset": 44.75,
            "x": 3755.7669497354495
        },
        {
            "onset": 45.0,
            "x": 3774.8248797202286
        },
        {
            "onset": 45.25,
            "x": 3793.8828097050077
        },
        {
            "onset": 45.5,
            "x": 3812.9407396897864
        },
        {
            "onset": 45.75,
            "x": 3830.09608215554
        },
        {
            "onset": 46.0,
            "x": 3847.251424621294
        },
        {
            "onset": 46.25,
            "x": 3866.3093546060736
        },
        {
            "onset": 46.5,
            "x": 3885.3672845908527
        },
        {
            "onset": 46.75,
            "x": 3904.4252145756313
        },
        {
            "onset": 47.0,
            "x": 3923.4831445604113
        },
        {
            "onset": 47.25,
            "x": 3942.5410745451904
        },
        {
            "onset": 47.5,
            "x": 3961.59900452997
        },
        {
            "onset": 47.75,
            "x": 3980.656934514749
        },
        {
            "onset": 48.0,
            "x": 4008.6232042835395
        },
        {
            "onset": 48.25,
            "x": 4034.149931833006
        },
        {
            "onset": 48.5,
            "x": 4053.2078618177857
        },
        {
            "onset": 48.75,
            "x": 4072.2657918025657
        },
        {
            "onset": 49.0,
            "x": 4091.3237217873448
        },
        {
            "onset": 49.25,
            "x": 4110.381651772124
        },
        {
            "onset": 49.5,
            "x": 4129.439581756902
        },
        {
            "onset": 49.75,
            "x": 4146.594924222656
        },
        {
            "onset": 50.0,
            "x": 4163.750266688408
        },
        {
            "onset": 50.25,
            "x": 4186.202412807132
        },
        {
            "onset": 50.5,
            "x": 4205.260342791911
        },
        {
            "onset": 50.75,
            "x": 4224.31827277669
        },
        {
            "onset": 51.0,
            "x": 4243.376202761468
        },
        {
            "onset": 51.25,
            "x": 4262.434132746248
        },
        {
            "onset": 51.5,
            "x": 4281.4920627310275
        },
        {
            "onset": 51.75,
            "x": 4300.549992715807
        },
        {
            "onset": 52.0,
            "x": 4327.149718670723
        },
        {
            "onset": 52.25,
            "x": 4352.676446220191
        },
        {
            "onset": 52.5,
            "x": 4371.734376204969
        },
        {
            "onset": 52.75,
            "x": 4390.792306189749
        },
        {
            "onset": 53.0,
            "x": 4409.850236174535
        },
        {
            "onset": 53.25,
            "x": 4428.908166159315
        },
        {
            "onset": 53.5,
            "x": 4447.966096144094
        },
        {
            "onset": 53.75,
            "x": 4465.121438609847
        },
        {
            "onset": 54.0,
            "x": 4482.276781075601
        },
        {
            "onset": 54.25,
            "x": 4504.728927194324
        },
        {
            "onset": 54.5,
            "x": 4523.786857179102
        },
        {
            "onset": 54.75,
            "x": 4542.844787163881
        },
        {
            "onset": 55.0,
            "x": 4561.9027171486605
        },
        {
            "onset": 55.25,
            "x": 4580.960647133441
        },
        {
            "onset": 55.5,
            "x": 4600.018577118219
        },
        {
            "onset": 55.75,
            "x": 4619.076507102999
        },
        {
            "onset": 56.0,
            "x": 4645.144714321957
        },
        {
            "onset": 56.25,
            "x": 4664.202644306743
        },
        {
            "onset": 56.5,
            "x": 4683.260574291522
        },
        {
            "onset": 56.75,
            "x": 4702.318504276302
        },
        {
            "onset": 57.0,
            "x": 4721.515364463296
        },
        {
            "onset": 57.25,
            "x": 4740.573294448074
        },
        {
            "onset": 57.5,
            "x": 4759.631224432855
        },
        {
            "onset": 57.75,
            "x": 4776.786566898607
        },
        {
            "onset": 58.0,
            "x": 4795.8444968833865
        },
        {
            "onset": 58.25,
            "x": 4814.902426868166
        },
        {
            "onset": 58.5,
            "x": 4833.960356852945
        },
        {
            "onset": 58.75,
            "x": 4853.018286837725
        },
        {
            "onset": 59.0,
            "x": 4872.076216822505
        },
        {
            "onset": 59.25,
            "x": 4891.134146807291
        },
        {
            "onset": 59.5,
            "x": 4910.192076792071
        },
        {
            "onset": 59.75,
            "x": 4927.347419257823
        },
        {
            "onset": 60.0,
            "x": 4961.651112451995
        },
        {
            "onset": 60.25,
            "x": 4980.709042436773
        },
        {
            "onset": 60.5,
            "x": 4999.766972421553
        },
        {
            "onset": 60.75,
            "x": 5018.824902406332
        },
        {
            "onset": 61.0,
            "x": 5037.743902188897
        },
        {
            "onset": 61.25,
            "x": 5056.801832173676
        },
        {
            "onset": 61.5,
            "x": 5075.859762158454
        },
        {
            "onset": 61.75,
            "x": 5094.9176921432345
        },
        {
            "onset": 62.0,
            "x": 5113.975622128014
        },
        {
            "onset": 62.25,
            "x": 5133.033552112794
        },
        {
            "onset": 62.5,
            "x": 5152.091482097572
        },
        {
            "onset": 62.75,
            "x": 5169.246824563325
        },
        {
            "onset": 63.0,
            "x": 5186.40216702908
        },
        {
            "onset": 63.25,
            "x": 5204.666976770328
        },
        {
            "onset": 63.5,
            "x": 5230.193704319795
        },
        {
            "onset": 63.75,
            "x": 5255.720431869262
        },
        {
            "onset": 64.0,
            "x": 5284.188016126713
        },
        {
            "onset": 64.25,
            "x": 5309.7147436761725
        },
        {
            "onset": 64.5,
            "x": 5328.772673660959
        },
        {
            "onset": 64.75,
            "x": 5347.830603645739
        },
        {
            "onset": 65.0,
            "x": 5366.8885336305175
        },
        {
            "onset": 65.25,
            "x": 5385.946463615297
        },
        {
            "onset": 65.5,
            "x": 5405.004393600077
        },
        {
            "onset": 65.75,
            "x": 5422.15973606583
        },
        {
            "onset": 66.0,
            "x": 5439.315078531583
        },
        {
            "onset": 66.25,
            "x": 5461.724606689878
        },
        {
            "onset": 66.5,
            "x": 5480.782536674658
        },
        {
            "onset": 66.75,
            "x": 5499.840466659437
        },
        {
            "onset": 67.0,
            "x": 5518.828931543106
        },
        {
            "onset": 67.25,
            "x": 5537.886861527885
        },
        {
            "onset": 67.5,
            "x": 5556.944791512664
        },
        {
            "onset": 67.75,
            "x": 5576.002721497443
        },
        {
            "onset": 68.0,
            "x": 5605.0139021889045
        },
        {
            "onset": 68.25,
            "x": 5622.169244654658
        },
        {
            "onset": 68.5,
            "x": 5641.227174639437
        },
        {
            "onset": 68.75,
            "x": 5660.285104624217
        },
        {
            "onset": 69.0,
            "x": 5679.343034608995
        },
        {
            "onset": 69.25,
            "x": 5698.400964593776
        },
        {
            "onset": 69.5,
            "x": 5717.4588945785545
        },
        {
            "onset": 69.75,
            "x": 5734.614237044308
        },
        {
            "onset": 70.0,
            "x": 5751.769579510062
        },
        {
            "onset": 70.25,
            "x": 5770.82750949484
        },
        {
            "onset": 70.5,
            "x": 5789.885439479621
        },
        {
            "onset": 70.75,
            "x": 5808.9433694643985
        },
        {
            "onset": 71.0,
            "x": 5828.001299449178
        },
        {
            "onset": 71.25,
            "x": 5847.059229433958
        },
        {
            "onset": 71.5,
            "x": 5866.117159418736
        },
        {
            "onset": 71.75,
            "x": 5885.175089403516
        },
        {
            "onset": 72.0,
            "x": 5913.6426736609665
        },
        {
            "onset": 72.25,
            "x": 5932.700603645747
        },
        {
            "onset": 72.5,
            "x": 5951.758533630526
        },
        {
            "onset": 72.75,
            "x": 5970.816463615304
        },
        {
            "onset": 73.0,
            "x": 5989.874393600084
        },
        {
            "onset": 73.25,
            "x": 6008.932323584863
        },
        {
            "onset": 73.5,
            "x": 6027.990253569642
        },
        {
            "onset": 73.75,
            "x": 6045.145596035397
        },
        {
            "onset": 74.0,
            "x": 6062.30093850115
        },
        {
            "onset": 74.25,
            "x": 6083.261456004954
        },
        {
            "onset": 74.5,
            "x": 6102.319385989735
        },
        {
            "onset": 74.75,
            "x": 6121.377315974513
        },
        {
            "onset": 75.0,
            "x": 6140.435245959293
        },
        {
            "onset": 75.25,
            "x": 6160.047909581819
        },
        {
            "onset": 75.5,
            "x": 6178.5270496122685
        },
        {
            "onset": 75.75,
            "x": 6198.1637695513855
        },
        {
            "onset": 76.0,
            "x": 6227.539145104041
        },
        {
            "onset": 76.25,
            "x": 6246.398795027938
        },
        {
            "onset": 76.5,
            "x": 6265.4567250127175
        },
        {
            "onset": 76.75,
            "x": 6284.514654997496
        },
        {
            "onset": 77.0,
            "x": 6303.572584982277
        },
        {
            "onset": 77.25,
            "x": 6322.630514967055
        },
        {
            "onset": 77.5,
            "x": 6341.688444951834
        },
        {
            "onset": 77.75,
            "x": 6358.843787417588
        },
        {
            "onset": 78.0,
            "x": 6378.107081611979
        },
        {
            "onset": 78.25,
            "x": 6397.165011596758
        },
        {
            "onset": 78.5,
            "x": 6416.222941581537
        },
        {
            "onset": 78.75,
            "x": 6435.280871566318
        },
        {
            "onset": 79.0,
            "x": 6453.94224142933
        },
        {
            "onset": 79.25,
            "x": 6473.000171414109
        },
        {
            "onset": 79.5,
            "x": 6492.058101398889
        },
        {
            "onset": 79.75,
            "x": 6517.5848289483565
        },
        {
            "onset": 80.0,
            "x": 6545.605458360548
        },
        {
            "onset": 80.25,
            "x": 6571.132185910014
        },
        {
            "onset": 80.5,
            "x": 6590.190115894795
        },
        {
            "onset": 80.75,
            "x": 6609.248045879573
        },
        {
            "onset": 81.0,
            "x": 6628.305975864354
        },
        {
            "onset": 81.25,
            "x": 6647.363905849133
        },
        {
            "onset": 81.5,
            "x": 6666.421835833912
        },
        {
            "onset": 81.75,
            "x": 6685.479765818693
        },
        {
            "onset": 82.0,
            "x": 6701.6807834312185
        },
        {
            "onset": 82.25,
            "x": 6720.738713415997
        },
        {
            "onset": 82.5,
            "x": 6739.796643400776
        },
        {
            "onset": 82.75,
            "x": 6758.854573385556
        },
        {
            "onset": 83.0,
            "x": 6777.912503370336
        },
        {
            "onset": 83.25,
            "x": 6796.573873233348
        },
        {
            "onset": 83.5,
            "x": 6815.631803218128
        },
        {
            "onset": 83.75,
            "x": 6834.689733202908
        },
        {
            "onset": 84.0,
            "x": 6864.466631260457
        },
        {
            "onset": 84.25,
            "x": 6883.524561245236
        },
        {
            "onset": 84.5,
            "x": 6902.582491230016
        },
        {
            "onset": 84.75,
            "x": 6921.640421214795
        },
        {
            "onset": 85.0,
            "x": 6940.767816300685
        },
        {
            "onset": 85.25,
            "x": 6959.8257462854635
        },
        {
            "onset": 85.5,
            "x": 6982.277892404187
        },
        {
            "onset": 85.75,
            "x": 6999.433234869938
        },
        {
            "onset": 86.0,
            "x": 7016.588577335693
        },
        {
            "onset": 86.25,
            "x": 7035.646507320471
        },
        {
            "onset": 86.5,
            "x": 7054.704437305252
        },
        {
            "onset": 86.75,
            "x": 7073.762367290031
        },
        {
            "onset": 87.0,
            "x": 7092.8202972748095
        },
        {
            "onset": 87.25,
            "x": 7111.878227259591
        },
        {
            "onset": 87.5,
            "x": 7130.936157244369
        },
        {
            "onset": 87.75,
            "x": 7149.994087229147
        },
        {
            "onset": 88.0,
            "x": 7180.386913858128
        },
        {
            "onset": 88.25,
            "x": 7199.444843842908
        },
        {
            "onset": 88.5,
            "x": 7218.502773827686
        },
        {
            "onset": 88.75,
            "x": 7237.560703812467
        },
        {
            "onset": 89.0,
            "x": 7256.618633797245
        },
        {
            "onset": 89.25,
            "x": 7275.676563782025
        },
        {
            "onset": 89.5,
            "x": 7294.734493766804
        },
        {
            "onset": 89.75,
            "x": 7311.889836232556
        },
        {
            "onset": 90.0,
            "x": 7333.625437450213
        },
        {
            "onset": 90.25,
            "x": 7353.357294375633
        },
        {
            "onset": 90.5,
            "x": 7372.415224360411
        },
        {
            "onset": 90.75,
            "x": 7391.473154345197
        },
        {
            "onset": 91.0,
            "x": 7410.531084329978
        },
        {
            "onset": 91.25,
            "x": 7429.589014314756
        },
        {
            "onset": 91.5,
            "x": 7448.646944299536
        },
        {
            "onset": 91.75,
            "x": 7467.704874284314
        },
        {
            "onset": 92.0,
            "x": 7498.300643581987
        },
        {
            "onset": 92.25,
            "x": 7517.358573566766
        },
        {
            "onset": 92.5,
            "x": 7536.416503551545
        },
        {
            "onset": 92.75,
            "x": 7558.826031709841
        },
        {
            "onset": 93.0,
            "x": 7577.88396169462
        },
        {
            "onset": 93.25,
            "x": 7596.941891679398
        },
        {
            "onset": 93.5,
            "x": 7615.999821664179
        },
        {
            "onset": 93.75,
            "x": 7633.155164129931
        },
        {
            "onset": 94.0,
            "x": 7649.636579655045
        },
        {
            "onset": 94.25,
            "x": 7669.368436580466
        },
        {
            "onset": 94.5,
            "x": 7688.426366565244
        },
        {
            "onset": 94.75,
            "x": 7707.48429655003
        },
        {
            "onset": 95.0,
            "x": 7726.542226534811
        },
        {
            "onset": 95.25,
            "x": 7745.600156519589
        },
        {
            "onset": 95.5,
            "x": 7764.658086504369
        },
        {
            "onset": 95.75,
            "x": 7783.716016489149
        },
        {
            "onset": 96.0,
            "x": 7812.7271971805985
        },
        {
            "onset": 96.25,
            "x": 7831.785127165374
        },
        {
            "onset": 96.5,
            "x": 7850.843057150152
        },
        {
            "onset": 96.75,
            "x": 7869.900987134933
        },
        {
            "onset": 97.0,
            "x": 7888.958917119711
        },
        {
            "onset": 97.25,
            "x": 7908.016847104491
        },
        {
            "onset": 97.5,
            "x": 7927.074777089269
        },
        {
            "onset": 97.75,
            "x": 7946.132707074048
        },
        {
            "onset": 98.0,
            "x": 7963.288049539802
        },
        {
            "onset": 98.25,
            "x": 7982.345979524583
        },
        {
            "onset": 98.5,
            "x": 8001.403909509361
        },
        {
            "onset": 98.75,
            "x": 8020.461839494139
        },
        {
            "onset": 99.0,
            "x": 8039.321489418038
        },
        {
            "onset": 99.25,
            "x": 8058.181139341933
        },
        {
            "onset": 99.5,
            "x": 8077.239069326713
        },
        {
            "onset": 99.75,
            "x": 8096.296999311493
        },
        {
            "onset": 100.0,
            "x": 8124.884628614994
        },
        {
            "onset": 100.25,
            "x": 8143.942558599772
        },
        {
            "onset": 100.5,
            "x": 8163.00048858455
        },
        {
            "onset": 100.75,
            "x": 8182.058418569331
        },
        {
            "onset": 101.0,
            "x": 8201.116348554111
        },
        {
            "onset": 101.25,
            "x": 8220.17427853889
        },
        {
            "onset": 101.5,
            "x": 8239.232208523666
        },
        {
            "onset": 101.75,
            "x": 8256.38755098942
        },
        {
            "onset": 102.0,
            "x": 8275.4454809742
        },
        {
            "onset": 102.25,
            "x": 8294.503410958983
        },
        {
            "onset": 102.5,
            "x": 8313.561340943761
        },
        {
            "onset": 102.75,
            "x": 8332.619270928539
        },
        {
            "onset": 103.0,
            "x": 8351.677200913316
        },
        {
            "onset": 103.25,
            "x": 8370.735130898098
        },
        {
            "onset": 103.5,
            "x": 8389.793060882877
        },
        {
            "onset": 103.75,
            "x": 8408.850990867657
        },
        {
            "onset": 104.0,
            "x": 8436.1099790535
        },
        {
            "onset": 104.25,
            "x": 8455.16790903828
        },
        {
            "onset": 104.5,
            "x": 8474.225839023062
        },
        {
            "onset": 104.75,
            "x": 8493.28376900784
        },
        {
            "onset": 105.0,
            "x": 8512.341698992619
        },
        {
            "onset": 105.25,
            "x": 8531.399628977397
        },
        {
            "onset": 105.5,
            "x": 8550.457558962176
        },
        {
            "onset": 105.75,
            "x": 8569.515488946956
        },
        {
            "onset": 106.0,
            "x": 8588.573418931737
        },
        {
            "onset": 106.25,
            "x": 8607.631348916513
        },
        {
            "onset": 106.5,
            "x": 8626.689278901295
        },
        {
            "onset": 106.75,
            "x": 8649.141425020014
        },
        {
            "onset": 107.0,
            "x": 8668.199355004796
        },
        {
            "onset": 107.25,
            "x": 8687.257284989575
        },
        {
            "onset": 107.5,
            "x": 8706.315214974355
        },
        {
            "onset": 107.75,
            "x": 8725.373144959132
        },
        {
            "onset": 108.0,
            "x": 8751.972870914004
        },
        {
            "onset": 108.25,
            "x": 8771.030800898783
        },
        {
            "onset": 108.5,
            "x": 8790.08873088356
        },
        {
            "onset": 108.75,
            "x": 8807.244073349315
        },
        {
            "onset": 109.0,
            "x": 8828.343734688737
        },
        {
            "onset": 109.25,
            "x": 8845.359933318874
        },
        {
            "onset": 109.5,
            "x": 8864.417863303652
        },
        {
            "onset": 109.75,
            "x": 8883.475793288433
        },
        {
            "onset": 110.0,
            "x": 8902.672653475496
        },
        {
            "onset": 110.25,
            "x": 8921.33402333851
        },
        {
            "onset": 110.5,
            "x": 8940.391953323287
        },
        {
            "onset": 110.75,
            "x": 8959.449883308067
        },
        {
            "onset": 111.0,
            "x": 8978.507813292847
        },
        {
            "onset": 111.25,
            "x": 8997.565743277626
        },
        {
            "onset": 111.5,
            "x": 9016.623673262404
        },
        {
            "onset": 111.75,
            "x": 9035.681603247187
        },
        {
            "onset": 112.0,
            "x": 9072.406763064539
        }
    ],
    "staffs": [
        {
            "bottom": 102.9,
            "notespos": [],
            "top": 0
        },
        {
            "bottom": 210.9,
            "notespos": [],
            "top": 108
        },
        {
            "bottom": 318.9,
            "notespos": [],
            "top": 216
        }
    ]
}