{
    "composer": "fantasias-VNoordt_F2",
    "id": "fantasias-VNoordt_F2",
    "sources": {
        "audios": [
            {
                "file": "fantasia-no-2.mp3",
                "images": [
                    {
                        "image": "fantasia-no-2-waves.png",
                        "positions": "fantasia-no-2-waves-pos.json",
                        "type": "wave"
                    }
                ],
                "onset-date": "synchro.json"
            }
        ],
        "images": [
            {
                "image": "fantasias-VNoordt_F2.png",
                "positions": "positions.json",
                "type": "score"
            }
        ]
    },
    "time-signature": "2/2",
    "title": "VNoordt_F2.krn"
}
