{
    "date-x": [
        {
            "date": 0,
            "x": 0
        },
        {
            "date": 98.835736961,
            "x": 2860
        }
    ],
    "staffs": [
        {
            "bottom": 70.0,
            "top": 5.0
        },
        {
            "bottom": 145.0,
            "top": 80.0
        },
        {
            "bottom": 220.0,
            "top": 155.0
        },
        {
            "bottom": 295.0,
            "top": 230.0
        }
    ]
}