%YAML 1.1
%TAG !u! tag:unity3d.com,2011:
--- !u!1001 &9149821130882294143
PrefabInstance:
  m_ObjectHideFlags: 0
  serializedVersion: 2
  m_Modification:
    m_TransformParent: {fileID: 0}
    m_Modifications:
    - target: {fileID: 1017743611004216448, guid: fcdc2a8e41b5e79418f8dc3f3ada5559, type: 3}
      propertyPath: m_Mesh
      value: 
      objectReference: {fileID: 4300000, guid: 8c165d25ac4df514aa07a93e06b4da2c, type: 3}
    - target: {fileID: 1037123172203875190, guid: fcdc2a8e41b5e79418f8dc3f3ada5559, type: 3}
      propertyPath: m_Name
      value: Hammer_1
      objectReference: {fileID: 0}
    - target: {fileID: 1037123172203875191, guid: fcdc2a8e41b5e79418f8dc3f3ada5559, type: 3}
      propertyPath: value.Vfx
      value: 
      objectReference: {fileID: 1758024991200994, guid: d8689b59ce174534ea84ba501853eb50, type: 3}
    - target: {fileID: 1042370237476716356, guid: fcdc2a8e41b5e79418f8dc3f3ada5559, type: 3}
      propertyPath: m_RootOrder
      value: 0
      objectReference: {fileID: 0}
    - target: {fileID: 1042370237476716356, guid: fcdc2a8e41b5e79418f8dc3f3ada5559, type: 3}
      propertyPath: m_LocalScale.x
      value: 100
      objectReference: {fileID: 0}
    - target: {fileID: 1042370237476716356, guid: fcdc2a8e41b5e79418f8dc3f3ada5559, type: 3}
      propertyPath: m_LocalScale.y
      value: 100
      objectReference: {fileID: 0}
    - target: {fileID: 1042370237476716356, guid: fcdc2a8e41b5e79418f8dc3f3ada5559, type: 3}
      propertyPath: m_LocalScale.z
      value: 100
      objectReference: {fileID: 0}
    - target: {fileID: 1042370237476716356, guid: fcdc2a8e41b5e79418f8dc3f3ada5559, type: 3}
      propertyPath: m_LocalPosition.x
      value: 0
      objectReference: {fileID: 0}
    - target: {fileID: 1042370237476716356, guid: fcdc2a8e41b5e79418f8dc3f3ada5559, type: 3}
      propertyPath: m_LocalPosition.y
      value: 0
      objectReference: {fileID: 0}
    - target: {fileID: 1042370237476716356, guid: fcdc2a8e41b5e79418f8dc3f3ada5559, type: 3}
      propertyPath: m_LocalPosition.z
      value: 0
      objectReference: {fileID: 0}
    - target: {fileID: 1042370237476716356, guid: fcdc2a8e41b5e79418f8dc3f3ada5559, type: 3}
      propertyPath: m_LocalRotation.w
      value: 0.5
      objectReference: {fileID: 0}
    - target: {fileID: 1042370237476716356, guid: fcdc2a8e41b5e79418f8dc3f3ada5559, type: 3}
      propertyPath: m_LocalRotation.x
      value: -0.5
      objectReference: {fileID: 0}
    - target: {fileID: 1042370237476716356, guid: fcdc2a8e41b5e79418f8dc3f3ada5559, type: 3}
      propertyPath: m_LocalRotation.y
      value: 0.5
      objectReference: {fileID: 0}
    - target: {fileID: 1042370237476716356, guid: fcdc2a8e41b5e79418f8dc3f3ada5559, type: 3}
      propertyPath: m_LocalRotation.z
      value: -0.5
      objectReference: {fileID: 0}
    - target: {fileID: 1042370237476716356, guid: fcdc2a8e41b5e79418f8dc3f3ada5559, type: 3}
      propertyPath: m_LocalEulerAnglesHint.x
      value: 0
      objectReference: {fileID: 0}
    - target: {fileID: 1042370237476716356, guid: fcdc2a8e41b5e79418f8dc3f3ada5559, type: 3}
      propertyPath: m_LocalEulerAnglesHint.y
      value: 90
      objectReference: {fileID: 0}
    - target: {fileID: 1042370237476716356, guid: fcdc2a8e41b5e79418f8dc3f3ada5559, type: 3}
      propertyPath: m_LocalEulerAnglesHint.z
      value: -90
      objectReference: {fileID: 0}
    - target: {fileID: 8135612887664278327, guid: fcdc2a8e41b5e79418f8dc3f3ada5559, type: 3}
      propertyPath: value.Damage
      value: 20
      objectReference: {fileID: 0}
    - target: {fileID: 8135612887664278327, guid: fcdc2a8e41b5e79418f8dc3f3ada5559, type: 3}
      propertyPath: value.TimeBetweenAttacks
      value: 5
      objectReference: {fileID: 0}
    - target: {fileID: 8135612887664278327, guid: fcdc2a8e41b5e79418f8dc3f3ada5559, type: 3}
      propertyPath: value.AnimationController
      value: 
      objectReference: {fileID: 22100000, guid: fad07950a2c1342419c39b4c34fdf4af, type: 2}
    m_RemovedComponents: []
  m_SourcePrefab: {fileID: 100100000, guid: fcdc2a8e41b5e79418f8dc3f3ada5559, type: 3}
