%YAML 1.1
%TAG !u! tag:unity3d.com,2011:
--- !u!1001 &138637796973490657
PrefabInstance:
  m_ObjectHideFlags: 0
  serializedVersion: 2
  m_Modification:
    m_TransformParent: {fileID: 0}
    m_Modifications:
    - target: {fileID: 3248686929928326678, guid: de5b63bb739194445b2bb493d3465257, type: 3}
      propertyPath: value.Damage
      value: 180
      objectReference: {fileID: 0}
    - target: {fileID: 6018244414113679973, guid: de5b63bb739194445b2bb493d3465257, type: 3}
      propertyPath: m_RootOrder
      value: 0
      objectReference: {fileID: 0}
    - target: {fileID: 6018244414113679973, guid: de5b63bb739194445b2bb493d3465257, type: 3}
      propertyPath: m_LocalPosition.x
      value: -0.9
      objectReference: {fileID: 0}
    - target: {fileID: 6018244414113679973, guid: de5b63bb739194445b2bb493d3465257, type: 3}
      propertyPath: m_LocalPosition.y
      value: 2.2
      objectReference: {fileID: 0}
    - target: {fileID: 6018244414113679973, guid: de5b63bb739194445b2bb493d3465257, type: 3}
      propertyPath: m_LocalPosition.z
      value: -2.9
      objectReference: {fileID: 0}
    - target: {fileID: 6018244414113679973, guid: de5b63bb739194445b2bb493d3465257, type: 3}
      propertyPath: m_LocalRotation.w
      value: 0
      objectReference: {fileID: 0}
    - target: {fileID: 6018244414113679973, guid: de5b63bb739194445b2bb493d3465257, type: 3}
      propertyPath: m_LocalRotation.x
      value: 0
      objectReference: {fileID: 0}
    - target: {fileID: 6018244414113679973, guid: de5b63bb739194445b2bb493d3465257, type: 3}
      propertyPath: m_LocalRotation.y
      value: 0.70710677
      objectReference: {fileID: 0}
    - target: {fileID: 6018244414113679973, guid: de5b63bb739194445b2bb493d3465257, type: 3}
      propertyPath: m_LocalRotation.z
      value: -0.70710677
      objectReference: {fileID: 0}
    - target: {fileID: 6018244414113679973, guid: de5b63bb739194445b2bb493d3465257, type: 3}
      propertyPath: m_LocalEulerAnglesHint.x
      value: 90
      objectReference: {fileID: 0}
    - target: {fileID: 6018244414113679973, guid: de5b63bb739194445b2bb493d3465257, type: 3}
      propertyPath: m_LocalEulerAnglesHint.y
      value: 90
      objectReference: {fileID: 0}
    - target: {fileID: 6018244414113679973, guid: de5b63bb739194445b2bb493d3465257, type: 3}
      propertyPath: m_LocalEulerAnglesHint.z
      value: -90
      objectReference: {fileID: 0}
    - target: {fileID: 6023209747779255895, guid: de5b63bb739194445b2bb493d3465257, type: 3}
      propertyPath: m_Name
      value: Staff_5 Variant
      objectReference: {fileID: 0}
    - target: {fileID: 6047744075720872353, guid: de5b63bb739194445b2bb493d3465257, type: 3}
      propertyPath: m_Mesh
      value: 
      objectReference: {fileID: 4300000, guid: ff9d8a89d4cca474daf85bc86d619ea4, type: 3}
    m_RemovedComponents: []
  m_SourcePrefab: {fileID: 100100000, guid: de5b63bb739194445b2bb493d3465257, type: 3}
