%YAML 1.1
%TAG !u! tag:unity3d.com,2011:
--- !u!1001 &5893425878413120512
PrefabInstance:
  m_ObjectHideFlags: 0
  serializedVersion: 2
  m_Modification:
    m_TransformParent: {fileID: 8146776617887949474}
    m_Modifications:
    - target: {fileID: 4127524681717193909, guid: f9d2722ed58c34e42b02db64790e80fe, type: 3}
      propertyPath: m_RootOrder
      value: 1
      objectReference: {fileID: 0}
    - target: {fileID: 4127524681717193909, guid: f9d2722ed58c34e42b02db64790e80fe, type: 3}
      propertyPath: m_LocalPosition.x
      value: 0
      objectReference: {fileID: 0}
    - target: {fileID: 4127524681717193909, guid: f9d2722ed58c34e42b02db64790e80fe, type: 3}
      propertyPath: m_LocalPosition.y
      value: 0
      objectReference: {fileID: 0}
    - target: {fileID: 4127524681717193909, guid: f9d2722ed58c34e42b02db64790e80fe, type: 3}
      propertyPath: m_LocalPosition.z
      value: 0
      objectReference: {fileID: 0}
    - target: {fileID: 4127524681717193909, guid: f9d2722ed58c34e42b02db64790e80fe, type: 3}
      propertyPath: m_LocalRotation.w
      value: 1
      objectReference: {fileID: 0}
    - target: {fileID: 4127524681717193909, guid: f9d2722ed58c34e42b02db64790e80fe, type: 3}
      propertyPath: m_LocalRotation.x
      value: 0
      objectReference: {fileID: 0}
    - target: {fileID: 4127524681717193909, guid: f9d2722ed58c34e42b02db64790e80fe, type: 3}
      propertyPath: m_LocalRotation.y
      value: 0
      objectReference: {fileID: 0}
    - target: {fileID: 4127524681717193909, guid: f9d2722ed58c34e42b02db64790e80fe, type: 3}
      propertyPath: m_LocalRotation.z
      value: 0
      objectReference: {fileID: 0}
    - target: {fileID: 4127524681717193909, guid: f9d2722ed58c34e42b02db64790e80fe, type: 3}
      propertyPath: m_LocalEulerAnglesHint.x
      value: 0
      objectReference: {fileID: 0}
    - target: {fileID: 4127524681717193909, guid: f9d2722ed58c34e42b02db64790e80fe, type: 3}
      propertyPath: m_LocalEulerAnglesHint.y
      value: 0
      objectReference: {fileID: 0}
    - target: {fileID: 4127524681717193909, guid: f9d2722ed58c34e42b02db64790e80fe, type: 3}
      propertyPath: m_LocalEulerAnglesHint.z
      value: 0
      objectReference: {fileID: 0}
    - target: {fileID: 4129433271738289833, guid: f9d2722ed58c34e42b02db64790e80fe, type: 3}
      propertyPath: m_Name
      value: Skeleton
      objectReference: {fileID: 0}
    m_RemovedComponents:
    - {fileID: 4043385730642099063, guid: f9d2722ed58c34e42b02db64790e80fe, type: 3}
  m_SourcePrefab: {fileID: 100100000, guid: f9d2722ed58c34e42b02db64790e80fe, type: 3}
--- !u!4 &7534045301263403189 stripped
Transform:
  m_CorrespondingSourceObject: {fileID: 4127524681717193909, guid: f9d2722ed58c34e42b02db64790e80fe, type: 3}
  m_PrefabInstance: {fileID: 5893425878413120512}
  m_PrefabAsset: {fileID: 0}
--- !u!1001 &5893425878489155733
PrefabInstance:
  m_ObjectHideFlags: 0
  serializedVersion: 2
  m_Modification:
    m_TransformParent: {fileID: 0}
    m_Modifications:
    - target: {fileID: 2361730872674855465, guid: 0ce39951d2e9b1742b91d5e3c1c5dc30, type: 3}
      propertyPath: value._modelTransform
      value: 
      objectReference: {fileID: 7534045301263403189}
    - target: {fileID: 2361730872674855470, guid: 0ce39951d2e9b1742b91d5e3c1c5dc30, type: 3}
      propertyPath: value._stopDistance
      value: 7
      objectReference: {fileID: 0}
    - target: {fileID: 2361730872674855471, guid: 0ce39951d2e9b1742b91d5e3c1c5dc30, type: 3}
      propertyPath: m_Name
      value: Skeleton Variant
      objectReference: {fileID: 0}
    - target: {fileID: 2361730872674855472, guid: 0ce39951d2e9b1742b91d5e3c1c5dc30, type: 3}
      propertyPath: m_Avatar
      value: 
      objectReference: {fileID: 9000000, guid: be73df03abf02284486d1afabcf5d4fe, type: 3}
    - target: {fileID: 2361730872674855472, guid: 0ce39951d2e9b1742b91d5e3c1c5dc30, type: 3}
      propertyPath: m_Controller
      value: 
      objectReference: {fileID: 22100000, guid: 78fc1f221e0550046bc3a77237a992b1, type: 2}
    - target: {fileID: 2361730872674855478, guid: 0ce39951d2e9b1742b91d5e3c1c5dc30, type: 3}
      propertyPath: value._modelTransform
      value: 
      objectReference: {fileID: 7534045301263403189}
    - target: {fileID: 2361730872674855479, guid: 0ce39951d2e9b1742b91d5e3c1c5dc30, type: 3}
      propertyPath: m_RootOrder
      value: 0
      objectReference: {fileID: 0}
    - target: {fileID: 2361730872674855479, guid: 0ce39951d2e9b1742b91d5e3c1c5dc30, type: 3}
      propertyPath: m_LocalPosition.x
      value: 0
      objectReference: {fileID: 0}
    - target: {fileID: 2361730872674855479, guid: 0ce39951d2e9b1742b91d5e3c1c5dc30, type: 3}
      propertyPath: m_LocalPosition.y
      value: 0
      objectReference: {fileID: 0}
    - target: {fileID: 2361730872674855479, guid: 0ce39951d2e9b1742b91d5e3c1c5dc30, type: 3}
      propertyPath: m_LocalPosition.z
      value: 0
      objectReference: {fileID: 0}
    - target: {fileID: 2361730872674855479, guid: 0ce39951d2e9b1742b91d5e3c1c5dc30, type: 3}
      propertyPath: m_LocalRotation.w
      value: 1
      objectReference: {fileID: 0}
    - target: {fileID: 2361730872674855479, guid: 0ce39951d2e9b1742b91d5e3c1c5dc30, type: 3}
      propertyPath: m_LocalRotation.x
      value: 0
      objectReference: {fileID: 0}
    - target: {fileID: 2361730872674855479, guid: 0ce39951d2e9b1742b91d5e3c1c5dc30, type: 3}
      propertyPath: m_LocalRotation.y
      value: 0
      objectReference: {fileID: 0}
    - target: {fileID: 2361730872674855479, guid: 0ce39951d2e9b1742b91d5e3c1c5dc30, type: 3}
      propertyPath: m_LocalRotation.z
      value: 0
      objectReference: {fileID: 0}
    - target: {fileID: 2361730872674855479, guid: 0ce39951d2e9b1742b91d5e3c1c5dc30, type: 3}
      propertyPath: m_LocalEulerAnglesHint.x
      value: 0
      objectReference: {fileID: 0}
    - target: {fileID: 2361730872674855479, guid: 0ce39951d2e9b1742b91d5e3c1c5dc30, type: 3}
      propertyPath: m_LocalEulerAnglesHint.y
      value: 0
      objectReference: {fileID: 0}
    - target: {fileID: 2361730872674855479, guid: 0ce39951d2e9b1742b91d5e3c1c5dc30, type: 3}
      propertyPath: m_LocalEulerAnglesHint.z
      value: 0
      objectReference: {fileID: 0}
    - target: {fileID: 2361730872674855486, guid: 0ce39951d2e9b1742b91d5e3c1c5dc30, type: 3}
      propertyPath: value._attackRange
      value: 10
      objectReference: {fileID: 0}
    - target: {fileID: 7170619646016579915, guid: 0ce39951d2e9b1742b91d5e3c1c5dc30, type: 3}
      propertyPath: value._modelTransform
      value: 
      objectReference: {fileID: 7534045301263403189}
    m_RemovedComponents: []
  m_SourcePrefab: {fileID: 100100000, guid: 0ce39951d2e9b1742b91d5e3c1c5dc30, type: 3}
--- !u!4 &8146776617887949474 stripped
Transform:
  m_CorrespondingSourceObject: {fileID: 2361730872674855479, guid: 0ce39951d2e9b1742b91d5e3c1c5dc30, type: 3}
  m_PrefabInstance: {fileID: 5893425878489155733}
  m_PrefabAsset: {fileID: 0}
