%YAML 1.1
%TAG !u! tag:unity3d.com,2011:
--- !u!1001 &4156543680722623420
PrefabInstance:
  m_ObjectHideFlags: 0
  serializedVersion: 2
  m_Modification:
    m_TransformParent: {fileID: 7766027166266024733}
    m_Modifications:
    - target: {fileID: 2157909251018307098, guid: f0c311cee7590124aafd29465e07c53c, type: 3}
      propertyPath: value.EventListener
      value: 
      objectReference: {fileID: 6993519381607713450}
    - target: {fileID: 5155763253242034878, guid: f0c311cee7590124aafd29465e07c53c, type: 3}
      propertyPath: value._animationEventListener
      value: 
      objectReference: {fileID: 6993519381607713450}
    - target: {fileID: 5919170911190842598, guid: f0c311cee7590124aafd29465e07c53c, type: 3}
      propertyPath: value.Damage
      value: 67
      objectReference: {fileID: 0}
    - target: {fileID: 7136569039685183915, guid: f0c311cee7590124aafd29465e07c53c, type: 3}
      propertyPath: m_Mesh
      value: 
      objectReference: {fileID: 4300000, guid: bf0dcea927120e047b69a7d9dcd03088, type: 3}
    - target: {fileID: 7161517133213807215, guid: f0c311cee7590124aafd29465e07c53c, type: 3}
      propertyPath: m_RootOrder
      value: 3
      objectReference: {fileID: 0}
    - target: {fileID: 7161517133213807215, guid: f0c311cee7590124aafd29465e07c53c, type: 3}
      propertyPath: m_LocalScale.x
      value: 1.5
      objectReference: {fileID: 0}
    - target: {fileID: 7161517133213807215, guid: f0c311cee7590124aafd29465e07c53c, type: 3}
      propertyPath: m_LocalScale.y
      value: 1.5
      objectReference: {fileID: 0}
    - target: {fileID: 7161517133213807215, guid: f0c311cee7590124aafd29465e07c53c, type: 3}
      propertyPath: m_LocalScale.z
      value: 1.5
      objectReference: {fileID: 0}
    - target: {fileID: 7161517133213807215, guid: f0c311cee7590124aafd29465e07c53c, type: 3}
      propertyPath: m_LocalPosition.x
      value: 0.452
      objectReference: {fileID: 0}
    - target: {fileID: 7161517133213807215, guid: f0c311cee7590124aafd29465e07c53c, type: 3}
      propertyPath: m_LocalPosition.y
      value: -0.084
      objectReference: {fileID: 0}
    - target: {fileID: 7161517133213807215, guid: f0c311cee7590124aafd29465e07c53c, type: 3}
      propertyPath: m_LocalPosition.z
      value: -0.215
      objectReference: {fileID: 0}
    - target: {fileID: 7161517133213807215, guid: f0c311cee7590124aafd29465e07c53c, type: 3}
      propertyPath: m_LocalRotation.w
      value: 0.21083738
      objectReference: {fileID: 0}
    - target: {fileID: 7161517133213807215, guid: f0c311cee7590124aafd29465e07c53c, type: 3}
      propertyPath: m_LocalRotation.x
      value: 0.3903487
      objectReference: {fileID: 0}
    - target: {fileID: 7161517133213807215, guid: f0c311cee7590124aafd29465e07c53c, type: 3}
      propertyPath: m_LocalRotation.y
      value: 0.6257648
      objectReference: {fileID: 0}
    - target: {fileID: 7161517133213807215, guid: f0c311cee7590124aafd29465e07c53c, type: 3}
      propertyPath: m_LocalRotation.z
      value: -0.64155596
      objectReference: {fileID: 0}
    - target: {fileID: 7161517133213807215, guid: f0c311cee7590124aafd29465e07c53c, type: 3}
      propertyPath: m_LocalEulerAnglesHint.x
      value: 75.359
      objectReference: {fileID: 0}
    - target: {fileID: 7161517133213807215, guid: f0c311cee7590124aafd29465e07c53c, type: 3}
      propertyPath: m_LocalEulerAnglesHint.y
      value: -110.351
      objectReference: {fileID: 0}
    - target: {fileID: 7161517133213807215, guid: f0c311cee7590124aafd29465e07c53c, type: 3}
      propertyPath: m_LocalEulerAnglesHint.z
      value: -239.594
      objectReference: {fileID: 0}
    - target: {fileID: 7165638023716128348, guid: f0c311cee7590124aafd29465e07c53c, type: 3}
      propertyPath: value._spawnPoint
      value: 
      objectReference: {fileID: 7771059461801124689}
    - target: {fileID: 7165638023716128349, guid: f0c311cee7590124aafd29465e07c53c, type: 3}
      propertyPath: m_Name
      value: Cludgel
      objectReference: {fileID: 0}
    - target: {fileID: 7858099269409624262, guid: f0c311cee7590124aafd29465e07c53c, type: 3}
      propertyPath: m_Size.x
      value: 0.4958094
      objectReference: {fileID: 0}
    - target: {fileID: 7858099269409624262, guid: f0c311cee7590124aafd29465e07c53c, type: 3}
      propertyPath: m_Size.y
      value: 0.6637219
      objectReference: {fileID: 0}
    - target: {fileID: 7858099269409624262, guid: f0c311cee7590124aafd29465e07c53c, type: 3}
      propertyPath: m_Size.z
      value: 0.33891135
      objectReference: {fileID: 0}
    - target: {fileID: 7858099269409624262, guid: f0c311cee7590124aafd29465e07c53c, type: 3}
      propertyPath: m_Center.x
      value: 0.03275633
      objectReference: {fileID: 0}
    - target: {fileID: 7858099269409624262, guid: f0c311cee7590124aafd29465e07c53c, type: 3}
      propertyPath: m_Center.y
      value: 0.23466459
      objectReference: {fileID: 0}
    - target: {fileID: 7858099269409624262, guid: f0c311cee7590124aafd29465e07c53c, type: 3}
      propertyPath: m_Center.z
      value: -0.012636246
      objectReference: {fileID: 0}
    m_RemovedComponents: []
  m_SourcePrefab: {fileID: 100100000, guid: f0c311cee7590124aafd29465e07c53c, type: 3}
--- !u!1001 &6877245720310482497
PrefabInstance:
  m_ObjectHideFlags: 0
  serializedVersion: 2
  m_Modification:
    m_TransformParent: {fileID: 0}
    m_Modifications:
    - target: {fileID: 4502784170495773923, guid: 803c3b338a77ea34db7f14bb804ac68b, type: 3}
      propertyPath: m_RootOrder
      value: 0
      objectReference: {fileID: 0}
    - target: {fileID: 4502784170495773923, guid: 803c3b338a77ea34db7f14bb804ac68b, type: 3}
      propertyPath: m_LocalPosition.x
      value: 0
      objectReference: {fileID: 0}
    - target: {fileID: 4502784170495773923, guid: 803c3b338a77ea34db7f14bb804ac68b, type: 3}
      propertyPath: m_LocalPosition.y
      value: 0
      objectReference: {fileID: 0}
    - target: {fileID: 4502784170495773923, guid: 803c3b338a77ea34db7f14bb804ac68b, type: 3}
      propertyPath: m_LocalPosition.z
      value: 0
      objectReference: {fileID: 0}
    - target: {fileID: 4502784170495773923, guid: 803c3b338a77ea34db7f14bb804ac68b, type: 3}
      propertyPath: m_LocalRotation.w
      value: 1
      objectReference: {fileID: 0}
    - target: {fileID: 4502784170495773923, guid: 803c3b338a77ea34db7f14bb804ac68b, type: 3}
      propertyPath: m_LocalRotation.x
      value: 0
      objectReference: {fileID: 0}
    - target: {fileID: 4502784170495773923, guid: 803c3b338a77ea34db7f14bb804ac68b, type: 3}
      propertyPath: m_LocalRotation.y
      value: 0
      objectReference: {fileID: 0}
    - target: {fileID: 4502784170495773923, guid: 803c3b338a77ea34db7f14bb804ac68b, type: 3}
      propertyPath: m_LocalRotation.z
      value: 0
      objectReference: {fileID: 0}
    - target: {fileID: 4502784170495773923, guid: 803c3b338a77ea34db7f14bb804ac68b, type: 3}
      propertyPath: m_LocalEulerAnglesHint.x
      value: 0
      objectReference: {fileID: 0}
    - target: {fileID: 4502784170495773923, guid: 803c3b338a77ea34db7f14bb804ac68b, type: 3}
      propertyPath: m_LocalEulerAnglesHint.y
      value: 0
      objectReference: {fileID: 0}
    - target: {fileID: 4502784170495773923, guid: 803c3b338a77ea34db7f14bb804ac68b, type: 3}
      propertyPath: m_LocalEulerAnglesHint.z
      value: 0
      objectReference: {fileID: 0}
    - target: {fileID: 4502784170495773928, guid: 803c3b338a77ea34db7f14bb804ac68b, type: 3}
      propertyPath: value._maxHealth
      value: 1080
      objectReference: {fileID: 0}
    - target: {fileID: 4502784170495773947, guid: 803c3b338a77ea34db7f14bb804ac68b, type: 3}
      propertyPath: m_Name
      value: Golem_Warrior
      objectReference: {fileID: 0}
    - target: {fileID: 7141448990902919116, guid: 803c3b338a77ea34db7f14bb804ac68b, type: 3}
      propertyPath: value.Points
      value: 1440
      objectReference: {fileID: 0}
    m_RemovedComponents: []
  m_SourcePrefab: {fileID: 100100000, guid: 803c3b338a77ea34db7f14bb804ac68b, type: 3}
--- !u!114 &6993519381607713450 stripped
MonoBehaviour:
  m_CorrespondingSourceObject: {fileID: 4502784170495773931, guid: 803c3b338a77ea34db7f14bb804ac68b, type: 3}
  m_PrefabInstance: {fileID: 6877245720310482497}
  m_PrefabAsset: {fileID: 0}
  m_GameObject: {fileID: 0}
  m_Enabled: 1
  m_EditorHideFlags: 0
  m_Script: {fileID: 11500000, guid: f67db03be22712047a6f22377baad596, type: 3}
  m_Name: 
  m_EditorClassIdentifier: 
--- !u!4 &7771059461801124689 stripped
Transform:
  m_CorrespondingSourceObject: {fileID: 3794489273939830032, guid: 803c3b338a77ea34db7f14bb804ac68b, type: 3}
  m_PrefabInstance: {fileID: 6877245720310482497}
  m_PrefabAsset: {fileID: 0}
--- !u!4 &7766027166266024733 stripped
Transform:
  m_CorrespondingSourceObject: {fileID: 3798392679339877724, guid: 803c3b338a77ea34db7f14bb804ac68b, type: 3}
  m_PrefabInstance: {fileID: 6877245720310482497}
  m_PrefabAsset: {fileID: 0}
