%YAML 1.1
%TAG !u! tag:unity3d.com,2011:
--- !u!1001 &2214530697194677972
PrefabInstance:
  m_ObjectHideFlags: 0
  serializedVersion: 2
  m_Modification:
    m_TransformParent: {fileID: 0}
    m_Modifications:
    - target: {fileID: 2361730872294537357, guid: 0ce39951d2e9b1742b91d5e3c1c5dc30, type: 3}
      propertyPath: m_AnchoredPosition.y
      value: 4
      objectReference: {fileID: 0}
    - target: {fileID: 2361730872674855465, guid: 0ce39951d2e9b1742b91d5e3c1c5dc30, type: 3}
      propertyPath: value._modelTransform
      value: 
      objectReference: {fileID: 3794504775145667918}
    - target: {fileID: 2361730872674855471, guid: 0ce39951d2e9b1742b91d5e3c1c5dc30, type: 3}
      propertyPath: m_Name
      value: Golem Variant
      objectReference: {fileID: 0}
    - target: {fileID: 2361730872674855478, guid: 0ce39951d2e9b1742b91d5e3c1c5dc30, type: 3}
      propertyPath: value._modelTransform
      value: 
      objectReference: {fileID: 3794504775145667918}
    - target: {fileID: 2361730872674855479, guid: 0ce39951d2e9b1742b91d5e3c1c5dc30, type: 3}
      propertyPath: m_RootOrder
      value: 0
      objectReference: {fileID: 0}
    - target: {fileID: 2361730872674855479, guid: 0ce39951d2e9b1742b91d5e3c1c5dc30, type: 3}
      propertyPath: m_LocalPosition.x
      value: 0
      objectReference: {fileID: 0}
    - target: {fileID: 2361730872674855479, guid: 0ce39951d2e9b1742b91d5e3c1c5dc30, type: 3}
      propertyPath: m_LocalPosition.y
      value: 0
      objectReference: {fileID: 0}
    - target: {fileID: 2361730872674855479, guid: 0ce39951d2e9b1742b91d5e3c1c5dc30, type: 3}
      propertyPath: m_LocalPosition.z
      value: 0
      objectReference: {fileID: 0}
    - target: {fileID: 2361730872674855479, guid: 0ce39951d2e9b1742b91d5e3c1c5dc30, type: 3}
      propertyPath: m_LocalRotation.w
      value: 1
      objectReference: {fileID: 0}
    - target: {fileID: 2361730872674855479, guid: 0ce39951d2e9b1742b91d5e3c1c5dc30, type: 3}
      propertyPath: m_LocalRotation.x
      value: 0
      objectReference: {fileID: 0}
    - target: {fileID: 2361730872674855479, guid: 0ce39951d2e9b1742b91d5e3c1c5dc30, type: 3}
      propertyPath: m_LocalRotation.y
      value: 0
      objectReference: {fileID: 0}
    - target: {fileID: 2361730872674855479, guid: 0ce39951d2e9b1742b91d5e3c1c5dc30, type: 3}
      propertyPath: m_LocalRotation.z
      value: 0
      objectReference: {fileID: 0}
    - target: {fileID: 2361730872674855479, guid: 0ce39951d2e9b1742b91d5e3c1c5dc30, type: 3}
      propertyPath: m_LocalEulerAnglesHint.x
      value: 0
      objectReference: {fileID: 0}
    - target: {fileID: 2361730872674855479, guid: 0ce39951d2e9b1742b91d5e3c1c5dc30, type: 3}
      propertyPath: m_LocalEulerAnglesHint.y
      value: 0
      objectReference: {fileID: 0}
    - target: {fileID: 2361730872674855479, guid: 0ce39951d2e9b1742b91d5e3c1c5dc30, type: 3}
      propertyPath: m_LocalEulerAnglesHint.z
      value: 0
      objectReference: {fileID: 0}
    - target: {fileID: 7170619646016579915, guid: 0ce39951d2e9b1742b91d5e3c1c5dc30, type: 3}
      propertyPath: value._modelTransform
      value: 
      objectReference: {fileID: 3794504775145667918}
    m_RemovedComponents: []
  m_SourcePrefab: {fileID: 100100000, guid: 0ce39951d2e9b1742b91d5e3c1c5dc30, type: 3}
--- !u!4 &4502784170495773923 stripped
Transform:
  m_CorrespondingSourceObject: {fileID: 2361730872674855479, guid: 0ce39951d2e9b1742b91d5e3c1c5dc30, type: 3}
  m_PrefabInstance: {fileID: 2214530697194677972}
  m_PrefabAsset: {fileID: 0}
--- !u!1001 &4273069540039412420
PrefabInstance:
  m_ObjectHideFlags: 0
  serializedVersion: 2
  m_Modification:
    m_TransformParent: {fileID: 4502784170495773923}
    m_Modifications:
    - target: {fileID: 1145101667440785290, guid: a04e798c0805b8848bd9bdbb4f985c32, type: 3}
      propertyPath: m_RootOrder
      value: 1
      objectReference: {fileID: 0}
    - target: {fileID: 1145101667440785290, guid: a04e798c0805b8848bd9bdbb4f985c32, type: 3}
      propertyPath: m_LocalPosition.x
      value: 0
      objectReference: {fileID: 0}
    - target: {fileID: 1145101667440785290, guid: a04e798c0805b8848bd9bdbb4f985c32, type: 3}
      propertyPath: m_LocalPosition.y
      value: 0
      objectReference: {fileID: 0}
    - target: {fileID: 1145101667440785290, guid: a04e798c0805b8848bd9bdbb4f985c32, type: 3}
      propertyPath: m_LocalPosition.z
      value: 0
      objectReference: {fileID: 0}
    - target: {fileID: 1145101667440785290, guid: a04e798c0805b8848bd9bdbb4f985c32, type: 3}
      propertyPath: m_LocalRotation.w
      value: 1
      objectReference: {fileID: 0}
    - target: {fileID: 1145101667440785290, guid: a04e798c0805b8848bd9bdbb4f985c32, type: 3}
      propertyPath: m_LocalRotation.x
      value: 0
      objectReference: {fileID: 0}
    - target: {fileID: 1145101667440785290, guid: a04e798c0805b8848bd9bdbb4f985c32, type: 3}
      propertyPath: m_LocalRotation.y
      value: 0
      objectReference: {fileID: 0}
    - target: {fileID: 1145101667440785290, guid: a04e798c0805b8848bd9bdbb4f985c32, type: 3}
      propertyPath: m_LocalRotation.z
      value: 0
      objectReference: {fileID: 0}
    - target: {fileID: 1145101667440785290, guid: a04e798c0805b8848bd9bdbb4f985c32, type: 3}
      propertyPath: m_LocalEulerAnglesHint.x
      value: 0
      objectReference: {fileID: 0}
    - target: {fileID: 1145101667440785290, guid: a04e798c0805b8848bd9bdbb4f985c32, type: 3}
      propertyPath: m_LocalEulerAnglesHint.y
      value: 0
      objectReference: {fileID: 0}
    - target: {fileID: 1145101667440785290, guid: a04e798c0805b8848bd9bdbb4f985c32, type: 3}
      propertyPath: m_LocalEulerAnglesHint.z
      value: 0
      objectReference: {fileID: 0}
    - target: {fileID: 1148431010637865640, guid: a04e798c0805b8848bd9bdbb4f985c32, type: 3}
      propertyPath: m_Name
      value: MechanicGolem
      objectReference: {fileID: 0}
    m_RemovedComponents: []
  m_SourcePrefab: {fileID: 100100000, guid: a04e798c0805b8848bd9bdbb4f985c32, type: 3}
--- !u!4 &3794504775145667918 stripped
Transform:
  m_CorrespondingSourceObject: {fileID: 1145101667440785290, guid: a04e798c0805b8848bd9bdbb4f985c32, type: 3}
  m_PrefabInstance: {fileID: 4273069540039412420}
  m_PrefabAsset: {fileID: 0}
