%YAML 1.1
%TAG !u! tag:unity3d.com,2011:
--- !u!1001 &5268413760891012912
PrefabInstance:
  m_ObjectHideFlags: 0
  serializedVersion: 2
  m_Modification:
    m_TransformParent: {fileID: 0}
    m_Modifications:
    - target: {fileID: 1017022993228601928, guid: adb58173a0cc0914e80d5ae65bf872d7, type: 3}
      propertyPath: value.Damage
      value: 60
      objectReference: {fileID: 0}
    - target: {fileID: 8110296706562072123, guid: adb58173a0cc0914e80d5ae65bf872d7, type: 3}
      propertyPath: m_RootOrder
      value: 0
      objectReference: {fileID: 0}
    - target: {fileID: 8110296706562072123, guid: adb58173a0cc0914e80d5ae65bf872d7, type: 3}
      propertyPath: m_LocalScale.x
      value: 150
      objectReference: {fileID: 0}
    - target: {fileID: 8110296706562072123, guid: adb58173a0cc0914e80d5ae65bf872d7, type: 3}
      propertyPath: m_LocalScale.y
      value: 150
      objectReference: {fileID: 0}
    - target: {fileID: 8110296706562072123, guid: adb58173a0cc0914e80d5ae65bf872d7, type: 3}
      propertyPath: m_LocalScale.z
      value: 150
      objectReference: {fileID: 0}
    - target: {fileID: 8110296706562072123, guid: adb58173a0cc0914e80d5ae65bf872d7, type: 3}
      propertyPath: m_LocalPosition.x
      value: 4.9
      objectReference: {fileID: 0}
    - target: {fileID: 8110296706562072123, guid: adb58173a0cc0914e80d5ae65bf872d7, type: 3}
      propertyPath: m_LocalPosition.y
      value: 4
      objectReference: {fileID: 0}
    - target: {fileID: 8110296706562072123, guid: adb58173a0cc0914e80d5ae65bf872d7, type: 3}
      propertyPath: m_LocalPosition.z
      value: -45.9
      objectReference: {fileID: 0}
    - target: {fileID: 8110296706562072123, guid: adb58173a0cc0914e80d5ae65bf872d7, type: 3}
      propertyPath: m_LocalRotation.w
      value: 0
      objectReference: {fileID: 0}
    - target: {fileID: 8110296706562072123, guid: adb58173a0cc0914e80d5ae65bf872d7, type: 3}
      propertyPath: m_LocalRotation.x
      value: 0
      objectReference: {fileID: 0}
    - target: {fileID: 8110296706562072123, guid: adb58173a0cc0914e80d5ae65bf872d7, type: 3}
      propertyPath: m_LocalRotation.y
      value: 0.70710677
      objectReference: {fileID: 0}
    - target: {fileID: 8110296706562072123, guid: adb58173a0cc0914e80d5ae65bf872d7, type: 3}
      propertyPath: m_LocalRotation.z
      value: -0.70710677
      objectReference: {fileID: 0}
    - target: {fileID: 8110296706562072123, guid: adb58173a0cc0914e80d5ae65bf872d7, type: 3}
      propertyPath: m_LocalEulerAnglesHint.x
      value: 90
      objectReference: {fileID: 0}
    - target: {fileID: 8110296706562072123, guid: adb58173a0cc0914e80d5ae65bf872d7, type: 3}
      propertyPath: m_LocalEulerAnglesHint.y
      value: 90
      objectReference: {fileID: 0}
    - target: {fileID: 8110296706562072123, guid: adb58173a0cc0914e80d5ae65bf872d7, type: 3}
      propertyPath: m_LocalEulerAnglesHint.z
      value: -90
      objectReference: {fileID: 0}
    - target: {fileID: 8114971753120524809, guid: adb58173a0cc0914e80d5ae65bf872d7, type: 3}
      propertyPath: m_Name
      value: Hammer_2 Variant
      objectReference: {fileID: 0}
    - target: {fileID: 8128553943848391219, guid: adb58173a0cc0914e80d5ae65bf872d7, type: 3}
      propertyPath: m_Materials.Array.data[0]
      value: 
      objectReference: {fileID: 2100000, guid: 64d73e2e0633c2947b6e26e32a17eb1a, type: 2}
    - target: {fileID: 8135033350941197823, guid: adb58173a0cc0914e80d5ae65bf872d7, type: 3}
      propertyPath: m_Mesh
      value: 
      objectReference: {fileID: 4300000, guid: 7e94eb9bfab6f02479c76aa6c32d6e0d, type: 3}
    m_RemovedComponents: []
  m_SourcePrefab: {fileID: 100100000, guid: adb58173a0cc0914e80d5ae65bf872d7, type: 3}
