%YAML 1.1
%TAG !u! tag:unity3d.com,2011:
--- !u!1001 &397442624192212643
PrefabInstance:
  m_ObjectHideFlags: 0
  serializedVersion: 2
  m_Modification:
    m_TransformParent: {fileID: 0}
    m_Modifications:
    - target: {fileID: 2361730872674855465, guid: 0ce39951d2e9b1742b91d5e3c1c5dc30, type: 3}
      propertyPath: value._modelTransform
      value: 
      objectReference: {fileID: 3452561145124584792}
    - target: {fileID: 2361730872674855471, guid: 0ce39951d2e9b1742b91d5e3c1c5dc30, type: 3}
      propertyPath: m_Name
      value: Troll Variant
      objectReference: {fileID: 0}
    - target: {fileID: 2361730872674855478, guid: 0ce39951d2e9b1742b91d5e3c1c5dc30, type: 3}
      propertyPath: value._modelTransform
      value: 
      objectReference: {fileID: 3452561145124584792}
    - target: {fileID: 2361730872674855479, guid: 0ce39951d2e9b1742b91d5e3c1c5dc30, type: 3}
      propertyPath: m_RootOrder
      value: 0
      objectReference: {fileID: 0}
    - target: {fileID: 2361730872674855479, guid: 0ce39951d2e9b1742b91d5e3c1c5dc30, type: 3}
      propertyPath: m_LocalPosition.x
      value: 0
      objectReference: {fileID: 0}
    - target: {fileID: 2361730872674855479, guid: 0ce39951d2e9b1742b91d5e3c1c5dc30, type: 3}
      propertyPath: m_LocalPosition.y
      value: 0
      objectReference: {fileID: 0}
    - target: {fileID: 2361730872674855479, guid: 0ce39951d2e9b1742b91d5e3c1c5dc30, type: 3}
      propertyPath: m_LocalPosition.z
      value: 0
      objectReference: {fileID: 0}
    - target: {fileID: 2361730872674855479, guid: 0ce39951d2e9b1742b91d5e3c1c5dc30, type: 3}
      propertyPath: m_LocalRotation.w
      value: 1
      objectReference: {fileID: 0}
    - target: {fileID: 2361730872674855479, guid: 0ce39951d2e9b1742b91d5e3c1c5dc30, type: 3}
      propertyPath: m_LocalRotation.x
      value: 0
      objectReference: {fileID: 0}
    - target: {fileID: 2361730872674855479, guid: 0ce39951d2e9b1742b91d5e3c1c5dc30, type: 3}
      propertyPath: m_LocalRotation.y
      value: 0
      objectReference: {fileID: 0}
    - target: {fileID: 2361730872674855479, guid: 0ce39951d2e9b1742b91d5e3c1c5dc30, type: 3}
      propertyPath: m_LocalRotation.z
      value: 0
      objectReference: {fileID: 0}
    - target: {fileID: 2361730872674855479, guid: 0ce39951d2e9b1742b91d5e3c1c5dc30, type: 3}
      propertyPath: m_LocalEulerAnglesHint.x
      value: 0
      objectReference: {fileID: 0}
    - target: {fileID: 2361730872674855479, guid: 0ce39951d2e9b1742b91d5e3c1c5dc30, type: 3}
      propertyPath: m_LocalEulerAnglesHint.y
      value: 0
      objectReference: {fileID: 0}
    - target: {fileID: 2361730872674855479, guid: 0ce39951d2e9b1742b91d5e3c1c5dc30, type: 3}
      propertyPath: m_LocalEulerAnglesHint.z
      value: 0
      objectReference: {fileID: 0}
    - target: {fileID: 7170619646016579915, guid: 0ce39951d2e9b1742b91d5e3c1c5dc30, type: 3}
      propertyPath: value._modelTransform
      value: 
      objectReference: {fileID: 3452561145124584792}
    m_RemovedComponents: []
  m_SourcePrefab: {fileID: 100100000, guid: 0ce39951d2e9b1742b91d5e3c1c5dc30, type: 3}
--- !u!4 &2685678377255879828 stripped
Transform:
  m_CorrespondingSourceObject: {fileID: 2361730872674855479, guid: 0ce39951d2e9b1742b91d5e3c1c5dc30, type: 3}
  m_PrefabInstance: {fileID: 397442624192212643}
  m_PrefabAsset: {fileID: 0}
--- !u!1001 &8147437509256497642
PrefabInstance:
  m_ObjectHideFlags: 0
  serializedVersion: 2
  m_Modification:
    m_TransformParent: {fileID: 2685678377255879828}
    m_Modifications:
    - target: {fileID: 6841750260147157416, guid: c24f8a53a8b7e7c468b1022a87f6af5c, type: 3}
      propertyPath: m_Name
      value: Troll
      objectReference: {fileID: 0}
    - target: {fileID: 6843348477516854450, guid: c24f8a53a8b7e7c468b1022a87f6af5c, type: 3}
      propertyPath: m_RootOrder
      value: 1
      objectReference: {fileID: 0}
    - target: {fileID: 6843348477516854450, guid: c24f8a53a8b7e7c468b1022a87f6af5c, type: 3}
      propertyPath: m_LocalPosition.x
      value: 0
      objectReference: {fileID: 0}
    - target: {fileID: 6843348477516854450, guid: c24f8a53a8b7e7c468b1022a87f6af5c, type: 3}
      propertyPath: m_LocalPosition.y
      value: 0
      objectReference: {fileID: 0}
    - target: {fileID: 6843348477516854450, guid: c24f8a53a8b7e7c468b1022a87f6af5c, type: 3}
      propertyPath: m_LocalPosition.z
      value: 0
      objectReference: {fileID: 0}
    - target: {fileID: 6843348477516854450, guid: c24f8a53a8b7e7c468b1022a87f6af5c, type: 3}
      propertyPath: m_LocalRotation.w
      value: 1
      objectReference: {fileID: 0}
    - target: {fileID: 6843348477516854450, guid: c24f8a53a8b7e7c468b1022a87f6af5c, type: 3}
      propertyPath: m_LocalRotation.x
      value: 0
      objectReference: {fileID: 0}
    - target: {fileID: 6843348477516854450, guid: c24f8a53a8b7e7c468b1022a87f6af5c, type: 3}
      propertyPath: m_LocalRotation.y
      value: 0
      objectReference: {fileID: 0}
    - target: {fileID: 6843348477516854450, guid: c24f8a53a8b7e7c468b1022a87f6af5c, type: 3}
      propertyPath: m_LocalRotation.z
      value: 0
      objectReference: {fileID: 0}
    - target: {fileID: 6843348477516854450, guid: c24f8a53a8b7e7c468b1022a87f6af5c, type: 3}
      propertyPath: m_LocalEulerAnglesHint.x
      value: 0
      objectReference: {fileID: 0}
    - target: {fileID: 6843348477516854450, guid: c24f8a53a8b7e7c468b1022a87f6af5c, type: 3}
      propertyPath: m_LocalEulerAnglesHint.y
      value: 0
      objectReference: {fileID: 0}
    - target: {fileID: 6843348477516854450, guid: c24f8a53a8b7e7c468b1022a87f6af5c, type: 3}
      propertyPath: m_LocalEulerAnglesHint.z
      value: 0
      objectReference: {fileID: 0}
    m_RemovedComponents: []
  m_SourcePrefab: {fileID: 100100000, guid: c24f8a53a8b7e7c468b1022a87f6af5c, type: 3}
--- !u!4 &3452561145124584792 stripped
Transform:
  m_CorrespondingSourceObject: {fileID: 6843348477516854450, guid: c24f8a53a8b7e7c468b1022a87f6af5c, type: 3}
  m_PrefabInstance: {fileID: 8147437509256497642}
  m_PrefabAsset: {fileID: 0}
