{
  "workDir": ".",
  "privatesky-dependencies": [
    {
      "name": "privatesky",
      "src": "https://gitlab.com/glass-project1/wallet/opendsu/opendsu-sdk.git",
      "actions": [
        {
          "type": "smartClone",
          "target": "."
        },
        {
          "type": "execute",
          "cmd": "cd privatesky && npm install"
        }
      ]
    }
  ],
  "privatesky-build": [],
  "dependencies": [
    {
      "name": "privatesky",
      "src": ".",
      "actions": [
        {
          "type": "execute",
          "cmd": "npm run install-privatesky"
        }
      ]
    },
    {
      "name": "api",
      "src": ".",
      "actions": [
        {
          "type": "execute",
          "cmd": "cd api && npm install"
        }
      ]
    },
    {
      "name": "patch api hub",
      "src": ".",
      "actions": [
        {
          "type": "execute",
          "cmd": "npm run patch-service-config"
        }
      ]
    },
    {
      "name": "components install",
      "src": ".",
      "actions": [
        {
          "type": "execute",
          "cmd": "cd components && npm install && npm run build"
        }
      ]
    }
  ],
  "build": [
    {
      "name": "api",
      "src": ".",
      "actions": [
        {
          "type": "execute",
          "cmd": "cd api && npm run build"
        }
      ]
    },
    {
      "name": "components",
      "src": ".",
      "actions": [
        {
          "type": "execute",
          "cmd": "cd components && npm run build"
        }
      ]
    }
  ],
  "build-dapps": [
    {
      "name": "build-privatesky",
      "src": ".",
      "actions": [
        {
          "type": "execute",
          "cmd": "npm run build-privatesky"
        }
      ]
    }
  ],
  "docs": [
    {
      "name": "Compile Documentation",
      "src": ".",
      "actions": [
        {
          "type": "execute",
          "cmd": "./workdocs/bin/drawio_convert.sh"
        },
        {
          "type": "copy",
          "src": "workdocs/resources",
          "target": "docs/resources",
          "options": {
            "overwrite": true
          }
        },
        {
          "type": "execute",
          "cmd": "node ./node_modules/markdown-include/bin/cli.js ./mdCompile.json"
        },
        {
          "type": "execute",
          "cmd": "jsdoc -c jsdocs.json -t \"$(npm root)/better-docs\""
        }
      ]
    }
  ]
}



