[
  [
    {
      "workingDir": "/usr/local/bin",
      "commands": [
        "echo \"Starting Postgres\"",
        "/bin/bash /usr/local/bin/docker-entrypoint.sh postgres"
      ]
    }
  ],
  [
    {
      "workingDir": "/",
      "commands": [
        "echo \"Setting Apache config\"",
        "/usr/sbin/httpd -D FOREGROUND -f /etc/apache2/httpd.conf"
      ]
    }
  ],
  [
    {
      "workingDir": "./egovpassport/backoffice-dsu",
      "commands": [
        "echo \"Patching netwwork and country configs to schema\"",
        "node ./node_modules/@glass-project1/dsu-utils/src/streamAndReplace.js --srcPath=\"./overrides/endpoints\" --paramIdentifier='%' --destPath=\"./api/assets/\" %EGOV_REST=\"$EGOV_REST\" %GLASS_ENDPOINT=\"$GLASS_ENDPOINT\"",
        "node ./node_modules/@glass-project1/dsu-utils/src/streamAndReplace.js --srcPath=\"./overrides/sef\" --paramIdentifier='%' --destPath=\"./api/assets/\" %COUNTRY_CODE=\"$GLASS_COUNTRY_CODE\" %COUNTRY_NAME=\"$GLASS_COUNTRY_NAME\"",
        "node ./node_modules/@glass-project1/dsu-utils/src/streamAndReplace.js --srcPath=\"./overrides/config\" --paramIdentifier='%' --destPath=\"./apihub-root/external-volume//\" --baseFolderReplacement=\"config\" %ENV_PREFFIX=\"$ENV_PREFFIX\" %COUNTRY_CODE=\"$GLASS_COUNTRY_CODE\" %ADAPTER_ENDPOINT=\"$ADAPTER_ENDPOINT\"" 

      ]
    }
  ],
  [
    {
      "workingDir": "./egovpassport/backoffice-dsu/privatesky",
      "commands": [
        "echo \"Booting OpenDSUs ApiHub\"",
        "sleep 5s",
        "node psknode/bin/scripts/apiHubLauncher.js --jsondb=\"./../db\" $DEV=false $PSK_CONFIG_LOCATION=\"../apihub-root/external-volume/config\" $PSK_TMP_WORKING_DIR=\"tmp\""
      ]
    }
  ],
  [
    {
      "workingDir": "./egovpassport/backoffice-dsu/api",
      "commands": [
        "echo \"Waiting 10 seconds for Api to start...\"",
        "sleep 10s",
        "node ./dist/main.js"
      ]
    }
  ]
]