{
  "anchoring": {
    "type": "ETH",
    "option": {
      "endpoint": "%{ADAPTER_ENDPOINT}"
    },
    "commands": {
      "addAnchor": "anchor"
    }
  },
  "enable": ["mq"],
  "skipOAuth": [
    "/bricking/egov.%{COUNTRY_CODE}.education-vault/get-brick"
  ],
  "mq_fsMessageMaxSize": 102400,
  "mq_fsQueueLength": 500
}