{
  "anchoring": {
    "type": "FS",
    "option": {
      "enableBricksLedger": false
    },
    "commands": {
      "addAnchor": "anchor"
    }
  },
  "enable": ["mq"],
  "skipOAuth": [
    "/bricking/pdmfc.pt-vault/get-brick"
  ],
  "mq_fsMessageMaxSize": 102400,
  "mq_fsQueueLength": 500
}