{
  "glass": {
    "_comment": "generated with bdns generator",
    "replicas": [],
    "brickStorages": [
      "$ORIGIN"
    ],
    "anchoringServices": [
      "$ORIGIN"
    ],
    "mqEndpoints": [
      "$ORIGIN"
    ],
    "notifications": [
      "$ORIGIN"
    ]
  },
  "glass-vault": {
    "_comment": "generated with bdns generator",
    "replicas": [],
    "brickStorages": [
      "$ORIGIN"
    ],
    "anchoringServices": [
      "$ORIGIN"
    ],
    "mqEndpoints": [
      "$ORIGIN"
    ],
    "notifications": [
      "$ORIGIN"
    ]
  },
  "default": {
    "_comment": "generated with bdns generator",
    "replicas": [],
    "brickStorages": [
      "$ORIGIN"
    ],
    "anchoringServices": [
      "$ORIGIN"
    ],
    "mqEndpoints": [
      "$ORIGIN"
    ],
    "notifications": [
      "$ORIGIN"
    ]
  },
  "vault": {
    "_comment": "generated with bdns generator",
    "replicas": [],
    "brickStorages": [
      "$ORIGIN"
    ],
    "anchoringServices": [
      "$ORIGIN"
    ],
    "mqEndpoints": [
      "$ORIGIN"
    ],
    "notifications": [
      "$ORIGIN"
    ]
  },
  "bank.pt": {
    "_comment": "generated with bdns generator",
    "replicas": [],
    "brickStorages": [
      "https://bank-pt.glass.pdmfc.com/"
    ],
    "anchoringServices": [
      "https://bank-pt.glass.pdmfc.com/"
    ],
    "mqEndpoints": [
      "https://bank-pt.glass.pdmfc.com/"
    ],
    "notifications": [
      "https://bank-pt.glass.pdmfc.com/"
    ]
  },
  "bank.pt-vault": {
    "_comment": "generated with bdns generator",
    "replicas": [],
    "brickStorages": [
      "https://bank-pt.glass.pdmfc.com/"
    ],
    "anchoringServices": [
      "https://bank-pt.glass.pdmfc.com/"
    ],
    "mqEndpoints": [
      "https://bank-pt.glass.pdmfc.com/"
    ],
    "notifications": [
      "https://bank-pt.glass.pdmfc.com/"
    ]
  },
  "egov.gr.education": {
    "_comment": "generated with bdns generator",
    "replicas": [],
    "brickStorages": [
      "https://egov-education-gr.glass.pdmfc.com/"
    ],
    "anchoringServices": [
      "https://egov-education-gr.glass.pdmfc.com/"
    ],
    "mqEndpoints": [
      "https://egov-education-gr.glass.pdmfc.com/"
    ],
    "notifications": [
      "https://egov-education-gr.glass.pdmfc.com/"
    ]
  },
  "egov.gr.education-vault": {
    "_comment": "generated with bdns generator",
    "replicas": [],
    "brickStorages": [
      "https://egov-education-gr.glass.pdmfc.com/"
    ],
    "anchoringServices": [
      "https://egov-education-gr.glass.pdmfc.com/"
    ],
    "mqEndpoints": [
      "https://egov-education-gr.glass.pdmfc.com/"
    ],
    "notifications": [
      "https://egov-education-gr.glass.pdmfc.com/"
    ]
  },
  "egov.gr.health": {
    "_comment": "generated with bdns generator",
    "replicas": [],
    "brickStorages": [
      "https://egov-health-gr.glass.pdmfc.com/"
    ],
    "anchoringServices": [
      "https://egov-health-gr.glass.pdmfc.com/"
    ],
    "mqEndpoints": [
      "https://egov-health-gr.glass.pdmfc.com/"
    ],
    "notifications": [
      "https://egov-health-gr.glass.pdmfc.com/"
    ]
  },
  "egov.gr.health-vault": {
    "_comment": "generated with bdns generator",
    "replicas": [],
    "brickStorages": [
      "https://egov-health-gr.glass.pdmfc.com/"
    ],
    "anchoringServices": [
      "https://egov-health-gr.glass.pdmfc.com/"
    ],
    "mqEndpoints": [
      "https://egov-health-gr.glass.pdmfc.com/"
    ],
    "notifications": [
      "https://egov-health-gr.glass.pdmfc.com/"
    ]
  },
  "egov.gr.id": {
    "_comment": "generated with bdns generator",
    "replicas": [],
    "brickStorages": [
      "https://egov-id-gr.glass.pdmfc.com/"
    ],
    "anchoringServices": [
      "https://egov-id-gr.glass.pdmfc.com/"
    ],
    "mqEndpoints": [
      "https://egov-id-gr.glass.pdmfc.com/"
    ],
    "notifications": [
      "https://egov-id-gr.glass.pdmfc.com/"
    ]
  },
  "egov.gr.id-vault": {
    "_comment": "generated with bdns generator",
    "replicas": [],
    "brickStorages": [
      "https://egov-id-gr.glass.pdmfc.com/"
    ],
    "anchoringServices": [
      "https://egov-id-gr.glass.pdmfc.com/"
    ],
    "mqEndpoints": [
      "https://egov-id-gr.glass.pdmfc.com/"
    ],
    "notifications": [
      "https://egov-id-gr.glass.pdmfc.com/"
    ]
  },
  "egov.gr.passport": {
    "_comment": "generated with bdns generator",
    "replicas": [],
    "brickStorages": [
      "https://egov-passport-gr.glass.pdmfc.com/"
    ],
    "anchoringServices": [
      "https://egov-passport-gr.glass.pdmfc.com/"
    ],
    "mqEndpoints": [
      "https://egov-passport-gr.glass.pdmfc.com/"
    ],
    "notifications": [
      "https://egov-passport-gr.glass.pdmfc.com/"
    ]
  },
  "egov.gr.passport-vault": {
    "_comment": "generated with bdns generator",
    "replicas": [],
    "brickStorages": [
      "https://egov-passport-gr.glass.pdmfc.com/"
    ],
    "anchoringServices": [
      "https://egov-passport-gr.glass.pdmfc.com/"
    ],
    "mqEndpoints": [
      "https://egov-passport-gr.glass.pdmfc.com/"
    ],
    "notifications": [
      "https://egov-passport-gr.glass.pdmfc.com/"
    ]
  },
  "egov.gr.tax": {
    "_comment": "generated with bdns generator",
    "replicas": [],
    "brickStorages": [
      "https://egov-tax-gr.glass.pdmfc.com/"
    ],
    "anchoringServices": [
      "https://egov-tax-gr.glass.pdmfc.com/"
    ],
    "mqEndpoints": [
      "https://egov-tax-gr.glass.pdmfc.com/"
    ],
    "notifications": [
      "https://egov-tax-gr.glass.pdmfc.com/"
    ]
  },
  "egov.gr.tax-vault": {
    "_comment": "generated with bdns generator",
    "replicas": [],
    "brickStorages": [
      "https://egov-tax-gr.glass.pdmfc.com/"
    ],
    "anchoringServices": [
      "https://egov-tax-gr.glass.pdmfc.com/"
    ],
    "mqEndpoints": [
      "https://egov-tax-gr.glass.pdmfc.com/"
    ],
    "notifications": [
      "https://egov-tax-gr.glass.pdmfc.com/"
    ]
  },
  "egov.gr": {
    "_comment": "generated with bdns generator",
    "replicas": [],
    "brickStorages": [
      "https://egov-gr.glass.pdmfc.com/"
    ],
    "anchoringServices": [
      "https://egov-gr.glass.pdmfc.com/"
    ],
    "mqEndpoints": [
      "https://egov-gr.glass.pdmfc.com/"
    ],
    "notifications": [
      "https://egov-gr.glass.pdmfc.com/"
    ]
  },
  "egov.gr-vault": {
    "_comment": "generated with bdns generator",
    "replicas": [],
    "brickStorages": [
      "https://egov-gr.glass.pdmfc.com/"
    ],
    "anchoringServices": [
      "https://egov-gr.glass.pdmfc.com/"
    ],
    "mqEndpoints": [
      "https://egov-gr.glass.pdmfc.com/"
    ],
    "notifications": [
      "https://egov-gr.glass.pdmfc.com/"
    ]
  },
  "egov.pt.education": {
    "_comment": "generated with bdns generator",
    "replicas": [],
    "brickStorages": [
      "https://egov-education-pt.glass.pdmfc.com/"
    ],
    "anchoringServices": [
      "https://egov-education-pt.glass.pdmfc.com/"
    ],
    "mqEndpoints": [
      "https://egov-education-pt.glass.pdmfc.com/"
    ],
    "notifications": [
      "https://egov-education-pt.glass.pdmfc.com/"
    ]
  },
  "egov.pt.education-vault": {
    "_comment": "generated with bdns generator",
    "replicas": [],
    "brickStorages": [
      "https://egov-education-pt.glass.pdmfc.com/"
    ],
    "anchoringServices": [
      "https://egov-education-pt.glass.pdmfc.com/"
    ],
    "mqEndpoints": [
      "https://egov-education-pt.glass.pdmfc.com/"
    ],
    "notifications": [
      "https://egov-education-pt.glass.pdmfc.com/"
    ]
  },
  "egov.pt.health": {
    "_comment": "generated with bdns generator",
    "replicas": [],
    "brickStorages": [
      "https://egov-health-pt.glass.pdmfc.com/"
    ],
    "anchoringServices": [
      "https://egov-health-pt.glass.pdmfc.com/"
    ],
    "mqEndpoints": [
      "https://egov-health-pt.glass.pdmfc.com/"
    ],
    "notifications": [
      "https://egov-health-pt.glass.pdmfc.com/"
    ]
  },
  "egov.pt.health-vault": {
    "_comment": "generated with bdns generator",
    "replicas": [],
    "brickStorages": [
      "https://egov-health-pt.glass.pdmfc.com/"
    ],
    "anchoringServices": [
      "https://egov-health-pt.glass.pdmfc.com/"
    ],
    "mqEndpoints": [
      "https://egov-health-pt.glass.pdmfc.com/"
    ],
    "notifications": [
      "https://egov-health-pt.glass.pdmfc.com/"
    ]
  },
  "egov.pt.id": {
    "_comment": "generated with bdns generator",
    "replicas": [],
    "brickStorages": [
      "https://egov-id-pt.glass.pdmfc.com/"
    ],
    "anchoringServices": [
      "https://egov-id-pt.glass.pdmfc.com/"
    ],
    "mqEndpoints": [
      "https://egov-id-pt.glass.pdmfc.com/"
    ],
    "notifications": [
      "https://egov-id-pt.glass.pdmfc.com/"
    ]
  },
  "egov.pt.id-vault": {
    "_comment": "generated with bdns generator",
    "replicas": [],
    "brickStorages": [
      "https://egov-id-pt.glass.pdmfc.com/"
    ],
    "anchoringServices": [
      "https://egov-id-pt.glass.pdmfc.com/"
    ],
    "mqEndpoints": [
      "https://egov-id-pt.glass.pdmfc.com/"
    ],
    "notifications": [
      "https://egov-id-pt.glass.pdmfc.com/"
    ]
  },
  "egov.pt.passport": {
    "_comment": "generated with bdns generator",
    "replicas": [],
    "brickStorages": [
      "https://egov-passport-pt.glass.pdmfc.com/"
    ],
    "anchoringServices": [
      "https://egov-passport-pt.glass.pdmfc.com/"
    ],
    "mqEndpoints": [
      "https://egov-passport-pt.glass.pdmfc.com/"
    ],
    "notifications": [
      "https://egov-passport-pt.glass.pdmfc.com/"
    ]
  },
  "egov.pt.passport-vault": {
    "_comment": "generated with bdns generator",
    "replicas": [],
    "brickStorages": [
      "https://egov-passport-pt.glass.pdmfc.com/"
    ],
    "anchoringServices": [
      "https://egov-passport-pt.glass.pdmfc.com/"
    ],
    "mqEndpoints": [
      "https://egov-passport-pt.glass.pdmfc.com/"
    ],
    "notifications": [
      "https://egov-passport-pt.glass.pdmfc.com/"
    ]
  },
  "egov.pt.tax": {
    "_comment": "generated with bdns generator",
    "replicas": [],
    "brickStorages": [
      "https://egov-tax-pt.glass.pdmfc.com/"
    ],
    "anchoringServices": [
      "https://egov-tax-pt.glass.pdmfc.com/"
    ],
    "mqEndpoints": [
      "https://egov-tax-pt.glass.pdmfc.com/"
    ],
    "notifications": [
      "https://egov-tax-pt.glass.pdmfc.com/"
    ]
  },
  "egov.pt.tax-vault": {
    "_comment": "generated with bdns generator",
    "replicas": [],
    "brickStorages": [
      "https://egov-tax-pt.glass.pdmfc.com/"
    ],
    "anchoringServices": [
      "https://egov-tax-pt.glass.pdmfc.com/"
    ],
    "mqEndpoints": [
      "https://egov-tax-pt.glass.pdmfc.com/"
    ],
    "notifications": [
      "https://egov-tax-pt.glass.pdmfc.com/"
    ]
  },
  "egov.pt": {
    "_comment": "generated with bdns generator",
    "replicas": [],
    "brickStorages": [
      "https://egov-pt.glass.pdmfc.com/"
    ],
    "anchoringServices": [
      "https://egov-pt.glass.pdmfc.com/"
    ],
    "mqEndpoints": [
      "https://egov-pt.glass.pdmfc.com/"
    ],
    "notifications": [
      "https://egov-pt.glass.pdmfc.com/"
    ]
  },
  "egov.pt-vault": {
    "_comment": "generated with bdns generator",
    "replicas": [],
    "brickStorages": [
      "https://egov-pt.glass.pdmfc.com/"
    ],
    "anchoringServices": [
      "https://egov-pt.glass.pdmfc.com/"
    ],
    "mqEndpoints": [
      "https://egov-pt.glass.pdmfc.com/"
    ],
    "notifications": [
      "https://egov-pt.glass.pdmfc.com/"
    ]
  },
  "egov.tk.education": {
    "_comment": "generated with bdns generator",
    "replicas": [],
    "brickStorages": [
      "https://egov-education-tk.glass.pdmfc.com/"
    ],
    "anchoringServices": [
      "https://egov-education-tk.glass.pdmfc.com/"
    ],
    "mqEndpoints": [
      "https://egov-education-tk.glass.pdmfc.com/"
    ],
    "notifications": [
      "https://egov-education-tk.glass.pdmfc.com/"
    ]
  },
  "egov.tk.education-vault": {
    "_comment": "generated with bdns generator",
    "replicas": [],
    "brickStorages": [
      "https://egov-education-tk.glass.pdmfc.com/"
    ],
    "anchoringServices": [
      "https://egov-education-tk.glass.pdmfc.com/"
    ],
    "mqEndpoints": [
      "https://egov-education-tk.glass.pdmfc.com/"
    ],
    "notifications": [
      "https://egov-education-tk.glass.pdmfc.com/"
    ]
  },
  "egov.tk.health": {
    "_comment": "generated with bdns generator",
    "replicas": [],
    "brickStorages": [
      "https://egov-health-tk.glass.pdmfc.com/"
    ],
    "anchoringServices": [
      "https://egov-health-tk.glass.pdmfc.com/"
    ],
    "mqEndpoints": [
      "https://egov-health-tk.glass.pdmfc.com/"
    ],
    "notifications": [
      "https://egov-health-tk.glass.pdmfc.com/"
    ]
  },
  "egov.tk.health-vault": {
    "_comment": "generated with bdns generator",
    "replicas": [],
    "brickStorages": [
      "https://egov-health-tk.glass.pdmfc.com/"
    ],
    "anchoringServices": [
      "https://egov-health-tk.glass.pdmfc.com/"
    ],
    "mqEndpoints": [
      "https://egov-health-tk.glass.pdmfc.com/"
    ],
    "notifications": [
      "https://egov-health-tk.glass.pdmfc.com/"
    ]
  },
  "egov.tk.id": {
    "_comment": "generated with bdns generator",
    "replicas": [],
    "brickStorages": [
      "https://egov-id-tk.glass.pdmfc.com/"
    ],
    "anchoringServices": [
      "https://egov-id-tk.glass.pdmfc.com/"
    ],
    "mqEndpoints": [
      "https://egov-id-tk.glass.pdmfc.com/"
    ],
    "notifications": [
      "https://egov-id-tk.glass.pdmfc.com/"
    ]
  },
  "egov.tk.id-vault": {
    "_comment": "generated with bdns generator",
    "replicas": [],
    "brickStorages": [
      "https://egov-id-tk.glass.pdmfc.com/"
    ],
    "anchoringServices": [
      "https://egov-id-tk.glass.pdmfc.com/"
    ],
    "mqEndpoints": [
      "https://egov-id-tk.glass.pdmfc.com/"
    ],
    "notifications": [
      "https://egov-id-tk.glass.pdmfc.com/"
    ]
  },
  "egov.tk.passport": {
    "_comment": "generated with bdns generator",
    "replicas": [],
    "brickStorages": [
      "https://egov-passport-tk.glass.pdmfc.com/"
    ],
    "anchoringServices": [
      "https://egov-passport-tk.glass.pdmfc.com/"
    ],
    "mqEndpoints": [
      "https://egov-passport-tk.glass.pdmfc.com/"
    ],
    "notifications": [
      "https://egov-passport-tk.glass.pdmfc.com/"
    ]
  },
  "egov.tk.passport-vault": {
    "_comment": "generated with bdns generator",
    "replicas": [],
    "brickStorages": [
      "https://egov-passport-tk.glass.pdmfc.com/"
    ],
    "anchoringServices": [
      "https://egov-passport-tk.glass.pdmfc.com/"
    ],
    "mqEndpoints": [
      "https://egov-passport-tk.glass.pdmfc.com/"
    ],
    "notifications": [
      "https://egov-passport-tk.glass.pdmfc.com/"
    ]
  },
  "egov.tk.tax": {
    "_comment": "generated with bdns generator",
    "replicas": [],
    "brickStorages": [
      "https://egov-tax-tk.glass.pdmfc.com/"
    ],
    "anchoringServices": [
      "https://egov-tax-tk.glass.pdmfc.com/"
    ],
    "mqEndpoints": [
      "https://egov-tax-tk.glass.pdmfc.com/"
    ],
    "notifications": [
      "https://egov-tax-tk.glass.pdmfc.com/"
    ]
  },
  "egov.tk.tax-vault": {
    "_comment": "generated with bdns generator",
    "replicas": [],
    "brickStorages": [
      "https://egov-tax-tk.glass.pdmfc.com/"
    ],
    "anchoringServices": [
      "https://egov-tax-tk.glass.pdmfc.com/"
    ],
    "mqEndpoints": [
      "https://egov-tax-tk.glass.pdmfc.com/"
    ],
    "notifications": [
      "https://egov-tax-tk.glass.pdmfc.com/"
    ]
  },
  "egov.tk": {
    "_comment": "generated with bdns generator",
    "replicas": [],
    "brickStorages": [
      "https://egov-tk.glass.pdmfc.com/"
    ],
    "anchoringServices": [
      "https://egov-tk.glass.pdmfc.com/"
    ],
    "mqEndpoints": [
      "https://egov-tk.glass.pdmfc.com/"
    ],
    "notifications": [
      "https://egov-tk.glass.pdmfc.com/"
    ]
  },
  "egov.tk-vault": {
    "_comment": "generated with bdns generator",
    "replicas": [],
    "brickStorages": [
      "https://egov-tk.glass.pdmfc.com/"
    ],
    "anchoringServices": [
      "https://egov-tk.glass.pdmfc.com/"
    ],
    "mqEndpoints": [
      "https://egov-tk.glass.pdmfc.com/"
    ],
    "notifications": [
      "https://egov-tk.glass.pdmfc.com/"
    ]
  },
  "landlord.pt": {
    "_comment": "generated with bdns generator",
    "replicas": [],
    "brickStorages": [
      "https://landlord-pt.glass.pdmfc.com/"
    ],
    "anchoringServices": [
      "https://landlord-pt.glass.pdmfc.com/"
    ],
    "mqEndpoints": [
      "https://landlord-pt.glass.pdmfc.com/"
    ],
    "notifications": [
      "https://landlord-pt.glass.pdmfc.com/"
    ]
  },
  "landlord.pt-vault": {
    "_comment": "generated with bdns generator",
    "replicas": [],
    "brickStorages": [
      "https://landlord-pt.glass.pdmfc.com/"
    ],
    "anchoringServices": [
      "https://landlord-pt.glass.pdmfc.com/"
    ],
    "mqEndpoints": [
      "https://landlord-pt.glass.pdmfc.com/"
    ],
    "notifications": [
      "https://landlord-pt.glass.pdmfc.com/"
    ]
  },
  "pdmfc.pt": {
    "_comment": "generated with bdns generator",
    "replicas": [],
    "brickStorages": [
      "https://pdmfc-pt.glass.pdmfc.com/"
    ],
    "anchoringServices": [
      "https://pdmfc-pt.glass.pdmfc.com/"
    ],
    "mqEndpoints": [
      "https://pdmfc-pt.glass.pdmfc.com/"
    ],
    "notifications": [
      "https://pdmfc-pt.glass.pdmfc.com/"
    ]
  },
  "pdmfc.pt-vault": {
    "_comment": "generated with bdns generator",
    "replicas": [],
    "brickStorages": [
      "https://pdmfc-pt.glass.pdmfc.com/"
    ],
    "anchoringServices": [
      "https://pdmfc-pt.glass.pdmfc.com/"
    ],
    "mqEndpoints": [
      "https://pdmfc-pt.glass.pdmfc.com/"
    ],
    "notifications": [
      "https://pdmfc-pt.glass.pdmfc.com/"
    ]
  }
}