
{
  "default": {
    "_comment": "generated with bdns generator",
    "replicas": [],
    "brickStorages": [
      "$ORIGIN"
    ],
    "anchoringServices": [
      "$ORIGIN"
    ],
    "mqEndpoints": [
      "$ORIGIN"
    ],
    "notifications": [
      "$ORIGIN"
    ]
  },

  "vault": {
    "_comment": "generated with bdns generator",
    "replicas": [],
    "brickStorages": [
      "$ORIGIN"
    ],
    "anchoringServices": [
      "$ORIGIN"
    ],
    "mqEndpoints": [
      "$ORIGIN"
    ],
    "notifications": [
      "$ORIGIN"
    ]
  }
}  