<?xml version="1.0" encoding="utf-8"?>
<!-- Generator: Adobe Illustrator 22.1.0, SVG Export Plug-In . SVG Version: 6.00 Build 0)  -->
<svg version="1.1" id="Ebene_1" xmlns="http://www.w3.org/2000/svg" xmlns:xlink="http://www.w3.org/1999/xlink" x="0px" y="0px"
	 viewBox="0 0 128 128" style="enable-background:new 0 0 128 128;" xml:space="preserve">
<g>
	<path d="M110,0H18C10.8,0,0,4.8,0,18l0,92c0,7.2,4.8,18,18,18h92c4.1,0,8.5-1.5,11.7-4c4.1-3.3,6.3-8.1,6.3-13.9V18
		C128,10.8,123.2,0,110,0z M118.1,18v92c0,7.6-6.8,8.1-8.1,8.1H18c-7.2,0-8-5.7-8.1-8.1V18c0-7.4,6.2-8,8.1-8.1h92
		C117.2,9.9,118,15.6,118.1,18z"/>
</g>
<g>
	<path d="M47.1,92c3.1-0.3,5.4-0.7,6.7-1.2c1.4-0.5,2.3-1.5,2.7-2.8c0.5-1.4,0.7-3.6,0.7-6.7V40.4c-3.9,0.1-6.7,0.5-8.3,1
		c-1.6,0.5-2.7,1.6-3.3,3.3c-0.6,1.7-1.2,4.7-1.6,9l-8.3,0.6c0.5-5.6,0.9-12.8,1.2-21.7l1.1-1.1l10.1,1.1h31.7l10.3-1.1l1.1,1.1
		c0.1,8.1,0.5,15.2,1,21l-8.3,0.6c-0.5-4.6-1.1-7.8-1.7-9.5c-0.6-1.7-1.6-2.8-3.1-3.4c-1.5-0.6-4.1-0.9-7.8-1.1
		c-0.3,5-0.6,11.8-0.9,20.4c-0.2,8.6-0.4,16.4-0.4,23.5c0,2.5,0.4,4.3,1.3,5.4c0.9,1.1,2.3,1.6,4.3,1.6c1.7,0,3.5-0.1,5.4-0.3
		l0.4,0.5l-0.9,6.8c-7.2-0.3-13-0.4-17.5-0.4c-3.5,0-9.2,0.2-16.9,0.6L47.1,92z"/>
</g>
</svg>
