<?xml version="1.0" encoding="utf-8"?>
<!-- Generator: Adobe Illustrator 22.1.0, SVG Export Plug-In . SVG Version: 6.00 Build 0)  -->
<svg version="1.1" id="Ebene_1" xmlns="http://www.w3.org/2000/svg" xmlns:xlink="http://www.w3.org/1999/xlink" x="0px" y="0px"
	 viewBox="0 0 128 128" style="enable-background:new 0 0 128 128;" xml:space="preserve">
<g>
	<path d="M85.6,19.5C85.6,19.5,85.6,19.5,85.6,19.5l-21.7,0l-21.4,0c-3.8,0-7.7,1.6-10.3,4.2c-2.5,2.5-3.9,6-3.8,10v16.2
		c0,5.7,3.8,14.2,14.2,14.2l21.4,0l21.8,0c3.8,0,7.7-1.6,10.3-4.2c2.5-2.5,3.9-6,3.9-10V33.7C99.8,28,96,19.5,85.6,19.5z M89.5,33.6
		v16.3c0,2.5-1.3,3.8-3.9,3.9l-21.7,0l-21.4,0c-2.5,0-3.8-1.3-3.9-3.9V33.6c0-2.5,1.3-3.8,3.9-3.9l21.4,0l21.8,0
		C88.8,29.8,89.5,31.9,89.5,33.6z"/>
	<circle cx="35.6" cy="77.3" r="6.9"/>
	<circle cx="92.5" cy="77.3" r="6.9"/>
	<path d="M89.6,0.1c-0.1,0-0.2,0-0.3,0l-0.3,0c-0.3-0.1-0.7-0.1-1,0H38.6c-0.2,0-0.4,0-0.6,0.1C27.6,1,10.9,7.8,10.9,29.1v43.8
		c0,10,6.1,29,29,29h0.7l-12.2,17.9c-0.8,1.1-1.2,2.5-1,3.8c0.2,1.3,0.9,2.5,2,3.3c0.9,0.6,1.9,1,3,1c1.6,0,3.2-0.8,4.1-2.1l0.2-0.3
		c0,0,0.1-0.1,0.1-0.1l5.9-9.3h42.3l6.2,9.7c1,1.3,2.5,2.1,4.1,2.1c1.1,0,2.1-0.3,3-1c1.1-0.8,1.8-2,2-3.3c0.2-1.4-0.1-2.7-0.9-3.8
		l-12.2-17.9l0.7,0c0.3,0,7.4,0,14.3-3.5c6.7-3.4,14.7-10.5,14.7-25.4V29C117.2,19.3,111.5,0.9,89.6,0.1z M50.3,106l2.9-4l21.7,0
		l2.9,3.9L50.3,106z M107,29v44c0,0.1,0,0.2-0.1,0.4c0,7.5-2.9,12.9-8.6,16c-4.5,2.4-9.3,2.6-10.1,2.6l-48.2-0.1
		c-18.1,0-18.8-16.9-18.8-18.8V29.1c0-16.7,13.8-18.6,18-18.8H88c0.1,0,0.2,0,0.4,0.1C106,10.5,107,25.9,107,29z"/>
</g>
</svg>
