<?xml version="1.0" encoding="utf-8"?>
<!-- Generator: Adobe Illustrator 22.1.0, SVG Export Plug-In . SVG Version: 6.00 Build 0)  -->
<svg version="1.1" id="Ebene_1" xmlns="http://www.w3.org/2000/svg" xmlns:xlink="http://www.w3.org/1999/xlink" x="0px" y="0px"
	 viewBox="0 0 128 128" style="enable-background:new 0 0 128 128;" xml:space="preserve">
<g>
	<path d="M123.8,16.8c-2.6-2.6-6-3.9-10.2-3.9H99.2l0-6.8C99.2,3,96.9,0.2,94,0l-0.3,0c-2.8,0-5.2,2.3-5.4,5.4l-0.1,1.9v5.5H38.5
		c0-2.9,0-5.8,0-6.7c0.1-3.2-2.3-6-5.2-6.1L33,0c-2.8,0-5.2,2.3-5.5,5.4l-0.1,1.9v5.5h-13C8.6,12.9,0,16.7,0,27.3v86.3
		c0,5.8,3.8,14.4,14.4,14.4h99.1c5.8,0,14.4-3.8,14.4-14.4l0-86.3C128,24.3,126.9,20,123.8,16.8z M117.9,49.4V114
		c-0.1,2.5-1.6,3.8-4.3,3.9H14.4c-2.8,0-4.3-1.5-4.3-4.3V49.4H117.9z M88.3,26.5l0,0.1c0.3,3,2.7,5.3,5.5,5.3l0.3,0
		c2.9-0.2,5.2-2.9,5.2-6.1V23h14.4c3.5,0,4.3,2.3,4.3,4.3v11.9H10.1v-12c0-2.8,1.5-4.2,4.3-4.3h13.1l0,1.7l0.1,1.9
		c0.3,3,2.6,5.3,5.4,5.3l0.3,0c2.9-0.2,5.2-2.9,5.2-6.1c0-0.8,0-1.6,0-2.4V23h49.6v1.7L88.3,26.5z"/>
</g>
<path d="M75,59.4c2.9,2.3,4.3,5.3,4.3,9c0,2.5-0.7,4.8-2.1,7.2c-1.4,2.3-3.6,4.3-6.5,5.9v0.5c6.6,1.9,9.8,5.9,9.8,12
	c0,3.3-1,6.3-2.8,8.8c-1.9,2.6-4.6,4.6-8,6c-3.4,1.4-7.4,2.1-11.8,2.1c-3.2,0-6.4-0.3-9.8-0.9l-0.6-9.3l0.8-0.8
	c3.6,1.3,6.9,1.9,10,1.9c3.4,0,6-0.6,7.9-2c1.9-1.3,2.9-3.2,2.9-5.6c0-4.1-2.7-6.2-8.2-6.4h-6.3L54,86.9l0.4-8.2l4-0.2
	c2.3-0.1,4.3-0.8,6.1-2.2c1.8-1.4,2.7-3.2,2.7-5.4c0-1.6-0.5-2.9-1.6-3.8c-1.1-0.9-2.6-1.3-4.5-1.3c-3.1,0-6.7,1.4-10.6,4.2h-1.3
	l-1.8-8.7C52.5,57.8,58,56,63.7,56C68.4,56,72.1,57.2,75,59.4"/>
</svg>
