<?xml version="1.0" encoding="utf-8"?>
<svg version="1.1" xmlns="http://www.w3.org/2000/svg" xmlns:xlink="http://www.w3.org/1999/xlink" x="0px" y="0px"
	 viewBox="0 0 128 128" style="enable-background:new 0 0 128 128;" xml:space="preserve">
<g>
	<circle cx="26.7" cy="64.8" r="6.9"/>
	<circle cx="45.6" cy="64.8" r="6.9"/>
	<circle cx="64.5" cy="64.8" r="6.9"/>
	<circle cx="83.4" cy="64.8" r="6.9"/>
	<circle cx="26.7" cy="83.6" r="6.9"/>
	<circle cx="45.6" cy="83.6" r="6.9"/>
	<circle cx="64.5" cy="83.6" r="6.9"/>
	<path d="M123.8,16.8c-2.6-2.6-6-3.9-10.2-3.9H99.2l0-6.8C99.2,3,96.9,0.2,94,0l-0.3,0c-2.8,0-5.2,2.3-5.4,5.4l-0.1,1.9v5.5H38.5
		c0-2.9,0-5.8,0-6.7c0.1-3.2-2.3-6-5.2-6.1L33,0c-2.8,0-5.2,2.3-5.5,5.4l-0.1,1.9v5.5h-13C8.6,12.9,0,16.7,0,27.3v86.3
		c0,5.8,3.8,14.4,14.4,14.4h99.1c5.8,0,14.4-3.8,14.4-14.4l0-86.3C128,24.3,126.9,20,123.8,16.8z M117.9,49.4V114
		c-0.1,2.5-1.6,3.8-4.3,3.9H14.4c-2.8,0-4.3-1.5-4.3-4.3V49.4H117.9z M88.3,26.5l0,0.1c0.3,3,2.7,5.3,5.5,5.3l0.3,0
		c2.9-0.2,5.2-2.9,5.2-6.1V23h14.4c3.5,0,4.3,2.3,4.3,4.3v11.9H10.1v-12c0-2.8,1.5-4.2,4.3-4.3h13.1l0,1.7l0.1,1.9
		c0.3,3,2.6,5.3,5.4,5.3l0.3,0c2.9-0.2,5.2-2.9,5.2-6.1c0-0.8,0-1.6,0-2.4V23h49.6v1.7L88.3,26.5z"/>
</g>
</svg>
