<?xml version="1.0" encoding="UTF-8"?>
<svg width="20px" height="20px" viewBox="0 0 20 20" version="1.1" xmlns="http://www.w3.org/2000/svg" xmlns:xlink="http://www.w3.org/1999/xlink">
    <!-- Generator: Sketch 52.2 (67145) - http://www.bohemiancoding.com/sketch -->
    <title>icon/blue/minus</title>
    <desc>Created with Sketch.</desc>
    <g id="icon/blue/minus" stroke="none" stroke-width="1" fill="none" fill-rule="evenodd" stroke-linecap="round" stroke-linejoin="round">
        <g id="zoom-out" transform="translate(2.000000, 2.000000)" stroke="#8BA4C1" stroke-width="1.5">
            <path d="M15.4871795,8.05005128 C15.4875114,11.0578316 13.6759236,13.7696311 10.8971921,14.9208887 C8.11846068,16.0721464 4.9198376,15.43613 2.79289836,13.3094255 C0.665959131,11.1827209 0.029589808,7.98416806 1.18054086,5.20530959 C2.3314919,2.42645112 5.04309143,0.614564121 8.05087179,0.614564103 C12.1575107,0.614564078 15.4867264,3.94341238 15.4871795,8.05005128 Z" id="Path"></path>
            <path d="M4.30769231,7.99917949 L11.6923077,7.99917949" id="Path"></path>
        </g>
    </g>
</svg>