<?xml version="1.0" encoding="UTF-8"?>
<svg width="20px" height="20px" viewBox="0 0 20 20" version="1.1" xmlns="http://www.w3.org/2000/svg" xmlns:xlink="http://www.w3.org/1999/xlink">
    <!-- Generator: Sketch 52.2 (67145) - http://www.bohemiancoding.com/sketch -->
    <title>icon/blue/plus</title>
    <desc>Created with Sketch.</desc>
    <g id="icon/blue/plus" stroke="none" stroke-width="1" fill="none" fill-rule="evenodd" stroke-linecap="round" stroke-linejoin="round">
        <g id="zoom-in" transform="translate(2.000000, 2.000000)" stroke="#8BA4C1" stroke-width="1.5">
            <path d="M15.4871795,8.05005128 C15.4875114,11.0579063 13.6758348,13.7697576 10.8970026,14.9209672 C8.1181704,16.0721768 4.91948293,15.43601 2.79260824,13.3091353 C0.665733555,11.1822607 0.029566779,7.98357319 1.18077637,5.204741 C2.33198595,2.4259088 5.0438373,0.614232238 8.05169231,0.614564103 C12.1580108,0.615017164 15.4867264,3.94373278 15.4871795,8.05005128 Z" id="Path"></path>
            <path d="M4.30769231,7.99917949 L11.6923077,7.99917949" id="Path"></path>
            <path d="M8,11.6914872 L8,4.30687179" id="Path"></path>
        </g>
    </g>
</svg>