<?xml version="1.0" encoding="UTF-8"?>
<svg viewBox="0 0 45 50" version="1.1" xmlns="http://www.w3.org/2000/svg" xmlns:xlink="http://www.w3.org/1999/xlink">
  <defs>
    <linearGradient x1="13.8434782%" y1="78.8165473%" x2="52.9918617%" y2="22.0909148%" id="linearGradient-1">
      <stop stop-color="#FF7911" offset="0%"></stop>
      <stop stop-color="#FE7711" offset="56.53%"></stop>
      <stop stop-color="#FB700F" offset="76.88%"></stop>
      <stop stop-color="#F5650C" offset="91.34%"></stop>
      <stop stop-color="#F05909" offset="99.97%"></stop>
    </linearGradient>
    <linearGradient x1="10.1992325%" y1="74.7630565%" x2="51.8421301%" y2="24.1317446%" id="linearGradient-2">
      <stop stop-color="#FF8D15" stop-opacity="0" offset="50%"></stop>
      <stop stop-color="#FE8A14" stop-opacity="0.3401" offset="67%"></stop>
      <stop stop-color="#FA8212" stop-opacity="0.5434" offset="77.17%"></stop>
      <stop stop-color="#F3740F" stop-opacity="0.7108" offset="85.54%"></stop>
      <stop stop-color="#EA600A" stop-opacity="0.8577" offset="92.89%"></stop>
      <stop stop-color="#DE4603" stop-opacity="0.9915" offset="99.57%"></stop>
      <stop stop-color="#DD4403" offset="100%"></stop>
    </linearGradient>
    <linearGradient x1="50.3529037%" y1="73.3992169%" x2="85.1479683%" y2="36.4027797%" id="linearGradient-3">
      <stop stop-color="#FF8F15" offset="43.63%"></stop>
      <stop stop-color="#FF9916" stop-opacity="0.4597" offset="74.09%"></stop>
      <stop stop-color="#FFA618" stop-opacity="0" offset="100%"></stop>
    </linearGradient>
  </defs>
  <g id="Page-1" stroke="none" stroke-width="1" fill="none" fill-rule="evenodd">
    <g id="Group" transform="translate(-0.452000, 0.180000)" fill-rule="nonzero">
      <path d="M0.76,17.024 C0.608,17.328 0.532,17.708 0.532,18.164 L0.532,47.652 C0.532,49.096 2.204,49.932 3.344,49.02 L22.876,33.972 L0.76,17.024 Z" id="Path" fill="url(#linearGradient-1)"></path>
      <path d="M0.76,17.024 C0.608,17.328 0.532,17.708 0.532,18.164 L0.532,47.652 C0.532,49.096 2.204,49.932 3.344,49.02 L22.876,33.972 L0.76,17.024 Z" id="Path" fill="url(#linearGradient-2)" opacity="0.5"></path>
      <path d="M0.76,17.024 L22.876,33.972 L44.992,17.024 C44.84,16.644 44.536,16.34 44.232,16.036 L24.016,0.532 C23.332,0 22.42,0 21.736,0.532 L7.524,11.4 L1.52,15.96 C1.216,16.264 0.912,16.644 0.76,17.024 Z" id="Path" fill="#FF8F15"></path>
      <path d="M22.876,33.972 L24.472,35.188 L39.748,46.892 L42.484,48.944 C43.624,49.856 45.296,49.02 45.296,47.576 L45.296,18.088 C45.296,17.708 45.22,17.328 45.068,16.948 L22.876,33.972 Z" id="Path" fill="#FFA618"></path>
      <path d="M22.876,33.972 L24.472,35.188 L39.748,46.892 L42.484,48.944 C43.624,49.856 45.296,49.02 45.296,47.576 L45.296,18.088 C45.296,17.708 45.22,17.328 45.068,16.948 L22.876,33.972 Z" id="Path" fill="url(#linearGradient-3)"></path>
    </g>
  </g>
</svg>
