﻿									"Унифицированная форма КО-2
Утверждена постановлением Госкомстата России от 18.08.98 № 88"
									Код
	ООО "Нижегородский МК"							Форма по ОКУД	0310002
	(организация)							по ОКПО	12956678
	Бухгалтерия								
	(структурное подразделение)								
									
						Номер документа		Дата составления	
					РАСХОДНЫЙ КАССОВЫЙ ОРДЕР	*		29.03.2021	
									
	Дебет				Кредит	Сумма		Код целевого назначения	
		код структурного подразделения	"корреспонди-
рующий счет, субсчет"	код аналити- ческого учета					
						1 000,00			
									
	Выдать								
		(фамилия, имя, отчество)							
	Основание								
	Сумма	Одна тысяча рублей 00 копеек							
		(прописью)							
	Приложение								
									
	Руководитель организации		Директор					Алексеев И.	
			(должность)			(подпись)		(расшифровка подписи)	
	Главный бухгалтер					Веселов М.			
			(подпись)			(расшифровка подписи)			
	Получил								
			(сумма прописью)						
									
	29 марта 2021 г.					Подпись			
									
	По								
		(наименование, номер, дата и место выдачи документа,							
									
	удостоверяющего личность получателя)								
	Выдал кассир								
		(подпись)			(расшифровка подписи)				