﻿
Параметры:	Период: 01.10.2019 - 30.11.2019
	Этап заказ клиента "Заказано":
	Этап заказ клиента "Подтверждено":
	Этап заказ на перемещение "Заказано":
	Этап заказ на перемещение "Подтверждено":

Основной получатель	Количество					Сумма				
Получатель	По заказу			По накладной		По заказу			По накладной	
Заказ	Заказано	Подтверждено	Отклонение	Факт	Отклонение	Заказано	Подтверждено	Отклонение	Факт	Отклонение
Номенклатура										
Обычный покупатель	2 550	2 550			-2 550	255 000	255 000			-255 000
Обычная точка доставки. Без региона	1 500	1 500			-1 500	150 000	150 000			-150 000
*	500	500			-500	50 000	50 000			-50 000
Сыр Сулугуни	500	500			-500	50 000	50 000			-50 000
*	500	500			-500	50 000	50 000			-50 000
Сыр Сулугуни	500	500			-500	50 000	50 000			-50 000
*	500	500			-500	50 000	50 000			-50 000
Сыр Сулугуни	500	500			-500	50 000	50 000			-50 000
Обычная точка доставки. Новая группа планирования	1 050	1 050			-1 050	105 000	105 000			-105 000
*	500	500			-500	50 000	50 000			-50 000
Сыр Сулугуни	500	500			-500	50 000	50 000			-50 000
*	500	500			-500	50 000	50 000			-50 000
Сыр Сулугуни	500	500			-500	50 000	50 000			-50 000
*	50	50			-50	5 000	5 000			-5 000
Сыр Сулугуни	50	50			-50	5 000	5 000			-5 000
Итого	2 550	2 550			-2 550	255 000	255 000			-255 000