﻿
Параметры:	Виды цен: Базовый; Базовый для зависимых; Зависимый 1; Зависимый 2; Ашан; 5ка; Перекресток
	*

Номенклатура	5ка, RUB	Ашан, RUB	Базовый, RUB	Базовый для зависимых, RUB	Зависимый 1, RUB	Зависимый 2, RUB	Перекресток, RUB
Характеристика	кг	кг	кг	кг	кг	кг	кг
	Цена	Цена	Цена	Цена	Цена	Цена	Цена
Сыр Адыгейский	200,00	100,00	100,00	100,00	85,00	85,00	200,00
Сыр Костромской	250,00	50,00	50,00	50,00	45,00	40,00	250,00
Сыр Пошехонский	350,00	250,00	250,00	250,00	225,00	212,50	350,00