﻿{
    "Version": "1.2.034",
    "Lang": "ru",
    "DebugLog": false,
    "ВерсияVA": "ver 1.2.034",
    "КаталогФич": "$workspaceRoot/features/03_k2/08_purchase",
    "ДобавлятьКИмениСценарияУсловияВыгрузки": true,
    "ИмяСборки": "08_purchase",
    "ИмяТекущейСборки": "08_purchase",
    "ВыполнитьСценарии": true,
    "ЗавершитьРаботуСистемы": true,
    "ЗагрузкаФичПриОткрытии": "Загружать",
    "ЗакрытьTestClientПослеЗапускаСценариев": true,
    "ПоставщикПользовательскихНастроек": "FILE",
    "ВыполнениеСценариев": {
        "ВыполнятьШагиАссинхронно": false,
        "ИнтервалВыполненияШагаЗаданныйПользователем": 0.01,
        "ОбновлятьСтатистикуВДереве": false,
        "ОбновлятьДеревоПриНачалеВыполненияСценария": false,
        "ОстановкаПриВозникновенииОшибки": false,
        "ПоказыватьНомерСтрокиДереваПриВозникновенииОшибки": false,
        "ПриравниватьPendingКFailed": false,
        "ВыполнятьSleepЧерезPing": true,
        "ТаймаутДляАсинхронныхШагов": 0,
        "КоличествоСекундПоискаОкна": 5,
        "КоличествоПопытокВыполненияДействия": 3,
        "БезопасноеВыполнениеШагов": false,
        "ПаузаПриОткрытииОкна": 0
    },
    "КлиентТестирования": {
        "ЗапускатьКлиентТестированияСМаксимизированнымОкном": true,
        "ТаймаутЗапуска1С": 60,
        "ДиапазонПортовTestclient": "25100-25200",
        "ЗапускатьТестКлиентВРежимеОтладки": false,
        "КлючиОтладки": "-http -attach",
        "АдресОтладчика": "http://localhost:1550"
    },
    "ДелатьОтчетВФорматеАллюр": true,
    "ОтчетAllure": {
        "КаталогВыгрузкиAllure": "$workspaceRoot/build/08_purchase/allure-report",
        "КаталогВыгрузкиAllureБазовый": "",
        "УровеньОтчета1": "#report.epic=;Каталог1",
        "УровеньОтчета2": "#report.feature=;ИмяФичи",
        "УровеньОтчета3": "#report.story=;ИмяСценария",
        "ГруппировкаTestSuites": "ИмяФичи",
        "ПрикладыватьКОтчетуAllureЖурналРегистрацииВыполненияСценария": false,
        "ПрикладыватьКОтчетуAllureДанныеОСостоянииАктивнойФормы": true,
        "ПрикладыватьКОтчетуAllureДанныеОЗначенияхПеременных": true,
        "ПрикладыватьКОтчетуAllureДанныеОСостоянииВсехФорм": false,
        "ПрикладыватьКОтчетуAllureДанныеОСетевыхСоединениях": false,
        "ПрикладыватьКОтчетуAllureДанныеОПроцессахОС": false,
        "КаталогОтносительноКоторогоНадоСтроитьИерархию": "$workspaceRoot/features/03_k2",
        "ДанныеАллюрМеток": []
    },
    "ДелатьОтчетВФорматеjUnit": true,
    "ОтчетJUnit": {
        "КаталогВыгрузкиJUnit": "$workspaceRoot/build/08_purchase/junitreport"
    },
    "ДелатьОтчетВФорматеCucumberJson": false,
    "ОтчетCucumber": {
        "КаталогВыгрузкиCucumberJson": "$workspaceRoot/build/08_purchase/cucumber"
    },
    "ДелатьОтчетВФорматеСППР": false,
    "СоздаватьИнструкциюHTML": false,
    "СоздаватьИнструкциюMarkdown": false,
    "ДелатьОтчетВоВнутреннемФормате": false,
    "КаталогиБиблиотек": [
        "$instrumentsRoot/features/libraries",
        "$workspaceRoot/Lib"
    ],
    "СписокТеговИсключение": [
        "ignore"
    ],
    "ДелатьЛогВыполненияСценариевВЖР": false,
    "ДелатьЛогВыполненияСценариевВТекстовыйФайл": false,
    "ВыводитьВЛогВыполнениеШагов": false,
    "ДелатьЛогОшибокВТекстовыйФайл": false,
    "ПодробныйЛогВыполненияСценариев": false,
    "СобиратьДанныеОСостоянииАктивнойФормыПриОшибке": true,
    "СобиратьДанныеОСостоянииВсехФормПриОшибке": false,
    "СобиратьДанныеОСетевыхСоединениях": false,
    "СобиратьДанныеОПроцессахОС": false,
    "ИмяФайлаЛогВыполненияСценариев": "$workspaceRoot/build/08_purchase/log.txt",
    "ИмяКаталогаЛогОшибок": "$workspaceRoot/build/08_purchase/errors/",
    "ИспользоватьКомпонентуVanessaExt": true,
    "ИспользоватьВнешнююКомпонентуДляСкриншотов": true,
    "СпособСнятияСкриншотовВнешнейКомпонентой": 2,
    "ДелатьСкриншотПриВозникновенииОшибки": true,
    "СниматьСкриншотКаждогоОкна1С": true,
    "КаталогВыгрузкиСкриншотов": "$workspaceRoot/build/08_purchase/ScreenShots",
    "ВыгружатьСтатусВыполненияСценариевВФайл": true,
    "ПутьКФайлуДляВыгрузкиСтатусаВыполненияСценариев": "$workspaceRoot/build/BuildStatus.log",
    "СоздаватьИнструкциюВидео": false,
    "ИспользоватьSikuliXСервер": false,
    "ИскатьЭлементыФормыПоИмени": false,
    "ДобавлятьПриНакликиванииМетаИнформацию": false,
    "ТегTreeВключенПоУмолчанию": true
}