﻿
Параметры:	Дата: 31.03.2021 0:00:00
Отбор:	"Контрагент Равно ""Табрис"" И
Организация Равно ""Нижегородский МК"""

Организация	Долг	Просрочено
Контрагент		
Соглашение		
Объект расчетов		
Документ		
Нижегородский МК		
Табрис		
Соглашение с Табрис с 01.01.2021		
Реализация товаров * от 17.03.2021 12:00:01		
Реализация товаров * от 17.03.2021 12:00:01	41 050	41 050
Приходный кассовый ордер * от 26.03.2021 [Создан]	-41 050	-41 050
Итого		