﻿
Параметры:	Дата: 20.03.2021 0:00:00

Организация	Долг	Просрочено
Контрагент		
Соглашение		
Объект расчетов		
Документ		
Нижегородский МК	110 325	34 617,5
Лента	41 025	7 102,5
Соглашение с Лентой с 01.01.2021	41 025	7 102,5
Соглашение с Лентой с 01.01.2021	41 025	7 102,5
		
Реализация товаров * от 17.03.2021 *	41 025	7 102,5
Перекресток	28 250	9 150
Соглашение с Перекрестком с 01.01.2021	28 250	9 150
Соглашение с Перекрестком с 01.01.2021	28 250	9 150
		
Корректировка реализации товаров * от 19.03.2021 *	500	-650
Реализация товаров * от 17.03.2021 *	27 750	9 800
Табрис	41 050	18 365
Соглашение с Табрис с 01.01.2021	41 050	18 365
Реализация товаров * от 17.03.2021 *	41 050	18 365
		
Реализация товаров * от 17.03.2021 *	41 050	18 365
Итого	110 325	34 617,5