﻿
Параметры:	Дата: 20.03.2021 0:00:00
Отбор:	"Контрагент Равно ""Перекресток"" И
Организация Равно ""Нижегородский МК"""

Организация	Долг	Просрочено
Контрагент		
Соглашение		
Объект расчетов		
Документ		
Нижегородский МК	28 250	9 150
Перекресток	28 250	9 150
Соглашение с Перекрестком с 01.01.2021	28 250	9 150
Соглашение с Перекрестком с 01.01.2021	28 250	9 150
		
Корректировка реализации товаров * от 19.03.2021 *	500	-650
Реализация товаров * от 17.03.2021 *	27 750	9 800
Итого	28 250	9 150