﻿					"Типовая межотраслевая форма № 1-Т 
Утверждена постановлением Госкомстата России от 28.11.97 №78"
					Коды
				Форма по ОКУД	0345009
		ТОВАРНО-ТРАНСПОРТНАЯ НАКЛАДНАЯ		№	*
				Дата составления	*
	"
Грузоотправитель"	ООО "Организация", ИНН 9999115007, 117342, Москва г, Севастопольский пр-кт, дом № 56, тел.: +79101234567, р/с 40702810838110013654 в банке  БИК 044585250 к/с		по ОКПО	12345678
		полное наименование организации, адрес, номер телефона			
	"
Грузополучатель"	Обычная точка доставки. Без региона, тел.: +71294778863		по ОКПО	
		полное наименование организации, адрес, номер телефона			
	"
Плательщик"	Обычная точка доставки. Без региона, тел.: +71294778863		по ОКПО	
		полное наименование организации, адрес, банковские реквизиты			
	I ТОВАРНЫЙ РАЗДЕЛ (заполняется грузоотправителем)				
												Страница 1
	Код продукции (номенклатур- ный номер)	Номер прейскуранта и   дополнения к нему	Артикул или номер по прейскуранту	Коли- чество	Цена руб. коп.	Наименование продукции, товара (груза), ТУ, марка, размер, сорт	Единица измерения	Вид упаковки	Коли- чество мест	Масса, т	Сумма,  руб. коп.	Порядковый номер записи по складской картотеке (грузоотправителю, грузополучателю)
	1	2	3	4	5	6	7	8	9	10	11	12
	*		999-0123		291 280,00	Сыр Адыгейский / <Без маркировки>				0,074	21 640,94	
	*		999-0234	51,250	40,00	Сыр Костромской / Ашан	кг	упак	10	0,051	2 050,00	
	*		999-0345	25,120	219,17	Сыр Пошехонский / 5ка	кг	упак	10	0,025	5 505,55	
			Итого	76,370					20		29 196,49	
			Всего по накладной	76,370					20		29 196,49	
	Товарная накладная имеет продолжение на															листах, на бланках за N								
	и содержит		Три													порядковых номеров записей							Наценка,%	
			прописью																		0,151			
	Всего наименований		Три													Масса груза (нетто)		Сто пятьдесят один  кг.				т	"Складские или 
транспортные
 расходы"	
			прописью															прописью			0,227			
																								
	Всего мест		Двадцать													Масса груза (брутто)		Двести двадцать семь  кг.				т		
			прописью															прописью					Всего к  оплате	
	Приложение (паспорта, сертификаты и т.п.) на										листах					По доверенности №				 от				
								прописью								выданной								
	Всего отпущено			Три			наименований																	
	Двадцать девять тысяч сто девяносто шесть рублей 49 копеек																							
																								
	Отпуск разрешил			Директор								Главный Р. К.				"Груз к 
перевозке принял"								
				должность				подпись					расшифровка подписи					должность			подпись		расшифровка подписи	
	Главный (старший) бухгалтер											Главный Б. К.												
								подпись					расшифровка подписи			"Груз получил 
грузополучатель"								
	"Отпуск груза 
произвел"																	должность			подпись		расшифровка подписи	
				должность				подпись					расшифровка подписи											
	М.П.		*																					
	II ТРАНСПОРТНЫЙ РАЗДЕЛ												
	Срок доставки груза											ТТН №	*
	Организация	Перевозчик(Газель)										"К путевому 
листу №"	
		наименование, адрес, номер телефона, банковские реквизиты											
	Автомобиль	Газель					Государственный №		А524НВ				
		марка											
	Заказчик (плательщик)		Обычная точка доставки. Без региона, Нижегородская область, город Нижний Новгород, ул. Верхнепечерская, дом 21, тел.: +71294778863										
			наименование, адрес, номер телефона, банковские реквизиты										
	Водитель	Водитель Петров Петр				Удостоверение №						Код	
	Лицензионная карточка		стандартная	ограниченная		Вид перевозки							
			ненужное зачеркнуть										
	Регистрационный №			Серия		№							
	Пункт погрузки	117342, Москва г, Севастопольский пр-кт, дом № 56				Пункт разгрузки		Нижегородская область, город Нижний Новгород, ул. Верхнепечерская, дом 21				Маршрут №	
		адрес, номер телефона						адрес, номер телефона					
	Переадресовка				1. прицеп				Государственный №			Гаражный №	
		наименование и адрес нового грузополучателя, номер распоряжения, подпись ответственного лица			2. прицеп				Государственный №			Гаражный №	
													
	СВЕДЕНИЯ О ГРУЗЕ								
	Краткое наименование груза	С грузом следуют документы	Вид упаковки	Кол. мест	"Способ опреде- 
ления массы"	Код груза	Номер контейнера	Класс груза	Масса брутто
	1	2	3	4	5	6	7	8	9
	Сыр Адыгейский / <Без маркировки>	Товарная накладная, Счет фактура							0,074
	Сыр Костромской / Ашан	Товарная накладная, Счет фактура	упак	10					0,103
	Сыр Пошехонский / 5ка	Товарная накладная, Счет фактура	упак	10					0,05
	Указанный груз с исправной  пломбой тарой и упаковкой				Двадцать	мест		Указанный груз с исправной  пломбой тарой и упаковкой			Двадцать	мест		Кол-во ездок, заездов			Итого: масса брутто,т	0,227
	Массой брутто		Двести двадцать семь  кг.			 к перевозке		Массой брутто		Двести двадцать семь  кг.		 к перевозке		Отметки о составленных актах				
	Сдал							Сдал						Транспортные услуги				
	Принял водитель																	
	экспедитор							Принял										
																		
	ПОГРУЗОЧНО-РАЗГРУЗОЧНЫЕ ОПЕРАЦИИ
	опе- рация	исполнитель (автовладелец, получатель, отправитель)	дополнительные операции (наименование, количество)	Механизм, грузоп. емкость ковша	Способ		"Дата (число, месяц), 
время, ч, мин."		Время дополнительных операций, мин	подпись ответств. лица
					руч мех	код	прибытия	убытия		
	10	11	12	13	14	15	16	17	18	19
	Погр.									
	Разгр.									
																
	ПРОЧИЕ СВЕДЕНИЯ (заполняется организацией - владельцем автотранспорта)															
	расст. перевозки по группам дорог, км					код эк-	за трансп. услуги		Сумма штрафа за неправильное оформл. докум.		Поправ. коэффиц		Время простоя ч, м.		Таксировка	
	всего	в гор	1 гр	2 гр	3 гр	спедир. груза	с клиента	причит. водителю			расц. водит.	основной тариф	под погрузкой	под разгрузкой		
	20	21	22	23	24	25	26	27	28		29	30	31	32		
																
	Расчет стоимости		за тонны	"за тонно - 
км"	погрузочно разгрузочные работы, т		Недогруз а/м и прицепа	Экспеди- рование	Сверхн. простой		За срочность заказа	за спец. транспорт	прочие доплаты	ВСЕГО		
									 при погрузке	разгрузке					Таксировщик	
			33	34	35		36	37	38	39	40	41	42	43		
	Выполнено														подпись	
	Расценка, руб															
	К оплате, руб														расшифровка подписи	