﻿																																							
																																							
																																							
																																							
																																							
																																							
	*																																						
																																							
																																							
																																							
	Склад:					Сырная ГП																																	
																																							
	Дата отгрузки:					24.09.2019 0:00:00																																	
																																							
	Товар												Количество план					Вес					
																							
	Сыр Сулугуни <Без маркировки> 000001 до 20.10.2019 0:00:00												10			кг		10					
																																							
																																							
																																							
																																							
	Отпустил																					Получил																	
																																							
																																							