﻿
Параметры:	Период: 02.09.2019 0:00:00
Отбор:	Контрагент Равно "Ашан"

Контрагент	Соглашение		Ашан				
Номенклатура	Характеристика	Упаковка	RUB				
			Цена с учетом скидки	Цена по прайсу	Цена по соглашению	% скидки	% скидки в соглашении
Ашан	Соглашение для Ашана по региону без скидки						
Крылья куринные (подложка)			200,00	200,00	200,00		
Сыр Адыгейский			100,00	100,00	100,00		
Сыр Костромской			50,00	50,00	50,00		
Сыр Пошехонский			250,00	250,00	250,00		
Ашан	Соглашение для Ашана по Скидочному региону						
Крылья куринные (подложка)			184,46	200,00	184,46		7,77
Сыр Адыгейский			92,23	100,00	92,23		7,77
Сыр Костромской			46,12	50,00	46,12		7,77
Сыр Пошехонский			230,58	250,00	230,58		7,77