{
    "Валюты": [
        {
            "Ссылка": "31d0e04e-3b72-11eb-bf7a-00155d019805",
            "Наименование": "RUB",
            "Код": "643",
            "НаименованиеПолное": "Российский рубль",
            "ПараметрыПрописи": "рубль, рубля, рублей, м, копейка, копейки, копеек, ж, 2 знака",
            "СпособУстановкиКурса": "РучнойВвод",
            "Представления": []
        }
    ],
    "Организации": [
        {
            "Ссылка": "31d0e04f-3b72-11eb-bf7a-00155d019805",
            "Наименование": "Организация",
            "Код": "000000001",
            "ИНН": "9999115007",
            "КПП": "999911500",
            "ОГРН": "1234567890123",
            "ПрефиксGS1": "789      ",
            "НаименованиеПолное": "Общество с ограниченной ответственностью \"Организация\"",
            "НаименованиеСокращенное": "ООО \"Организация\"",
            "НаименованиеМеждународное": "Organizatcia LLC",
            "КодОКВЭД": "999",
            "КодПоОКПО": "12345678",
            "ЮрФизЛицо": "ЮрЛицо",
            "КонтактнаяИнформация": [
                {
                    "Тип": "Адрес",
                    "Вид": {
                        "Тип": "СправочникСсылка.ВидыКонтактнойИнформации",
                        "Значение": "АдресОрганизации"
                    },
                    "Представление": "117342, Москва г, Севастопольский пр-кт, дом № 56",
                    "ЗначенияПолей": "<КонтактнаяИнформация xmlns=\"http://www.v8.1c.ru/ssl/contactinfo\" xmlns:xs=\"http://www.w3.org/2001/XMLSchema\" xmlns:xsi=\"http://www.w3.org/2001/XMLSchema-instance\" Представление=\"117342, Москва г, Севастопольский пр-кт, дом № 56\"><Состав xsi:type=\"Адрес\" Страна=\"РОССИЯ\"><Состав xsi:type=\"АдресРФ\"><ДопАдрЭл ТипАдрЭл=\"10100000\" Значение=\"117342\"/></Состав></Состав></КонтактнаяИнформация>",
                    "Страна": "РОССИЯ",
                    "ВидДляСписка": {
                        "Тип": "СправочникСсылка.ВидыКонтактнойИнформации",
                        "Значение": "АдресОрганизации"
                    },
                    "Значение": "{\r\n\"value\": \"117342, Москва г, Севастопольский пр-кт, дом № 56\",\r\n\"type\": \"Адрес\",\r\n\"country\": \"РОССИЯ\",\r\n\"addressType\": \"ВСвободнойФорме\",\r\n\"countryCode\": \"643\",\r\n\"ZIPcode\": \"117342\"\r\n}"
                },
                {
                    "Тип": "Телефон",
                    "Вид": {
                        "Тип": "СправочникСсылка.ВидыКонтактнойИнформации",
                        "Значение": "ТелефонОрганизации"
                    },
                    "Представление": "+79101234567",
                    "ЗначенияПолей": "<КонтактнаяИнформация xmlns=\"http://www.v8.1c.ru/ssl/contactinfo\" xmlns:xs=\"http://www.w3.org/2001/XMLSchema\" xmlns:xsi=\"http://www.w3.org/2001/XMLSchema-instance\" Представление=\"+79101234567\"><Состав xsi:type=\"НомерТелефона\" КодСтраны=\"79101234567\" КодГорода=\"\" Номер=\"\" Добавочный=\"\"/></КонтактнаяИнформация>",
                    "НомерТелефона": "79101234567",
                    "ВидДляСписка": {
                        "Тип": "СправочникСсылка.ВидыКонтактнойИнформации",
                        "Значение": "ТелефонОрганизации"
                    },
                    "Значение": "{\r\n\"value\": \"+79101234567\",\r\n\"type\": \"Телефон\",\r\n\"countryCode\": \"79101234567\"\r\n}"
                },
                {
                    "Тип": "АдресЭлектроннойПочты",
                    "Вид": {
                        "Тип": "СправочникСсылка.ВидыКонтактнойИнформации",
                        "Значение": "EmailОрганизации"
                    },
                    "Представление": "td@mail.ru",
                    "ЗначенияПолей": "<КонтактнаяИнформация xmlns=\"http://www.v8.1c.ru/ssl/contactinfo\" xmlns:xs=\"http://www.w3.org/2001/XMLSchema\" xmlns:xsi=\"http://www.w3.org/2001/XMLSchema-instance\" Представление=\"td@mail.ru\"><Состав xsi:type=\"ЭлектроннаяПочта\" Значение=\"td@mail.ru\"/></КонтактнаяИнформация>",
                    "АдресЭП": "td@mail.ru",
                    "ДоменноеИмяСервера": "mail.ru",
                    "ВидДляСписка": {
                        "Тип": "СправочникСсылка.ВидыКонтактнойИнформации",
                        "Значение": "EmailОрганизации"
                    },
                    "Значение": "{\r\n\"value\": \"td@mail.ru\",\r\n\"type\": \"АдресЭлектроннойПочты\"\r\n}"
                }
            ]
        }
    ],
    "ВидыЦен": [
        {
            "Ссылка": "6ed9a5d1-3dda-11eb-bf7a-00155d019805",
            "Наименование": "Поставщик 1",
            "Код": 1,
            "СпособЗадания": "РучнойВвод",
            "ВалютаЦены": {
                "Тип": "СправочникСсылка.Валюты",
                "Значение": {
                    "Код": "643",
                    "Наименование": "RUB"
                }
            },
            "Уточнения": []
        },
        {
            "Ссылка": "6ed9a5d2-3dda-11eb-bf7a-00155d019805",
            "Наименование": "Поставщик 2",
            "Код": 2,
            "СпособЗадания": "РучнойВвод",
            "ВалютаЦены": {
                "Тип": "СправочникСсылка.Валюты",
                "Значение": {
                    "Код": "643",
                    "Наименование": "RUB"
                }
            },
            "Уточнения": []
        }
    ],
    "ВидыНоменклатуры": [
        {
            "Ссылка": "71860f18-3b71-11eb-bf7a-00155d019805",
            "Наименование": "Потери",
            "ЭтоГруппа": false,
            "ЕдиницаИзмерения": {
                "Тип": "СправочникСсылка.УпаковкиЕдиницыИзмерения",
                "Значение": {
                    "КодПоОКЕИ": "166"
                }
            },
            "ИспользованиеХарактеристик": "НеИспользовать",
            "ТипВоспроизводства": "Производство",
            "СырьеваяСтатьяЗатрат": {
                "Тип": "СправочникСсылка.к2СырьевыеСтатьиЗатрат",
                "Значение": "Усушка"
            },
            "Тип": "Прочее",
            "ВариантНумерацииСерий": "ПоНоменклатуреВПределахДня",
            "ВидыАнализов": []
        },
        {
            "Ссылка": "71860f1a-3b71-11eb-bf7a-00155d019805",
            "Наименование": "Сыр",
            "ЭтоГруппа": false,
            "ЕдиницаИзмерения": {
                "Тип": "СправочникСсылка.УпаковкиЕдиницыИзмерения",
                "Значение": {
                    "КодПоОКЕИ": "166"
                }
            },
            "НаборУпаковок": {
                "Тип": "СправочникСсылка.к2НаборыУпаковок",
                "Значение": "ИндивидуальныйДляНоменклатуры"
            },
            "ИспользованиеХарактеристик": "ОбщиеДляВидаНоменклатуры",
            "ИспользоватьУпаковки": "true",
            "ИспользоватьХарактеристики": "true",
            "ИспользоватьСерии": "true",
            "ТипВоспроизводства": "Производство",
            "ШаблонРабочегоНаименованияСерии": "Строка(Формат([ДатаВыпуска], \"ДФ=dd.MM.yyyy\" + \"/\" + [Номер]))   ",
            "СырьеваяСтатьяЗатрат": {
                "Тип": "СправочникСсылка.к2СырьевыеСтатьиЗатрат",
                "Значение": "ПолуфабрикатыПроизводимыеВПроцессе"
            },
            "УчаствуетВБалансеЖираБелка": "true",
            "Тип": "Прочее",
            "ВариантНумерацииСерий": "ПоНоменклатуреВПределахДня",
            "ВидыАнализов": []
        },
        {
            "Ссылка": "71860f21-3b71-11eb-bf7a-00155d019805",
            "Наименование": "Смеси",
            "ЭтоГруппа": false,
            "ЕдиницаИзмерения": {
                "Тип": "СправочникСсылка.УпаковкиЕдиницыИзмерения",
                "Значение": {
                    "КодПоОКЕИ": "166"
                }
            },
            "ИспользованиеХарактеристик": "НеИспользовать",
            "ИспользоватьСерии": "true",
            "ТипВоспроизводства": "Производство",
            "СырьеваяСтатьяЗатрат": {
                "Тип": "СправочникСсылка.к2СырьевыеСтатьиЗатрат",
                "Значение": "ПолуфабрикатыПроизводимыеВПроцессе"
            },
            "УчаствуетВБалансеЖираБелка": "true",
            "Тип": "Прочее",
            "ВариантНумерацииСерий": "ПоНоменклатуреВПределахДня",
            "ВидыАнализов": []
        },
        {
            "Ссылка": "71860f23-3b71-11eb-bf7a-00155d019805",
            "Наименование": "Молочное сырье",
            "ЭтоГруппа": false,
            "ЕдиницаИзмерения": {
                "Тип": "СправочникСсылка.УпаковкиЕдиницыИзмерения",
                "Значение": {
                    "КодПоОКЕИ": "166"
                }
            },
            "ИспользованиеХарактеристик": "НеИспользовать",
            "ИспользоватьСерии": "true",
            "ТипВоспроизводства": "Покупка",
            "СырьеваяСтатьяЗатрат": {
                "Тип": "СправочникСсылка.к2СырьевыеСтатьиЗатрат",
                "Значение": "Сырье"
            },
            "УчаствуетВБалансеЖираБелка": "true",
            "Тип": "СырьеИМатериалы",
            "ВариантНумерацииСерий": "ПоНоменклатуреВПределахДня",
            "ВидыАнализов": []
        },
        {
            "Ссылка": "71860f27-3b71-11eb-bf7a-00155d019805",
            "Наименование": "Упаковка для сыра",
            "ЭтоГруппа": false,
            "ЕдиницаИзмерения": {
                "Тип": "СправочникСсылка.УпаковкиЕдиницыИзмерения",
                "Значение": {
                    "КодПоОКЕИ": "796"
                }
            },
            "ИспользованиеХарактеристик": "НеИспользовать",
            "ТипВоспроизводства": "Покупка",
            "СырьеваяСтатьяЗатрат": {
                "Тип": "СправочникСсылка.к2СырьевыеСтатьиЗатрат",
                "Значение": "Упаковка"
            },
            "Тип": "Пакет",
            "ВариантНумерацииСерий": "ПоНоменклатуреВПределахДня",
            "ВидыАнализов": []
        },
        {
            "Ссылка": "71860f2b-3b71-11eb-bf7a-00155d019805",
            "Наименование": "Короба",
            "ЭтоГруппа": false,
            "ЕдиницаИзмерения": {
                "Тип": "СправочникСсылка.УпаковкиЕдиницыИзмерения",
                "Значение": {
                    "КодПоОКЕИ": "796"
                }
            },
            "ИспользованиеХарактеристик": "НеИспользовать",
            "ТипВоспроизводства": "Покупка",
            "СырьеваяСтатьяЗатрат": {
                "Тип": "СправочникСсылка.к2СырьевыеСтатьиЗатрат",
                "Значение": "Упаковка"
            },
            "Тип": "Короб",
            "ВариантНумерацииСерий": "ПоНоменклатуреВПределахДня",
            "ВидыАнализов": []
        },
        {
            "Ссылка": "71860f2d-3b71-11eb-bf7a-00155d019805",
            "Наименование": "Полуфабрикаты",
            "ЭтоГруппа": false,
            "ЕдиницаИзмерения": {
                "Тип": "СправочникСсылка.УпаковкиЕдиницыИзмерения",
                "Значение": {
                    "КодПоОКЕИ": "166"
                }
            },
            "ИспользованиеХарактеристик": "НеИспользовать",
            "ИспользоватьСерии": "true",
            "ТипВоспроизводства": "Производство",
            "СырьеваяСтатьяЗатрат": {
                "Тип": "СправочникСсылка.к2СырьевыеСтатьиЗатрат",
                "Значение": "ПолуфабрикатыПроизводимыеВПроцессе"
            },
            "УчаствуетВБалансеЖираБелка": "true",
            "Тип": "Прочее",
            "ВариантНумерацииСерий": "ПоНоменклатуреВПределахДня",
            "ВидыАнализов": []
        },
        {
            "Ссылка": "71860f32-3b71-11eb-bf7a-00155d019805",
            "Наименование": "Материалы ",
            "ЭтоГруппа": false,
            "ЕдиницаИзмерения": {
                "Тип": "СправочникСсылка.УпаковкиЕдиницыИзмерения",
                "Значение": {
                    "КодПоОКЕИ": "166"
                }
            },
            "ИспользованиеХарактеристик": "НеИспользовать",
            "ТипВоспроизводства": "Покупка",
            "СырьеваяСтатьяЗатрат": {
                "Тип": "СправочникСсылка.к2СырьевыеСтатьиЗатрат",
                "Значение": "Сырье"
            },
            "Тип": "Прочее",
            "ВариантНумерацииСерий": "ПоНоменклатуреВПределахДня",
            "ВидыАнализов": []
        },
        {
            "Ссылка": "71860f34-3b71-11eb-bf7a-00155d019805",
            "Наименование": "Материалы с сериями",
            "ЭтоГруппа": false,
            "ЕдиницаИзмерения": {
                "Тип": "СправочникСсылка.УпаковкиЕдиницыИзмерения",
                "Значение": {
                    "КодПоОКЕИ": "166"
                }
            },
            "ИспользованиеХарактеристик": "НеИспользовать",
            "ИспользоватьСерии": "true",
            "ТипВоспроизводства": "Покупка",
            "СырьеваяСтатьяЗатрат": {
                "Тип": "СправочникСсылка.к2СырьевыеСтатьиЗатрат",
                "Значение": "Закваска"
            },
            "Тип": "Прочее",
            "ВариантНумерацииСерий": "ПоНоменклатуреВПределахДня",
            "ВидыАнализов": []
        },
        {
            "Ссылка": "71860f38-3b71-11eb-bf7a-00155d019805",
            "Наименование": "Закваски, красители и пр.",
            "ЭтоГруппа": false,
            "ЕдиницаИзмерения": {
                "Тип": "СправочникСсылка.УпаковкиЕдиницыИзмерения",
                "Значение": {
                    "КодПоОКЕИ": "166"
                }
            },
            "ИспользованиеХарактеристик": "НеИспользовать",
            "ИспользоватьСерии": "true",
            "ТипВоспроизводства": "Покупка",
            "СырьеваяСтатьяЗатрат": {
                "Тип": "СправочникСсылка.к2СырьевыеСтатьиЗатрат",
                "Значение": "Закваска"
            },
            "Тип": "Прочее",
            "ВариантНумерацииСерий": "ПоНоменклатуреВПределахДня",
            "ВидыАнализов": []
        }
    ],
    "Номенклатура": [
        {
            "Ссылка": "9f1999f9-3b71-11eb-bf7a-00155d019805",
            "Наименование": "Российский 50%",
            "Код": "00-00000001",
            "ЭтоГруппа": false,
            "ВидНоменклатуры": {
                "Тип": "СправочникСсылка.ВидыНоменклатуры",
                "Значение": "71860f1a-3b71-11eb-bf7a-00155d019805"
            },
            "НаименованиеПолное": "Российский 50%",
            "ЕдиницаИзмерения": {
                "Тип": "СправочникСсылка.УпаковкиЕдиницыИзмерения",
                "Значение": {
                    "КодПоОКЕИ": "166"
                }
            },
            "ЕдиницаИзмерения1": {
                "Тип": "СправочникСсылка.УпаковкиЕдиницыИзмерения",
                "Значение": {
                    "КодПоОКЕИ": "796"
                }
            },
            "Кратность": "0.01",
            "СрокГодности": "50",
            "ТипНоменклатуры": "Сырье",
            "НаборУпаковок": {
                "Тип": "СправочникСсылка.к2НаборыУпаковок",
                "Значение": "ИндивидуальныйДляНоменклатуры"
            },
            "ИспользоватьУпаковки": "true",
            "ИспользованиеХарактеристик": "ОбщиеДляВидаНоменклатуры",
            "ИспользованиеДопЕдиницИзмерения": "Одна",
            "СырьеваяСтатьяЗатрат": {
                "Тип": "СправочникСсылка.к2СырьевыеСтатьиЗатрат",
                "Значение": "ПолуфабрикатыПроизводимыеВПроцессе"
            },
            "ПравилоОкругления": "НеОкруглять",
            "ДополнительныеРеквизиты": [],
            "ВидыАнализов": []
        },
        {
            "Ссылка": "9f1999fa-3b71-11eb-bf7a-00155d019805",
            "Наименование": "Потери",
            "Код": "00-00000002",
            "ЭтоГруппа": false,
            "ВидНоменклатуры": {
                "Тип": "СправочникСсылка.ВидыНоменклатуры",
                "Значение": "71860f18-3b71-11eb-bf7a-00155d019805"
            },
            "НаименованиеПолное": "Потери",
            "ЕдиницаИзмерения": {
                "Тип": "СправочникСсылка.УпаковкиЕдиницыИзмерения",
                "Значение": {
                    "КодПоОКЕИ": "166"
                }
            },
            "Кратность": "0.01",
            "ТипНоменклатуры": "Сырье",
            "ИспользованиеХарактеристик": "НеИспользовать",
            "ИспользованиеДопЕдиницИзмерения": "НеИспользовать",
            "СырьеваяСтатьяЗатрат": {
                "Тип": "СправочникСсылка.к2СырьевыеСтатьиЗатрат",
                "Значение": "Сырье"
            },
            "ПравилоОкругления": "НеОкруглять",
            "ДополнительныеРеквизиты": [],
            "ВидыАнализов": []
        },
        {
            "Ссылка": "9f1999fe-3b71-11eb-bf7a-00155d019805",
            "Наименование": "Закваска",
            "Код": "00-00000004",
            "ЭтоГруппа": false,
            "ВидНоменклатуры": {
                "Тип": "СправочникСсылка.ВидыНоменклатуры",
                "Значение": "71860f32-3b71-11eb-bf7a-00155d019805"
            },
            "НаименованиеПолное": "Закваска",
            "ЕдиницаИзмерения": {
                "Тип": "СправочникСсылка.УпаковкиЕдиницыИзмерения",
                "Значение": {
                    "КодПоОКЕИ": "166"
                }
            },
            "Кратность": "0.01",
            "ТипНоменклатуры": "Сырье",
            "ИспользованиеХарактеристик": "НеИспользовать",
            "ИспользованиеДопЕдиницИзмерения": "НеИспользовать",
            "СырьеваяСтатьяЗатрат": {
                "Тип": "СправочникСсылка.к2СырьевыеСтатьиЗатрат",
                "Значение": "Закваска"
            },
            "ПравилоОкругления": "НеОкруглять",
            "ДополнительныеРеквизиты": [],
            "ВидыАнализов": []
        },
        {
            "Ссылка": "9f1999ff-3b71-11eb-bf7a-00155d019805",
            "Наименование": "Пакет ",
            "Код": "00-00000005",
            "ЭтоГруппа": false,
            "ВидНоменклатуры": {
                "Тип": "СправочникСсылка.ВидыНоменклатуры",
                "Значение": "71860f27-3b71-11eb-bf7a-00155d019805"
            },
            "НаименованиеПолное": "Пакет ",
            "ЕдиницаИзмерения": {
                "Тип": "СправочникСсылка.УпаковкиЕдиницыИзмерения",
                "Значение": {
                    "КодПоОКЕИ": "796"
                }
            },
            "Кратность": "0.01",
            "ТипНоменклатуры": "Упаковка",
            "ИспользованиеХарактеристик": "НеИспользовать",
            "ИспользованиеДопЕдиницИзмерения": "НеИспользовать",
            "СырьеваяСтатьяЗатрат": {
                "Тип": "СправочникСсылка.к2СырьевыеСтатьиЗатрат",
                "Значение": "Упаковка"
            },
            "ПравилоОкругления": "НеОкруглять",
            "ДополнительныеРеквизиты": [],
            "ВидыАнализов": []
        },
        {
            "Ссылка": "9f199a00-3b71-11eb-bf7a-00155d019805",
            "Наименование": "Смесь 50%",
            "Код": "00-00000006",
            "ЭтоГруппа": false,
            "ВидНоменклатуры": {
                "Тип": "СправочникСсылка.ВидыНоменклатуры",
                "Значение": "71860f21-3b71-11eb-bf7a-00155d019805"
            },
            "НаименованиеПолное": "Смесь 50%",
            "ЕдиницаИзмерения": {
                "Тип": "СправочникСсылка.УпаковкиЕдиницыИзмерения",
                "Значение": {
                    "КодПоОКЕИ": "166"
                }
            },
            "Кратность": "0.01",
            "ТипНоменклатуры": "Сырье",
            "ИспользованиеХарактеристик": "НеИспользовать",
            "ИспользованиеДопЕдиницИзмерения": "НеИспользовать",
            "СырьеваяСтатьяЗатрат": {
                "Тип": "СправочникСсылка.к2СырьевыеСтатьиЗатрат",
                "Значение": "ПолуфабрикатыПроизводимыеВПроцессе"
            },
            "ПравилоОкругления": "НеОкруглять",
            "ДополнительныеРеквизиты": [],
            "ВидыАнализов": []
        },
        {
            "Ссылка": "9f199a01-3b71-11eb-bf7a-00155d019805",
            "Наименование": "Молоко",
            "Код": "00-00000007",
            "ЭтоГруппа": false,
            "ВидНоменклатуры": {
                "Тип": "СправочникСсылка.ВидыНоменклатуры",
                "Значение": "71860f23-3b71-11eb-bf7a-00155d019805"
            },
            "НаименованиеПолное": "Молоко",
            "ЕдиницаИзмерения": {
                "Тип": "СправочникСсылка.УпаковкиЕдиницыИзмерения",
                "Значение": {
                    "КодПоОКЕИ": "166"
                }
            },
            "Кратность": "0.01",
            "ТипНоменклатуры": "Сырье",
            "ИспользованиеХарактеристик": "НеИспользовать",
            "ИспользованиеДопЕдиницИзмерения": "НеИспользовать",
            "СырьеваяСтатьяЗатрат": {
                "Тип": "СправочникСсылка.к2СырьевыеСтатьиЗатрат",
                "Значение": "Сырье"
            },
            "ПравилоОкругления": "НеОкруглять",
            "ДополнительныеРеквизиты": [],
            "ВидыАнализов": []
        },
        {
            "Ссылка": "9f199a02-3b71-11eb-bf7a-00155d019805",
            "Наименование": "Сырная крошка",
            "Код": "00-00000008",
            "ЭтоГруппа": false,
            "ВидНоменклатуры": {
                "Тип": "СправочникСсылка.ВидыНоменклатуры",
                "Значение": "71860f2d-3b71-11eb-bf7a-00155d019805"
            },
            "НаименованиеПолное": "Сырная крошка",
            "ЕдиницаИзмерения": {
                "Тип": "СправочникСсылка.УпаковкиЕдиницыИзмерения",
                "Значение": {
                    "КодПоОКЕИ": "166"
                }
            },
            "ЕдиницаИзмерения1": {
                "Тип": "СправочникСсылка.УпаковкиЕдиницыИзмерения",
                "Значение": {
                    "КодПоОКЕИ": "796"
                }
            },
            "Кратность": "0.01",
            "ТипНоменклатуры": "Сырье",
            "ИспользованиеХарактеристик": "НеИспользовать",
            "ИспользованиеДопЕдиницИзмерения": "Одна",
            "СырьеваяСтатьяЗатрат": {
                "Тип": "СправочникСсылка.к2СырьевыеСтатьиЗатрат",
                "Значение": "ПолуфабрикатыПроизводимыеВПроцессе"
            },
            "ПравилоОкругления": "НеОкруглять",
            "ДополнительныеРеквизиты": [],
            "ВидыАнализов": []
        },
        {
            "Ссылка": "9f199a03-3b71-11eb-bf7a-00155d019805",
            "Наименование": "Сливки",
            "Код": "00-00000009",
            "ЭтоГруппа": false,
            "ВидНоменклатуры": {
                "Тип": "СправочникСсылка.ВидыНоменклатуры",
                "Значение": "71860f2d-3b71-11eb-bf7a-00155d019805"
            },
            "НаименованиеПолное": "Сливки",
            "ЕдиницаИзмерения": {
                "Тип": "СправочникСсылка.УпаковкиЕдиницыИзмерения",
                "Значение": {
                    "КодПоОКЕИ": "166"
                }
            },
            "Кратность": "0.01",
            "ТипНоменклатуры": "Сырье",
            "ИспользованиеХарактеристик": "НеИспользовать",
            "ИспользованиеДопЕдиницИзмерения": "НеИспользовать",
            "СырьеваяСтатьяЗатрат": {
                "Тип": "СправочникСсылка.к2СырьевыеСтатьиЗатрат",
                "Значение": "ПолуфабрикатыПроизводимыеВПроцессе"
            },
            "ПравилоОкругления": "НеОкруглять",
            "ДополнительныеРеквизиты": [],
            "ВидыАнализов": []
        },
        {
            "Ссылка": "9f199a04-3b71-11eb-bf7a-00155d019805",
            "Наименование": "Смесь 45%",
            "Код": "00-00000010",
            "ЭтоГруппа": false,
            "ВидНоменклатуры": {
                "Тип": "СправочникСсылка.ВидыНоменклатуры",
                "Значение": "71860f21-3b71-11eb-bf7a-00155d019805"
            },
            "НаименованиеПолное": "Смесь 45%",
            "ЕдиницаИзмерения": {
                "Тип": "СправочникСсылка.УпаковкиЕдиницыИзмерения",
                "Значение": {
                    "КодПоОКЕИ": "166"
                }
            },
            "Кратность": "0.01",
            "ТипНоменклатуры": "Сырье",
            "ИспользованиеХарактеристик": "НеИспользовать",
            "ИспользованиеДопЕдиницИзмерения": "НеИспользовать",
            "СырьеваяСтатьяЗатрат": {
                "Тип": "СправочникСсылка.к2СырьевыеСтатьиЗатрат",
                "Значение": "ПолуфабрикатыПроизводимыеВПроцессе"
            },
            "ПравилоОкругления": "НеОкруглять",
            "ДополнительныеРеквизиты": [],
            "ВидыАнализов": []
        },
        {
            "Ссылка": "9f199a05-3b71-11eb-bf7a-00155d019805",
            "Наименование": "Короб",
            "Код": "00-00000011",
            "ЭтоГруппа": false,
            "ВидНоменклатуры": {
                "Тип": "СправочникСсылка.ВидыНоменклатуры",
                "Значение": "71860f2b-3b71-11eb-bf7a-00155d019805"
            },
            "НаименованиеПолное": "Короб",
            "ЕдиницаИзмерения": {
                "Тип": "СправочникСсылка.УпаковкиЕдиницыИзмерения",
                "Значение": {
                    "КодПоОКЕИ": "796"
                }
            },
            "Кратность": "0.01",
            "ТипНоменклатуры": "Упаковка",
            "ИспользованиеХарактеристик": "НеИспользовать",
            "ИспользованиеДопЕдиницИзмерения": "НеИспользовать",
            "СырьеваяСтатьяЗатрат": {
                "Тип": "СправочникСсылка.к2СырьевыеСтатьиЗатрат",
                "Значение": "Упаковка"
            },
            "ПравилоОкругления": "НеОкруглять",
            "ДополнительныеРеквизиты": [],
            "ВидыАнализов": []
        },
        {
            "Ссылка": "9f199a06-3b71-11eb-bf7a-00155d019805",
            "Наименование": "Сливочный 45%",
            "Код": "00-00000012",
            "ЭтоГруппа": false,
            "ВидНоменклатуры": {
                "Тип": "СправочникСсылка.ВидыНоменклатуры",
                "Значение": "71860f1a-3b71-11eb-bf7a-00155d019805"
            },
            "НаименованиеПолное": "Сливочный 45%",
            "ЕдиницаИзмерения": {
                "Тип": "СправочникСсылка.УпаковкиЕдиницыИзмерения",
                "Значение": {
                    "КодПоОКЕИ": "166"
                }
            },
            "ЕдиницаИзмерения1": {
                "Тип": "СправочникСсылка.УпаковкиЕдиницыИзмерения",
                "Значение": {
                    "КодПоОКЕИ": "796"
                }
            },
            "Кратность": "0.01",
            "ТипНоменклатуры": "Сырье",
            "НаборУпаковок": {
                "Тип": "СправочникСсылка.к2НаборыУпаковок",
                "Значение": "ИндивидуальныйДляНоменклатуры"
            },
            "ИспользоватьУпаковки": "true",
            "ИспользованиеХарактеристик": "ОбщиеДляВидаНоменклатуры",
            "ИспользованиеДопЕдиницИзмерения": "Одна",
            "СырьеваяСтатьяЗатрат": {
                "Тип": "СправочникСсылка.к2СырьевыеСтатьиЗатрат",
                "Значение": "ПолуфабрикатыПроизводимыеВПроцессе"
            },
            "СтавкаНДС": "НДС0",
            "ПравилоОкругления": "НеОкруглять",
            "ДополнительныеРеквизиты": [],
            "ВидыАнализов": []
        },
        {
            "Ссылка": "9f199a0c-3b71-11eb-bf7a-00155d019805",
            "Наименование": "Сыворотка",
            "Код": "00-00000016",
            "ЭтоГруппа": false,
            "ВидНоменклатуры": {
                "Тип": "СправочникСсылка.ВидыНоменклатуры",
                "Значение": "71860f2d-3b71-11eb-bf7a-00155d019805"
            },
            "НаименованиеПолное": "Сыворотка",
            "ЕдиницаИзмерения": {
                "Тип": "СправочникСсылка.УпаковкиЕдиницыИзмерения",
                "Значение": {
                    "КодПоОКЕИ": "166"
                }
            },
            "Кратность": "0.01",
            "ТипНоменклатуры": "Сырье",
            "ИспользованиеХарактеристик": "НеИспользовать",
            "ИспользованиеДопЕдиницИзмерения": "НеИспользовать",
            "СырьеваяСтатьяЗатрат": {
                "Тип": "СправочникСсылка.к2СырьевыеСтатьиЗатрат",
                "Значение": "ПолуфабрикатыПроизводимыеВПроцессе"
            },
            "ПравилоОкругления": "НеОкруглять",
            "ДополнительныеРеквизиты": [],
            "ВидыАнализов": []
        },
        {
            "Ссылка": "9f199a0d-3b71-11eb-bf7a-00155d019805",
            "Наименование": "Пакет 2",
            "Код": "00-00000017",
            "ЭтоГруппа": false,
            "ВидНоменклатуры": {
                "Тип": "СправочникСсылка.ВидыНоменклатуры",
                "Значение": "71860f27-3b71-11eb-bf7a-00155d019805"
            },
            "НаименованиеПолное": "Пакет 2",
            "ЕдиницаИзмерения": {
                "Тип": "СправочникСсылка.УпаковкиЕдиницыИзмерения",
                "Значение": {
                    "КодПоОКЕИ": "796"
                }
            },
            "Кратность": "0.01",
            "ТипНоменклатуры": "Упаковка",
            "ИспользованиеХарактеристик": "НеИспользовать",
            "ИспользованиеДопЕдиницИзмерения": "НеИспользовать",
            "СырьеваяСтатьяЗатрат": {
                "Тип": "СправочникСсылка.к2СырьевыеСтатьиЗатрат",
                "Значение": "Упаковка"
            },
            "ПравилоОкругления": "НеОкруглять",
            "ДополнительныеРеквизиты": [],
            "ВидыАнализов": []
        },
        {
            "Ссылка": "9f199a0e-3b71-11eb-bf7a-00155d019805",
            "Наименование": "Короб 150х200",
            "Код": "00-00000018",
            "ЭтоГруппа": false,
            "ВидНоменклатуры": {
                "Тип": "СправочникСсылка.ВидыНоменклатуры",
                "Значение": "71860f27-3b71-11eb-bf7a-00155d019805"
            },
            "НаименованиеПолное": "Короб 150х200",
            "ЕдиницаИзмерения": {
                "Тип": "СправочникСсылка.УпаковкиЕдиницыИзмерения",
                "Значение": {
                    "КодПоОКЕИ": "796"
                }
            },
            "Кратность": "0.01",
            "ТипНоменклатуры": "Упаковка",
            "ИспользованиеХарактеристик": "НеИспользовать",
            "ИспользованиеДопЕдиницИзмерения": "НеИспользовать",
            "СырьеваяСтатьяЗатрат": {
                "Тип": "СправочникСсылка.к2СырьевыеСтатьиЗатрат",
                "Значение": "Упаковка"
            },
            "ПравилоОкругления": "НеОкруглять",
            "ДополнительныеРеквизиты": [],
            "ВидыАнализов": []
        },
        {
            "Ссылка": "9f199a0f-3b71-11eb-bf7a-00155d019805",
            "Наименование": "Ароматизатор 13456",
            "Код": "00-00000019",
            "ЭтоГруппа": false,
            "ВидНоменклатуры": {
                "Тип": "СправочникСсылка.ВидыНоменклатуры",
                "Значение": "71860f34-3b71-11eb-bf7a-00155d019805"
            },
            "НаименованиеПолное": "Ароматизатор 13456",
            "ЕдиницаИзмерения": {
                "Тип": "СправочникСсылка.УпаковкиЕдиницыИзмерения",
                "Значение": {
                    "КодПоОКЕИ": "796"
                }
            },
            "Кратность": "0.01",
            "ТипНоменклатуры": "Сырье",
            "ИспользованиеХарактеристик": "НеИспользовать",
            "ИспользованиеДопЕдиницИзмерения": "НеИспользовать",
            "СырьеваяСтатьяЗатрат": {
                "Тип": "СправочникСсылка.к2СырьевыеСтатьиЗатрат",
                "Значение": "Закваска"
            },
            "ПравилоОкругления": "НеОкруглять",
            "ДополнительныеРеквизиты": [],
            "ВидыАнализов": []
        },
        {
            "Ссылка": "9f199a10-3b71-11eb-bf7a-00155d019805",
            "Наименование": "Ароматизатор Масло 16256 (масло)",
            "Код": "00-00000020",
            "ЭтоГруппа": false,
            "ВидНоменклатуры": {
                "Тип": "СправочникСсылка.ВидыНоменклатуры",
                "Значение": "71860f34-3b71-11eb-bf7a-00155d019805"
            },
            "НаименованиеПолное": "Ароматизатор Масло 16256 (масло)",
            "ЕдиницаИзмерения": {
                "Тип": "СправочникСсылка.УпаковкиЕдиницыИзмерения",
                "Значение": {
                    "КодПоОКЕИ": "778"
                }
            },
            "Кратность": "0.01",
            "ТипНоменклатуры": "Сырье",
            "ИспользованиеХарактеристик": "НеИспользовать",
            "ИспользованиеДопЕдиницИзмерения": "НеИспользовать",
            "СырьеваяСтатьяЗатрат": {
                "Тип": "СправочникСсылка.к2СырьевыеСтатьиЗатрат",
                "Значение": "Закваска"
            },
            "ПравилоОкругления": "НеОкруглять",
            "ДополнительныеРеквизиты": [],
            "ВидыАнализов": []
        },
        {
            "Ссылка": "9f199a11-3b71-11eb-bf7a-00155d019805",
            "Наименование": "Ароматизатор Топленое молоко 675995 сыр",
            "Код": "00-00000021",
            "ЭтоГруппа": false,
            "ВидНоменклатуры": {
                "Тип": "СправочникСсылка.ВидыНоменклатуры",
                "Значение": "71860f34-3b71-11eb-bf7a-00155d019805"
            },
            "НаименованиеПолное": "Ароматизатор Топленое молоко 675995 сыр",
            "ЕдиницаИзмерения": {
                "Тип": "СправочникСсылка.УпаковкиЕдиницыИзмерения",
                "Значение": {
                    "КодПоОКЕИ": "778"
                }
            },
            "Кратность": "0.01",
            "ТипНоменклатуры": "Сырье",
            "ИспользованиеХарактеристик": "НеИспользовать",
            "ИспользованиеДопЕдиницИзмерения": "НеИспользовать",
            "СырьеваяСтатьяЗатрат": {
                "Тип": "СправочникСсылка.к2СырьевыеСтатьиЗатрат",
                "Значение": "Закваска"
            },
            "ПравилоОкругления": "НеОкруглять",
            "ДополнительныеРеквизиты": [],
            "ВидыАнализов": []
        },
        {
            "Ссылка": "9f199a12-3b71-11eb-bf7a-00155d019805",
            "Наименование": "Закваска Ceska L 100",
            "Код": "00-00000022",
            "ЭтоГруппа": false,
            "ВидНоменклатуры": {
                "Тип": "СправочникСсылка.ВидыНоменклатуры",
                "Значение": "71860f34-3b71-11eb-bf7a-00155d019805"
            },
            "НаименованиеПолное": "Закваска Ceska L 100",
            "ЕдиницаИзмерения": {
                "Тип": "СправочникСсылка.УпаковкиЕдиницыИзмерения",
                "Значение": {
                    "КодПоОКЕИ": "166"
                }
            },
            "Кратность": "0.01",
            "ТипНоменклатуры": "Сырье",
            "ИспользованиеХарактеристик": "НеИспользовать",
            "ИспользованиеДопЕдиницИзмерения": "НеИспользовать",
            "СырьеваяСтатьяЗатрат": {
                "Тип": "СправочникСсылка.к2СырьевыеСтатьиЗатрат",
                "Значение": "Закваска"
            },
            "ПравилоОкругления": "НеОкруглять",
            "ДополнительныеРеквизиты": [],
            "ВидыАнализов": []
        },
        {
            "Ссылка": "0babad51-3b72-11eb-bf7a-00155d019805",
            "Наименование": "Краситель Бета-каротин FS 30%",
            "Код": "00-00000023",
            "ЭтоГруппа": false,
            "ВидНоменклатуры": {
                "Тип": "СправочникСсылка.ВидыНоменклатуры",
                "Значение": "71860f34-3b71-11eb-bf7a-00155d019805"
            },
            "НаименованиеПолное": "Краситель Бета-каротин FS 30%",
            "ЕдиницаИзмерения": {
                "Тип": "СправочникСсылка.УпаковкиЕдиницыИзмерения",
                "Значение": {
                    "КодПоОКЕИ": "796"
                }
            },
            "Кратность": "0.01",
            "ТипНоменклатуры": "Сырье",
            "ИспользованиеХарактеристик": "НеИспользовать",
            "ИспользованиеДопЕдиницИзмерения": "НеИспользовать",
            "СырьеваяСтатьяЗатрат": {
                "Тип": "СправочникСсылка.к2СырьевыеСтатьиЗатрат",
                "Значение": "Закваска"
            },
            "ПравилоОкругления": "НеОкруглять",
            "ДополнительныеРеквизиты": [],
            "ВидыАнализов": []
        },
        {
            "Ссылка": "0babad52-3b72-11eb-bf7a-00155d019805",
            "Наименование": "Пошехонский 45%",
            "Код": "00-00000024",
            "ЭтоГруппа": false,
            "ВидНоменклатуры": {
                "Тип": "СправочникСсылка.ВидыНоменклатуры",
                "Значение": "71860f1a-3b71-11eb-bf7a-00155d019805"
            },
            "НаименованиеПолное": "Пошехонский 45%",
            "ЕдиницаИзмерения": {
                "Тип": "СправочникСсылка.УпаковкиЕдиницыИзмерения",
                "Значение": {
                    "КодПоОКЕИ": "166"
                }
            },
            "ЕдиницаИзмерения1": {
                "Тип": "СправочникСсылка.УпаковкиЕдиницыИзмерения",
                "Значение": {
                    "КодПоОКЕИ": "796"
                }
            },
            "Кратность": "0.01",
            "ТипНоменклатуры": "Сырье",
            "НаборУпаковок": {
                "Тип": "СправочникСсылка.к2НаборыУпаковок",
                "Значение": "ИндивидуальныйДляНоменклатуры"
            },
            "ИспользоватьУпаковки": "true",
            "ИспользованиеХарактеристик": "ОбщиеДляВидаНоменклатуры",
            "ИспользованиеДопЕдиницИзмерения": "Одна",
            "СырьеваяСтатьяЗатрат": {
                "Тип": "СправочникСсылка.к2СырьевыеСтатьиЗатрат",
                "Значение": "ПолуфабрикатыПроизводимыеВПроцессе"
            },
            "СтавкаНДС": "НДС0",
            "ПравилоОкругления": "НеОкруглять",
            "ДополнительныеРеквизиты": [],
            "ВидыАнализов": []
        },
        {
            "Ссылка": "0babad53-3b72-11eb-bf7a-00155d019805",
            "Наименование": "Мраморный 50%",
            "Код": "00-00000025",
            "ЭтоГруппа": false,
            "ВидНоменклатуры": {
                "Тип": "СправочникСсылка.ВидыНоменклатуры",
                "Значение": "71860f1a-3b71-11eb-bf7a-00155d019805"
            },
            "НаименованиеПолное": "Мраморный 50%",
            "ЕдиницаИзмерения": {
                "Тип": "СправочникСсылка.УпаковкиЕдиницыИзмерения",
                "Значение": {
                    "КодПоОКЕИ": "166"
                }
            },
            "ЕдиницаИзмерения1": {
                "Тип": "СправочникСсылка.УпаковкиЕдиницыИзмерения",
                "Значение": {
                    "КодПоОКЕИ": "796"
                }
            },
            "Кратность": "0.01",
            "ТипНоменклатуры": "Сырье",
            "НаборУпаковок": {
                "Тип": "СправочникСсылка.к2НаборыУпаковок",
                "Значение": "ИндивидуальныйДляНоменклатуры"
            },
            "ИспользоватьУпаковки": "true",
            "ИспользованиеХарактеристик": "ОбщиеДляВидаНоменклатуры",
            "ИспользованиеДопЕдиницИзмерения": "Одна",
            "СырьеваяСтатьяЗатрат": {
                "Тип": "СправочникСсылка.к2СырьевыеСтатьиЗатрат",
                "Значение": "ПолуфабрикатыПроизводимыеВПроцессе"
            },
            "СтавкаНДС": "НДС0",
            "ПравилоОкругления": "НеОкруглять",
            "ДополнительныеРеквизиты": [],
            "ВидыАнализов": []
        },
        {
            "Ссылка": "0babad54-3b72-11eb-bf7a-00155d019805",
            "Наименование": "Обрат",
            "Код": "00-00000026",
            "ЭтоГруппа": false,
            "ВидНоменклатуры": {
                "Тип": "СправочникСсылка.ВидыНоменклатуры",
                "Значение": "71860f2d-3b71-11eb-bf7a-00155d019805"
            },
            "НаименованиеПолное": "Обрат",
            "ЕдиницаИзмерения": {
                "Тип": "СправочникСсылка.УпаковкиЕдиницыИзмерения",
                "Значение": {
                    "КодПоОКЕИ": "166"
                }
            },
            "Кратность": "0.01",
            "ТипНоменклатуры": "Сырье",
            "ИспользованиеХарактеристик": "НеИспользовать",
            "ИспользованиеДопЕдиницИзмерения": "НеИспользовать",
            "СырьеваяСтатьяЗатрат": {
                "Тип": "СправочникСсылка.к2СырьевыеСтатьиЗатрат",
                "Значение": "ПолуфабрикатыПроизводимыеВПроцессе"
            },
            "ПравилоОкругления": "НеОкруглять",
            "ДополнительныеРеквизиты": [],
            "ВидыАнализов": []
        },
        {
            "Ссылка": "0babad55-3b72-11eb-bf7a-00155d019805",
            "Наименование": "БАКТЕРИАЛЬНЫЙ КОНЦЕНТРАТ БК-УГЛИЧ-№4 производственная",
            "Код": "00-00000027",
            "ЭтоГруппа": false,
            "ВидНоменклатуры": {
                "Тип": "СправочникСсылка.ВидыНоменклатуры",
                "Значение": "71860f38-3b71-11eb-bf7a-00155d019805"
            },
            "НаименованиеПолное": "БАКТЕРИАЛЬНЫЙ КОНЦЕНТРАТ БК-УГЛИЧ-№4 производственная",
            "ЕдиницаИзмерения": {
                "Тип": "СправочникСсылка.УпаковкиЕдиницыИзмерения",
                "Значение": {
                    "КодПоОКЕИ": "166"
                }
            },
            "Кратность": "0.01",
            "ТипНоменклатуры": "Сырье",
            "ИспользованиеХарактеристик": "НеИспользовать",
            "ИспользованиеДопЕдиницИзмерения": "НеИспользовать",
            "СырьеваяСтатьяЗатрат": {
                "Тип": "СправочникСсылка.к2СырьевыеСтатьиЗатрат",
                "Значение": "Закваска"
            },
            "ПравилоОкругления": "НеОкруглять",
            "ДополнительныеРеквизиты": [],
            "ВидыАнализов": []
        },
        {
            "Ссылка": "0babad56-3b72-11eb-bf7a-00155d019805",
            "Наименование": "БК-УГЛИЧ-№4",
            "Код": "00-00000028",
            "ЭтоГруппа": false,
            "ВидНоменклатуры": {
                "Тип": "СправочникСсылка.ВидыНоменклатуры",
                "Значение": "71860f38-3b71-11eb-bf7a-00155d019805"
            },
            "НаименованиеПолное": "БК-УГЛИЧ-№4",
            "ЕдиницаИзмерения": {
                "Тип": "СправочникСсылка.УпаковкиЕдиницыИзмерения",
                "Значение": {
                    "КодПоОКЕИ": "796"
                }
            },
            "Кратность": "0.01",
            "ТипНоменклатуры": "Сырье",
            "ИспользованиеХарактеристик": "НеИспользовать",
            "ИспользованиеДопЕдиницИзмерения": "НеИспользовать",
            "СырьеваяСтатьяЗатрат": {
                "Тип": "СправочникСсылка.к2СырьевыеСтатьиЗатрат",
                "Значение": "Закваска"
            },
            "ПравилоОкругления": "НеОкруглять",
            "ДополнительныеРеквизиты": [],
            "ВидыАнализов": []
        },
        {
            "Ссылка": "9f199a57-3b71-11eb-bf7a-00155d019805",
            "Наименование": "Обрат сырье",
            "Код": "00-00000003",
            "ЭтоГруппа": false,
            "ВидНоменклатуры": {
                "Тип": "СправочникСсылка.ВидыНоменклатуры",
                "Значение": "71860f23-3b71-11eb-bf7a-00155d019805"
            },
            "НаименованиеПолное": "Обрат сырье",
            "ЕдиницаИзмерения": {
                "Тип": "СправочникСсылка.УпаковкиЕдиницыИзмерения",
                "Значение": {
                    "КодПоОКЕИ": "166"
                }
            },
            "Кратность": "0.01",
            "ТипНоменклатуры": "Сырье",
            "ИспользованиеХарактеристик": "НеИспользовать",
            "ИспользованиеДопЕдиницИзмерения": "НеИспользовать",
            "СырьеваяСтатьяЗатрат": {
                "Тип": "СправочникСсылка.к2СырьевыеСтатьиЗатрат",
                "Значение": "Сырье"
            },
            "ПравилоОкругления": "НеОкруглять",
            "ДополнительныеРеквизиты": [],
            "ВидыАнализов": []
        }
    ],
    "Характеристики": [
        {
            "Ссылка": "71860f1b-3b71-11eb-bf7a-00155d019805",
            "Наименование": "Варка",
            "Владелец": {
                "Тип": "СправочникСсылка.ВидыНоменклатуры",
                "Значение": "71860f1a-3b71-11eb-bf7a-00155d019805"
            },
            "НаименованиеПолное": "Варка"
        },
        {
            "Ссылка": "71860f1c-3b71-11eb-bf7a-00155d019805",
            "Наименование": "На созревании",
            "Владелец": {
                "Тип": "СправочникСсылка.ВидыНоменклатуры",
                "Значение": "71860f1a-3b71-11eb-bf7a-00155d019805"
            },
            "НаименованиеПолное": "На созревании"
        },
        {
            "Ссылка": "71860f1d-3b71-11eb-bf7a-00155d019805",
            "Наименование": "Созревший",
            "Владелец": {
                "Тип": "СправочникСсылка.ВидыНоменклатуры",
                "Значение": "71860f1a-3b71-11eb-bf7a-00155d019805"
            },
            "НаименованиеПолное": "Созревший"
        },
        {
            "Ссылка": "71860f1e-3b71-11eb-bf7a-00155d019805",
            "Наименование": "Недопресс",
            "Владелец": {
                "Тип": "СправочникСсылка.ВидыНоменклатуры",
                "Значение": "71860f1a-3b71-11eb-bf7a-00155d019805"
            },
            "НаименованиеПолное": "Недопресс"
        },
        {
            "Ссылка": "71860f1f-3b71-11eb-bf7a-00155d019805",
            "Наименование": "Брак",
            "Владелец": {
                "Тип": "СправочникСсылка.ВидыНоменклатуры",
                "Значение": "71860f1a-3b71-11eb-bf7a-00155d019805"
            },
            "НаименованиеПолное": "Брак"
        }
    ],
    "Склады": [
        {
            "Ссылка": "71860f3a-3b71-11eb-bf7a-00155d019805",
            "Наименование": "Сырцех",
            "ЭтоГруппа": false,
            "НастройкаКонтроляОстатков": "НеКонтролировать",
            "ЕмкостьСклада": [],
            "ВидыПоказателей": [],
            "КонтактнаяИнформация": [],
            "УточненияПоДоставке": [],
            "ДниДоставки": [
                {
                    "ДеньНедели": "Понедельник"
                },
                {
                    "ДеньНедели": "Вторник"
                },
                {
                    "ДеньНедели": "Среда"
                },
                {
                    "ДеньНедели": "Четверг"
                },
                {
                    "ДеньНедели": "Пятница"
                },
                {
                    "ДеньНедели": "Суббота"
                },
                {
                    "ДеньНедели": "Воскресенье"
                }
            ],
            "ПорядокПравилРазмещенияНоменклатуры": [],
            "УточненияПоПриемке": []
        },
        {
            "Ссылка": "9f1999d3-3b71-11eb-bf7a-00155d019805",
            "Наименование": "Нарезка",
            "ЭтоГруппа": false,
            "НастройкаКонтроляОстатков": "НеКонтролировать",
            "ОтключитьУчетПоДопЕдиницамИзмерения": "true",
            "ЕмкостьСклада": [],
            "ВидыПоказателей": [],
            "КонтактнаяИнформация": [],
            "УточненияПоДоставке": [],
            "ДниДоставки": [
                {
                    "ДеньНедели": "Понедельник"
                },
                {
                    "ДеньНедели": "Вторник"
                },
                {
                    "ДеньНедели": "Среда"
                },
                {
                    "ДеньНедели": "Четверг"
                },
                {
                    "ДеньНедели": "Пятница"
                },
                {
                    "ДеньНедели": "Суббота"
                },
                {
                    "ДеньНедели": "Воскресенье"
                }
            ],
            "ПорядокПравилРазмещенияНоменклатуры": [],
            "УточненияПоПриемке": []
        },
        {
            "Ссылка": "9f1999d4-3b71-11eb-bf7a-00155d019805",
            "Наименование": "ПАЦ",
            "ЭтоГруппа": false,
            "НастройкаКонтроляОстатков": "НеКонтролировать",
            "ЕмкостьСклада": [],
            "ВидыПоказателей": [],
            "КонтактнаяИнформация": [],
            "УточненияПоДоставке": [],
            "ДниДоставки": [
                {
                    "ДеньНедели": "Понедельник"
                },
                {
                    "ДеньНедели": "Вторник"
                },
                {
                    "ДеньНедели": "Среда"
                },
                {
                    "ДеньНедели": "Четверг"
                },
                {
                    "ДеньНедели": "Пятница"
                },
                {
                    "ДеньНедели": "Суббота"
                },
                {
                    "ДеньНедели": "Воскресенье"
                }
            ],
            "ПорядокПравилРазмещенияНоменклатуры": [],
            "УточненияПоПриемке": []
        },
        {
            "Ссылка": "9f1999d5-3b71-11eb-bf7a-00155d019805",
            "Наименование": "Танк №2",
            "ЭтоГруппа": false,
            "НастройкаКонтроляОстатков": "НеКонтролировать",
            "ЕмкостьСклада": [],
            "ВидыПоказателей": [],
            "КонтактнаяИнформация": [],
            "УточненияПоДоставке": [],
            "ДниДоставки": [
                {
                    "ДеньНедели": "Понедельник"
                },
                {
                    "ДеньНедели": "Вторник"
                },
                {
                    "ДеньНедели": "Среда"
                },
                {
                    "ДеньНедели": "Четверг"
                },
                {
                    "ДеньНедели": "Пятница"
                },
                {
                    "ДеньНедели": "Суббота"
                },
                {
                    "ДеньНедели": "Воскресенье"
                }
            ],
            "ПорядокПравилРазмещенияНоменклатуры": [],
            "УточненияПоПриемке": []
        },
        {
            "Ссылка": "9f1999d6-3b71-11eb-bf7a-00155d019805",
            "Наименование": "Танк №1",
            "ЭтоГруппа": false,
            "НастройкаКонтроляОстатков": "НеКонтролировать",
            "ВидыПоказателей": [],
            "КонтактнаяИнформация": [],
            "УточненияПоДоставке": [],
            "ДниДоставки": [
                {
                    "ДеньНедели": "Понедельник"
                },
                {
                    "ДеньНедели": "Вторник"
                },
                {
                    "ДеньНедели": "Среда"
                },
                {
                    "ДеньНедели": "Четверг"
                },
                {
                    "ДеньНедели": "Пятница"
                },
                {
                    "ДеньНедели": "Суббота"
                },
                {
                    "ДеньНедели": "Воскресенье"
                }
            ],
            "ПорядокПравилРазмещенияНоменклатуры": [],
            "УточненияПоПриемке": []
        },
        {
            "Ссылка": "9f1999d7-3b71-11eb-bf7a-00155d019805",
            "Наименование": "Склад с ячейками и контролем",
            "ЭтоГруппа": false,
            "ИспользоватьАдресноеХранение": "true",
            "ДатаНачалаАдресногоХраненияОстатков": "2018-11-01T00:00:00",
            "НастройкаКонтроляОстатков": "Контролировать",
            "ВместимостьВМестах": "3",
            "ЕмкостьСклада": [],
            "ВидыПоказателей": [],
            "КонтактнаяИнформация": [],
            "УточненияПоДоставке": [],
            "ДниДоставки": [
                {
                    "ДеньНедели": "Понедельник"
                },
                {
                    "ДеньНедели": "Вторник"
                },
                {
                    "ДеньНедели": "Среда"
                },
                {
                    "ДеньНедели": "Четверг"
                },
                {
                    "ДеньНедели": "Пятница"
                },
                {
                    "ДеньНедели": "Суббота"
                },
                {
                    "ДеньНедели": "Воскресенье"
                }
            ],
            "ПорядокПравилРазмещенияНоменклатуры": [],
            "УточненияПоПриемке": []
        },
        {
            "Ссылка": "9f1999dd-3b71-11eb-bf7a-00155d019805",
            "Наименование": "Склад ГП",
            "ЭтоГруппа": false,
            "НастройкаКонтроляОстатков": "НеКонтролировать",
            "ЕмкостьСклада": [],
            "ВидыПоказателей": [],
            "КонтактнаяИнформация": [],
            "УточненияПоДоставке": [],
            "ДниДоставки": [
                {
                    "ДеньНедели": "Понедельник"
                },
                {
                    "ДеньНедели": "Вторник"
                },
                {
                    "ДеньНедели": "Среда"
                },
                {
                    "ДеньНедели": "Четверг"
                },
                {
                    "ДеньНедели": "Пятница"
                },
                {
                    "ДеньНедели": "Суббота"
                },
                {
                    "ДеньНедели": "Воскресенье"
                }
            ],
            "ПорядокПравилРазмещенияНоменклатуры": [],
            "УточненияПоПриемке": []
        },
        {
            "Ссылка": "9f1999de-3b71-11eb-bf7a-00155d019805",
            "Наименование": "Бассейн соления",
            "ЭтоГруппа": false,
            "НастройкаКонтроляОстатков": "НеКонтролировать",
            "ЕмкостьСклада": [],
            "ВидыПоказателей": [],
            "КонтактнаяИнформация": [],
            "УточненияПоДоставке": [],
            "ДниДоставки": [
                {
                    "ДеньНедели": "Понедельник"
                },
                {
                    "ДеньНедели": "Вторник"
                },
                {
                    "ДеньНедели": "Среда"
                },
                {
                    "ДеньНедели": "Четверг"
                },
                {
                    "ДеньНедели": "Пятница"
                },
                {
                    "ДеньНедели": "Суббота"
                },
                {
                    "ДеньНедели": "Воскресенье"
                }
            ],
            "ПорядокПравилРазмещенияНоменклатуры": [],
            "УточненияПоПриемке": []
        },
        {
            "Ссылка": "9f1999df-3b71-11eb-bf7a-00155d019805",
            "Наименование": "Центральный склад",
            "ЭтоГруппа": false,
            "НастройкаКонтроляОстатков": "НеКонтролировать",
            "ЕмкостьСклада": [],
            "ВидыПоказателей": [],
            "КонтактнаяИнформация": [],
            "УточненияПоДоставке": [],
            "ДниДоставки": [
                {
                    "ДеньНедели": "Понедельник"
                },
                {
                    "ДеньНедели": "Вторник"
                },
                {
                    "ДеньНедели": "Среда"
                },
                {
                    "ДеньНедели": "Четверг"
                },
                {
                    "ДеньНедели": "Пятница"
                },
                {
                    "ДеньНедели": "Суббота"
                },
                {
                    "ДеньНедели": "Воскресенье"
                }
            ],
            "ПорядокПравилРазмещенияНоменклатуры": [],
            "УточненияПоПриемке": []
        },
        {
            "Ссылка": "9f1999e0-3b71-11eb-bf7a-00155d019805",
            "Наименование": "Сушка",
            "ЭтоГруппа": false,
            "НастройкаКонтроляОстатков": "НеКонтролировать",
            "ЕмкостьСклада": [],
            "ВидыПоказателей": [],
            "КонтактнаяИнформация": [],
            "УточненияПоДоставке": [],
            "ДниДоставки": [
                {
                    "ДеньНедели": "Понедельник"
                },
                {
                    "ДеньНедели": "Вторник"
                },
                {
                    "ДеньНедели": "Среда"
                },
                {
                    "ДеньНедели": "Четверг"
                },
                {
                    "ДеньНедели": "Пятница"
                },
                {
                    "ДеньНедели": "Суббота"
                },
                {
                    "ДеньНедели": "Воскресенье"
                }
            ],
            "ПорядокПравилРазмещенияНоменклатуры": [],
            "УточненияПоПриемке": []
        },
        {
            "Ссылка": "9f1999e1-3b71-11eb-bf7a-00155d019805",
            "Наименование": "Маслоцех",
            "ЭтоГруппа": false,
            "НастройкаКонтроляОстатков": "НеКонтролировать",
            "ЕмкостьСклада": [],
            "ВидыПоказателей": [],
            "КонтактнаяИнформация": [],
            "УточненияПоДоставке": [],
            "ДниДоставки": [
                {
                    "ДеньНедели": "Понедельник"
                },
                {
                    "ДеньНедели": "Вторник"
                },
                {
                    "ДеньНедели": "Среда"
                },
                {
                    "ДеньНедели": "Четверг"
                },
                {
                    "ДеньНедели": "Пятница"
                },
                {
                    "ДеньНедели": "Суббота"
                },
                {
                    "ДеньНедели": "Воскресенье"
                }
            ],
            "ПорядокПравилРазмещенияНоменклатуры": [],
            "УточненияПоПриемке": []
        },
        {
            "Ссылка": "9f1999e2-3b71-11eb-bf7a-00155d019805",
            "Наименование": "СОМ",
            "ЭтоГруппа": false,
            "НастройкаКонтроляОстатков": "НеКонтролировать",
            "ЕмкостьСклада": [],
            "ВидыПоказателей": [],
            "КонтактнаяИнформация": [],
            "УточненияПоДоставке": [],
            "ДниДоставки": [
                {
                    "ДеньНедели": "Понедельник"
                },
                {
                    "ДеньНедели": "Вторник"
                },
                {
                    "ДеньНедели": "Среда"
                },
                {
                    "ДеньНедели": "Четверг"
                },
                {
                    "ДеньНедели": "Пятница"
                },
                {
                    "ДеньНедели": "Суббота"
                },
                {
                    "ДеньНедели": "Воскресенье"
                }
            ],
            "ПорядокПравилРазмещенияНоменклатуры": [],
            "УточненияПоПриемке": []
        },
        {
            "Ссылка": "9f1999e3-3b71-11eb-bf7a-00155d019805",
            "Наименование": "Сыроизготовитель №1",
            "ЭтоГруппа": false,
            "НастройкаКонтроляОстатков": "НеКонтролировать",
            "ЕмкостьСклада": [],
            "ВидыПоказателей": [],
            "КонтактнаяИнформация": [],
            "УточненияПоДоставке": [],
            "ДниДоставки": [
                {
                    "ДеньНедели": "Понедельник"
                },
                {
                    "ДеньНедели": "Вторник"
                },
                {
                    "ДеньНедели": "Среда"
                },
                {
                    "ДеньНедели": "Четверг"
                },
                {
                    "ДеньНедели": "Пятница"
                },
                {
                    "ДеньНедели": "Суббота"
                },
                {
                    "ДеньНедели": "Воскресенье"
                }
            ],
            "ПорядокПравилРазмещенияНоменклатуры": [],
            "УточненияПоПриемке": []
        },
        {
            "Ссылка": "9f1999e4-3b71-11eb-bf7a-00155d019805",
            "Наименование": "Сыроизготовитель №2",
            "ЭтоГруппа": false,
            "НастройкаКонтроляОстатков": "НеКонтролировать",
            "ЕмкостьСклада": [],
            "ВидыПоказателей": [],
            "КонтактнаяИнформация": [],
            "УточненияПоДоставке": [],
            "ДниДоставки": [
                {
                    "ДеньНедели": "Понедельник"
                },
                {
                    "ДеньНедели": "Вторник"
                },
                {
                    "ДеньНедели": "Среда"
                },
                {
                    "ДеньНедели": "Четверг"
                },
                {
                    "ДеньНедели": "Пятница"
                },
                {
                    "ДеньНедели": "Суббота"
                },
                {
                    "ДеньНедели": "Воскресенье"
                }
            ],
            "ПорядокПравилРазмещенияНоменклатуры": [],
            "УточненияПоПриемке": []
        },
        {
            "Ссылка": "31d0e04a-3b72-11eb-bf7a-00155d019805",
            "Наименование": "Бассейн соления 2",
            "ЭтоГруппа": false,
            "НастройкаКонтроляОстатков": "НеКонтролировать",
            "ВестиУчетПоТаре": "true",
            "ЕмкостьСклада": [],
            "ВидыПоказателей": [],
            "КонтактнаяИнформация": [],
            "УточненияПоДоставке": [],
            "ДниДоставки": [
                {
                    "ДеньНедели": "Понедельник"
                },
                {
                    "ДеньНедели": "Вторник"
                },
                {
                    "ДеньНедели": "Среда"
                },
                {
                    "ДеньНедели": "Четверг"
                },
                {
                    "ДеньНедели": "Пятница"
                },
                {
                    "ДеньНедели": "Суббота"
                },
                {
                    "ДеньНедели": "Воскресенье"
                }
            ],
            "ПорядокПравилРазмещенияНоменклатуры": [],
            "УточненияПоПриемке": []
        },
        {
            "Ссылка": "31d0e04b-3b72-11eb-bf7a-00155d019805",
            "Наименование": "Камера созревания 1",
            "ЭтоГруппа": false,
            "НастройкаКонтроляОстатков": "НеКонтролировать",
            "ВестиУчетПоТаре": "true",
            "ЕмкостьСклада": [],
            "ВидыПоказателей": [],
            "КонтактнаяИнформация": [],
            "УточненияПоДоставке": [],
            "ДниДоставки": [
                {
                    "ДеньНедели": "Понедельник"
                },
                {
                    "ДеньНедели": "Вторник"
                },
                {
                    "ДеньНедели": "Среда"
                },
                {
                    "ДеньНедели": "Четверг"
                },
                {
                    "ДеньНедели": "Пятница"
                },
                {
                    "ДеньНедели": "Суббота"
                },
                {
                    "ДеньНедели": "Воскресенье"
                }
            ],
            "ПорядокПравилРазмещенияНоменклатуры": [],
            "УточненияПоПриемке": []
        },
        {
            "Ссылка": "31d0e04d-3b72-11eb-bf7a-00155d019805",
            "Наименование": "Упаковка",
            "ЭтоГруппа": false,
            "НастройкаКонтроляОстатков": "НеКонтролировать",
            "ВестиУчетПоТаре": "true",
            "ЕмкостьСклада": [],
            "ВидыПоказателей": [],
            "КонтактнаяИнформация": [],
            "УточненияПоДоставке": [],
            "ДниДоставки": [
                {
                    "ДеньНедели": "Понедельник"
                },
                {
                    "ДеньНедели": "Вторник"
                },
                {
                    "ДеньНедели": "Среда"
                },
                {
                    "ДеньНедели": "Четверг"
                },
                {
                    "ДеньНедели": "Пятница"
                },
                {
                    "ДеньНедели": "Суббота"
                },
                {
                    "ДеньНедели": "Воскресенье"
                }
            ],
            "ПорядокПравилРазмещенияНоменклатуры": [],
            "УточненияПоПриемке": []
        }
    ],
    "ВидыРабочихЦентров": [
        {
            "Ссылка": "31d0e050-3b72-11eb-bf7a-00155d019805",
            "Наименование": "Сырцех",
            "ЭтоГруппа": false
        },
        {
            "Ссылка": "31d0e051-3b72-11eb-bf7a-00155d019805",
            "Наименование": "ПАЦ",
            "ЭтоГруппа": false
        },
        {
            "Ссылка": "31d0e052-3b72-11eb-bf7a-00155d019805",
            "Наименование": "Упаковка",
            "ЭтоГруппа": false
        },
        {
            "Ссылка": "31d0e053-3b72-11eb-bf7a-00155d019805",
            "Наименование": "Маркировка",
            "ЭтоГруппа": false
        }
    ],
    "РабочиеЦентры": [
        {
            "Ссылка": "31d0e056-3b72-11eb-bf7a-00155d019805",
            "Наименование": "Сырцех",
            "ЭтоГруппа": false,
            "ВидРабочегоЦентра": {
                "Тип": "СправочникСсылка.к2ВидыРабочихЦентров",
                "Значение": "31d0e050-3b72-11eb-bf7a-00155d019805"
            },
            "СкладВспомогательныхМатериалов": {
                "Тип": "СправочникСсылка.Склады",
                "Значение": "71860f3a-3b71-11eb-bf7a-00155d019805"
            },
            "КонтролироватьБаланс": "true",
            "Доступность": "23",
            "ВремяПереналадки": "1",
            "ТребуетсяОбеспечение": "true",
            "СкладыПредставление": "Сырцех",
            "РеквизитДопУпорядочивания": "1",
            "ВариантНумерацииСерий": "ПоНомеруСтрокиЗадания",
            "Склады": [
                {
                    "Склад": {
                        "Тип": "СправочникСсылка.Склады",
                        "Значение": "71860f3a-3b71-11eb-bf7a-00155d019805"
                    }
                }
            ]
        },
        {
            "Ссылка": "31d0e057-3b72-11eb-bf7a-00155d019805",
            "Наименование": "ПАЦ",
            "ЭтоГруппа": false,
            "ВидРабочегоЦентра": {
                "Тип": "СправочникСсылка.к2ВидыРабочихЦентров",
                "Значение": "31d0e051-3b72-11eb-bf7a-00155d019805"
            },
            "СкладВспомогательныхМатериалов": {
                "Тип": "СправочникСсылка.Склады",
                "Значение": "9f1999de-3b71-11eb-bf7a-00155d019805"
            },
            "КонтролироватьБаланс": "true",
            "Доступность": "21",
            "НесколькоСкладов": "true",
            "СкладыПредставление": "Танк №2, Танк №1, ПАЦ",
            "РеквизитДопУпорядочивания": "2",
            "ВариантНумерацииСерий": "ПоНомеруСтрокиЗадания",
            "Склады": [
                {
                    "Склад": {
                        "Тип": "СправочникСсылка.Склады",
                        "Значение": "9f1999d5-3b71-11eb-bf7a-00155d019805"
                    }
                },
                {
                    "Склад": {
                        "Тип": "СправочникСсылка.Склады",
                        "Значение": "9f1999d6-3b71-11eb-bf7a-00155d019805"
                    }
                },
                {
                    "Склад": {
                        "Тип": "СправочникСсылка.Склады",
                        "Значение": "9f1999d4-3b71-11eb-bf7a-00155d019805"
                    }
                }
            ]
        },
        {
            "Ссылка": "31d0e058-3b72-11eb-bf7a-00155d019805",
            "Наименование": "Упаковка",
            "ЭтоГруппа": false,
            "ВидРабочегоЦентра": {
                "Тип": "СправочникСсылка.к2ВидыРабочихЦентров",
                "Значение": "31d0e052-3b72-11eb-bf7a-00155d019805"
            },
            "СкладВспомогательныхМатериалов": {
                "Тип": "СправочникСсылка.Склады",
                "Значение": "31d0e04d-3b72-11eb-bf7a-00155d019805"
            },
            "НесколькоСкладов": "true",
            "СкладыПредставление": "Бассейн соления, Бассейн соления 2",
            "РеквизитДопУпорядочивания": "3",
            "ВариантНумерацииСерий": "ПоНомеруСтрокиЗадания",
            "Склады": [
                {
                    "Склад": {
                        "Тип": "СправочникСсылка.Склады",
                        "Значение": "9f1999de-3b71-11eb-bf7a-00155d019805"
                    }
                },
                {
                    "Склад": {
                        "Тип": "СправочникСсылка.Склады",
                        "Значение": "31d0e04a-3b72-11eb-bf7a-00155d019805"
                    }
                }
            ]
        }
    ]
}