{
"Валюты": [
{
"Ссылка": "1792edb9-297f-11eb-9068-04d4c4acd0dd",
"Наименование": "RUB",
"Код": "643",
"НаименованиеПолное": "Российский рубль",
"ПараметрыПрописи": "рубль, рубля, рублей, м, копейка, копейки, копеек, ж, 2 знака",
"СпособУстановкиКурса": "РучнойВвод"
}
],
"Организации": [
{
"Ссылка": "1792edbf-297f-11eb-9068-04d4c4acd0dd",
"Наименование": "Организация",
"Код": "000000001",
"ИНН": "9999115007",
"КПП": "999911500",
"ОГРН": "1234567890123",
"ПрефиксGS1": "789      ",
"НаименованиеПолное": "Общество с ограниченной ответственностью \"Организация\"",
"НаименованиеСокращенное": "ООО \"Организация\"",
"НаименованиеМеждународное": "Organizatcia LLC",
"КодОКВЭД": "999",
"КодПоОКПО": "12345678",
"ЮрФизЛицо": "ЮрЛицо",
"КонтактнаяИнформация": [
{
"Тип": "Адрес",
"Вид": {
"Тип": "СправочникСсылка.ВидыКонтактнойИнформации",
"Значение": "АдресОрганизации"
},
"Представление": "117342, Москва г, Севастопольский пр-кт, дом № 56",
"ЗначенияПолей": "<КонтактнаяИнформация xmlns=\"http://www.v8.1c.ru/ssl/contactinfo\" xmlns:xs=\"http://www.w3.org/2001/XMLSchema\" xmlns:xsi=\"http://www.w3.org/2001/XMLSchema-instance\" Представление=\"117342, Москва г, Севастопольский пр-кт, дом № 56\"><Состав xsi:type=\"Адрес\" Страна=\"РОССИЯ\"><Состав xsi:type=\"АдресРФ\"><ДопАдрЭл ТипАдрЭл=\"10100000\" Значение=\"117342\"/></Состав></Состав></КонтактнаяИнформация>",
"Страна": "РОССИЯ",
"ВидДляСписка": {
"Тип": "СправочникСсылка.ВидыКонтактнойИнформации",
"Значение": "АдресОрганизации"
},
"Значение": "{\r\n\"value\": \"117342, Москва г, Севастопольский пр-кт, дом № 56\",\r\n\"comment\": \"\",\r\n\"type\": \"Адрес\",\r\n\"country\": \"РОССИЯ\",\r\n\"addressType\": \"ВСвободнойФорме\",\r\n\"countryCode\": \"643\",\r\n\"ZIPcode\": \"117342\",\r\n\"area\": \"\",\r\n\"areaType\": \"\",\r\n\"city\": \"\",\r\n\"cityType\": \"\",\r\n\"street\": \"\",\r\n\"streetType\": \"\",\r\n\"id\": \"\",\r\n\"areaCode\": \"\",\r\n\"areaId\": \"\",\r\n\"district\": \"\",\r\n\"districtType\": \"\",\r\n\"districtId\": \"\",\r\n\"munDistrict\": \"\",\r\n\"munDistrictType\": \"\",\r\n\"munDistrictId\": \"\",\r\n\"cityId\": \"\",\r\n\"settlement\": \"\",\r\n\"settlementType\": \"\",\r\n\"settlementId\": \"\",\r\n\"cityDistrict\": \"\",\r\n\"cityDistrictType\": \"\",\r\n\"cityDistrictId\": \"\",\r\n\"territory\": \"\",\r\n\"territoryType\": \"\",\r\n\"territoryId\": \"\",\r\n\"locality\": \"\",\r\n\"localityType\": \"\",\r\n\"localityId\": \"\",\r\n\"streetId\": \"\",\r\n\"houseType\": \"\",\r\n\"houseNumber\": \"\",\r\n\"houseId\": \"\",\r\n\"buildings\": [],\r\n\"apartments\": [],\r\n\"codeKLADR\": \"\",\r\n\"oktmo\": \"\",\r\n\"okato\": \"\",\r\n\"asInDocument\": \"\",\r\n\"ifnsFLCode\": \"\",\r\n\"ifnsULCode\": \"\",\r\n\"ifnsFLAreaCode\": \"\",\r\n\"ifnsULAreaCode\": \"\",\r\n\"stead\": \"\",\r\n\"steadId\": \"\"\r\n}"
},
{
"Тип": "Телефон",
"Вид": {
"Тип": "СправочникСсылка.ВидыКонтактнойИнформации",
"Значение": "ТелефонОрганизации"
},
"Представление": "+79101234567",
"ЗначенияПолей": "<КонтактнаяИнформация xmlns=\"http://www.v8.1c.ru/ssl/contactinfo\" xmlns:xs=\"http://www.w3.org/2001/XMLSchema\" xmlns:xsi=\"http://www.w3.org/2001/XMLSchema-instance\" Представление=\"+79101234567\"><Состав xsi:type=\"НомерТелефона\" КодСтраны=\"79101234567\" КодГорода=\"\" Номер=\"\" Добавочный=\"\"/></КонтактнаяИнформация>",
"НомерТелефона": "79101234567",
"ВидДляСписка": {
"Тип": "СправочникСсылка.ВидыКонтактнойИнформации",
"Значение": "ТелефонОрганизации"
},
"Значение": "{\r\n\"value\": \"+79101234567\",\r\n\"comment\": \"\",\r\n\"type\": \"Телефон\",\r\n\"countryCode\": \"79101234567\",\r\n\"areaCode\": \"\",\r\n\"number\": \"\",\r\n\"extNumber\": \"\"\r\n}"
},
{
"Тип": "Адрес",
"Вид": {
"Тип": "СправочникСсылка.ВидыКонтактнойИнформации",
"Значение": "ЮрАдресОрганизации"
},
"Представление": "117342, Москва г, Севастопольский пр-кт, дом № 56",
"ЗначенияПолей": "<КонтактнаяИнформация xmlns=\"http://www.v8.1c.ru/ssl/contactinfo\" xmlns:xs=\"http://www.w3.org/2001/XMLSchema\" xmlns:xsi=\"http://www.w3.org/2001/XMLSchema-instance\" Представление=\"117342, Москва г, Севастопольский пр-кт, дом № 56\"><Состав xsi:type=\"Адрес\" Страна=\"РОССИЯ\"><Состав xsi:type=\"АдресРФ\"><ДопАдрЭл ТипАдрЭл=\"10100000\" Значение=\"117342\"/></Состав></Состав></КонтактнаяИнформация>",
"Страна": "РОССИЯ",
"ВидДляСписка": {
"Тип": "СправочникСсылка.ВидыКонтактнойИнформации",
"Значение": "ЮрАдресОрганизации"
},
"Значение": "{\r\n\"value\": \"117342, Москва г, Севастопольский пр-кт, дом № 56\",\r\n\"comment\": \"\",\r\n\"type\": \"Адрес\",\r\n\"country\": \"РОССИЯ\",\r\n\"addressType\": \"ВСвободнойФорме\",\r\n\"countryCode\": \"643\",\r\n\"ZIPcode\": \"117342\",\r\n\"area\": \"\",\r\n\"areaType\": \"\",\r\n\"city\": \"\",\r\n\"cityType\": \"\",\r\n\"street\": \"\",\r\n\"streetType\": \"\",\r\n\"id\": \"\",\r\n\"areaCode\": \"\",\r\n\"areaId\": \"\",\r\n\"district\": \"\",\r\n\"districtType\": \"\",\r\n\"districtId\": \"\",\r\n\"munDistrict\": \"\",\r\n\"munDistrictType\": \"\",\r\n\"munDistrictId\": \"\",\r\n\"cityId\": \"\",\r\n\"settlement\": \"\",\r\n\"settlementType\": \"\",\r\n\"settlementId\": \"\",\r\n\"cityDistrict\": \"\",\r\n\"cityDistrictType\": \"\",\r\n\"cityDistrictId\": \"\",\r\n\"territory\": \"\",\r\n\"territoryType\": \"\",\r\n\"territoryId\": \"\",\r\n\"locality\": \"\",\r\n\"localityType\": \"\",\r\n\"localityId\": \"\",\r\n\"streetId\": \"\",\r\n\"houseType\": \"\",\r\n\"houseNumber\": \"\",\r\n\"houseId\": \"\",\r\n\"buildings\": [],\r\n\"apartments\": [],\r\n\"codeKLADR\": \"\",\r\n\"oktmo\": \"\",\r\n\"okato\": \"\",\r\n\"asInDocument\": \"\",\r\n\"ifnsFLCode\": \"\",\r\n\"ifnsULCode\": \"\",\r\n\"ifnsFLAreaCode\": \"\",\r\n\"ifnsULAreaCode\": \"\",\r\n\"stead\": \"\",\r\n\"steadId\": \"\"\r\n}"
}
]
},
{
"Ссылка": "4240da4d-2a24-11eb-9068-04d4c4acd0dd",
"Наименование": "Организация2",
"Код": "000000002",
"ИНН": "9999115008",
"КПП": "999911501",
"ОГРН": "1234567890124",
"ПрефиксGS1": "790  ",
"НаименованиеПолное": "Общество с ограниченной ответственностью \"Организация2\"",
"НаименованиеСокращенное": "ООО \"Организация2\"",
"НаименованиеМеждународное": "Organizatcia2 LLC",
"КодОКВЭД": "991",
"КодПоОКПО": "12345679",
"ЮрФизЛицо": "ЮрЛицо",
"КонтактнаяИнформация": [
{
"Тип": "Адрес",
"Вид": {
"Тип": "СправочникСсылка.ВидыКонтактнойИнформации",
"Значение": "АдресОрганизации"
},
"Представление": "117343, Москва г, пер. Маяковского, дом № 87",
"ЗначенияПолей": "<КонтактнаяИнформация xmlns=\"http://www.v8.1c.ru/ssl/contactinfo\" xmlns:xs=\"http://www.w3.org/2001/XMLSchema\" xmlns:xsi=\"http://www.w3.org/2001/XMLSchema-instance\" Представление=\"117343, Москва г, пер. Маяковского, дом № 87\"><Состав xsi:type=\"Адрес\" Страна=\"РОССИЯ\"><Состав xsi:type=\"АдресРФ\"><ДопАдрЭл ТипАдрЭл=\"10100000\" Значение=\"117343\"/></Состав></Состав></КонтактнаяИнформация>",
"Страна": "РОССИЯ",
"ВидДляСписка": {
"Тип": "СправочникСсылка.ВидыКонтактнойИнформации",
"Значение": "АдресОрганизации"
},
"Значение": "{\r\n\"value\": \"117343, Москва г, пер. Маяковского, дом № 87\",\r\n\"comment\": \"\",\r\n\"type\": \"Адрес\",\r\n\"country\": \"РОССИЯ\",\r\n\"addressType\": \"ВСвободнойФорме\",\r\n\"countryCode\": \"643\",\r\n\"ZIPcode\": \"117343\",\r\n\"area\": \"\",\r\n\"areaType\": \"\",\r\n\"city\": \"\",\r\n\"cityType\": \"\",\r\n\"street\": \"\",\r\n\"streetType\": \"\",\r\n\"id\": \"\",\r\n\"areaCode\": \"\",\r\n\"areaId\": \"\",\r\n\"district\": \"\",\r\n\"districtType\": \"\",\r\n\"districtId\": \"\",\r\n\"munDistrict\": \"\",\r\n\"munDistrictType\": \"\",\r\n\"munDistrictId\": \"\",\r\n\"cityId\": \"\",\r\n\"settlement\": \"\",\r\n\"settlementType\": \"\",\r\n\"settlementId\": \"\",\r\n\"cityDistrict\": \"\",\r\n\"cityDistrictType\": \"\",\r\n\"cityDistrictId\": \"\",\r\n\"territory\": \"\",\r\n\"territoryType\": \"\",\r\n\"territoryId\": \"\",\r\n\"locality\": \"\",\r\n\"localityType\": \"\",\r\n\"localityId\": \"\",\r\n\"streetId\": \"\",\r\n\"houseType\": \"\",\r\n\"houseNumber\": \"\",\r\n\"houseId\": \"\",\r\n\"buildings\": [],\r\n\"apartments\": [],\r\n\"codeKLADR\": \"\",\r\n\"oktmo\": \"\",\r\n\"okato\": \"\",\r\n\"asInDocument\": \"\",\r\n\"ifnsFLCode\": \"\",\r\n\"ifnsULCode\": \"\",\r\n\"ifnsFLAreaCode\": \"\",\r\n\"ifnsULAreaCode\": \"\",\r\n\"stead\": \"\",\r\n\"steadId\": \"\"\r\n}"
},
{
"Тип": "Телефон",
"Вид": {
"Тип": "СправочникСсылка.ВидыКонтактнойИнформации",
"Значение": "ТелефонОрганизации"
},
"Представление": "+79101233312",
"ЗначенияПолей": "<КонтактнаяИнформация xmlns=\"http://www.v8.1c.ru/ssl/contactinfo\" xmlns:xs=\"http://www.w3.org/2001/XMLSchema\" xmlns:xsi=\"http://www.w3.org/2001/XMLSchema-instance\" Представление=\"+79101233312\"><Состав xsi:type=\"НомерТелефона\" КодСтраны=\"79101233312\" КодГорода=\"\" Номер=\"\" Добавочный=\"\"/></КонтактнаяИнформация>",
"НомерТелефона": "79101233312",
"ВидДляСписка": {
"Тип": "СправочникСсылка.ВидыКонтактнойИнформации",
"Значение": "ТелефонОрганизации"
},
"Значение": "{\r\n\"value\": \"+79101233312\",\r\n\"comment\": \"\",\r\n\"type\": \"Телефон\",\r\n\"countryCode\": \"79101233312\",\r\n\"areaCode\": \"\",\r\n\"number\": \"\",\r\n\"extNumber\": \"\"\r\n}"
},
{
"Тип": "Адрес",
"Вид": {
"Тип": "СправочникСсылка.ВидыКонтактнойИнформации",
"Значение": "ЮрАдресОрганизации"
},
"Представление": "117343, Москва г, пер. Маяковского, дом № 87",
"ЗначенияПолей": "<КонтактнаяИнформация xmlns=\"http://www.v8.1c.ru/ssl/contactinfo\" xmlns:xs=\"http://www.w3.org/2001/XMLSchema\" xmlns:xsi=\"http://www.w3.org/2001/XMLSchema-instance\" Представление=\"117343, Москва г, пер. Маяковского, дом № 87\"><Состав xsi:type=\"Адрес\" Страна=\"РОССИЯ\"><Состав xsi:type=\"АдресРФ\"><ДопАдрЭл ТипАдрЭл=\"10100000\" Значение=\"117343\"/></Состав></Состав></КонтактнаяИнформация>",
"Страна": "РОССИЯ",
"ВидДляСписка": {
"Тип": "СправочникСсылка.ВидыКонтактнойИнформации",
"Значение": "ЮрАдресОрганизации"
},
"Значение": "{\r\n\"value\": \"117343, Москва г, пер. Маяковского, дом № 87\",\r\n\"comment\": \"\",\r\n\"type\": \"Адрес\",\r\n\"country\": \"РОССИЯ\",\r\n\"addressType\": \"ВСвободнойФорме\",\r\n\"countryCode\": \"643\",\r\n\"ZIPcode\": \"117343\",\r\n\"area\": \"\",\r\n\"areaType\": \"\",\r\n\"city\": \"\",\r\n\"cityType\": \"\",\r\n\"street\": \"\",\r\n\"streetType\": \"\",\r\n\"id\": \"\",\r\n\"areaCode\": \"\",\r\n\"areaId\": \"\",\r\n\"district\": \"\",\r\n\"districtType\": \"\",\r\n\"districtId\": \"\",\r\n\"munDistrict\": \"\",\r\n\"munDistrictType\": \"\",\r\n\"munDistrictId\": \"\",\r\n\"cityId\": \"\",\r\n\"settlement\": \"\",\r\n\"settlementType\": \"\",\r\n\"settlementId\": \"\",\r\n\"cityDistrict\": \"\",\r\n\"cityDistrictType\": \"\",\r\n\"cityDistrictId\": \"\",\r\n\"territory\": \"\",\r\n\"territoryType\": \"\",\r\n\"territoryId\": \"\",\r\n\"locality\": \"\",\r\n\"localityType\": \"\",\r\n\"localityId\": \"\",\r\n\"streetId\": \"\",\r\n\"houseType\": \"\",\r\n\"houseNumber\": \"\",\r\n\"houseId\": \"\",\r\n\"buildings\": [],\r\n\"apartments\": [],\r\n\"codeKLADR\": \"\",\r\n\"oktmo\": \"\",\r\n\"okato\": \"\",\r\n\"asInDocument\": \"\",\r\n\"ifnsFLCode\": \"\",\r\n\"ifnsULCode\": \"\",\r\n\"ifnsFLAreaCode\": \"\",\r\n\"ifnsULAreaCode\": \"\",\r\n\"stead\": \"\",\r\n\"steadId\": \"\"\r\n}"
}
]
}
],
"ВидыНоменклатуры": [
{
"Ссылка": "026bdb84-297f-11eb-9068-04d4c4acd0dd",
"Наименование": "Мягкие сыры",
"ЭтоГруппа": false,
"ЕдиницаИзмерения": {
"Тип": "СправочникСсылка.УпаковкиЕдиницыИзмерения",
"Значение": {
"КодПоОКЕИ": "166"
}
},
"НаборУпаковок": {
"Тип": "СправочникСсылка.к2НаборыУпаковок",
"Значение": "026bdb7c-297f-11eb-9068-04d4c4acd0dd"
},
"ИспользованиеХарактеристик": "ОбщиеДляВидаНоменклатуры",
"ИспользоватьУпаковки": "true",
"ИспользоватьХарактеристики": "true",
"ИспользоватьСерии": "true",
"ТипВоспроизводства": "Производство",
"СырьеваяСтатьяЗатрат": {
"Тип": "СправочникСсылка.к2СырьевыеСтатьиЗатрат",
"Значение": "Сырье"
},
"Тип": "Прочее",
"ВариантНумерацииСерий": "ПоНоменклатуреВПределахДня",
"ВестиУчетСертификатовНоменклатуры": "true",
"ВидыАнализов": []
},
{
"Ссылка": "026bdb8a-297f-11eb-9068-04d4c4acd0dd",
"Наименование": "Твердые сыры",
"ЭтоГруппа": false,
"ЕдиницаИзмерения": {
"Тип": "СправочникСсылка.УпаковкиЕдиницыИзмерения",
"Значение": {
"КодПоОКЕИ": "166"
}
},
"НаборУпаковок": {
"Тип": "СправочникСсылка.к2НаборыУпаковок",
"Значение": "026bdb7c-297f-11eb-9068-04d4c4acd0dd"
},
"ИспользованиеХарактеристик": "ОбщиеДляВидаНоменклатуры",
"ИспользоватьУпаковки": "true",
"ИспользоватьХарактеристики": "true",
"ИспользоватьСерии": "true",
"ТипВоспроизводства": "Производство",
"СырьеваяСтатьяЗатрат": {
"Тип": "СправочникСсылка.к2СырьевыеСтатьиЗатрат",
"Значение": "Сырье"
},
"Тип": "Прочее",
"ВариантНумерацииСерий": "ПоНоменклатуреВПределахДня",
"ВестиУчетСертификатовНоменклатуры": "true",
"ВидыАнализов": []
},
{
"Ссылка": "026bdb90-297f-11eb-9068-04d4c4acd0dd",
"Наименование": "Полутвердые сыры",
"ЭтоГруппа": false,
"ЕдиницаИзмерения": {
"Тип": "СправочникСсылка.УпаковкиЕдиницыИзмерения",
"Значение": {
"КодПоОКЕИ": "166"
}
},
"НаборУпаковок": {
"Тип": "СправочникСсылка.к2НаборыУпаковок",
"Значение": "026bdb7c-297f-11eb-9068-04d4c4acd0dd"
},
"ИспользованиеХарактеристик": "ОбщиеДляВидаНоменклатуры",
"ИспользоватьУпаковки": "true",
"ИспользоватьХарактеристики": "true",
"ИспользоватьСерии": "true",
"ТипВоспроизводства": "Производство",
"СырьеваяСтатьяЗатрат": {
"Тип": "СправочникСсылка.к2СырьевыеСтатьиЗатрат",
"Значение": "Сырье"
},
"Тип": "Прочее",
"ВариантНумерацииСерий": "ПоНоменклатуреВПределахДня",
"ВестиУчетСертификатовНоменклатуры": "true",
"ВидыАнализов": []
},
{
"Ссылка": "026bdb96-297f-11eb-9068-04d4c4acd0dd",
"Наименование": "Мясо птицы",
"ЭтоГруппа": false,
"ЕдиницаИзмерения": {
"Тип": "СправочникСсылка.УпаковкиЕдиницыИзмерения",
"Значение": {
"КодПоОКЕИ": "166"
}
},
"ИспользованиеХарактеристик": "НеИспользовать",
"ТипВоспроизводства": "Производство",
"СырьеваяСтатьяЗатрат": {
"Тип": "СправочникСсылка.к2СырьевыеСтатьиЗатрат",
"Значение": "Сырье"
},
"Тип": "Прочее",
"ВариантНумерацииСерий": "ПоНоменклатуреВПределахДня",
"ВидыАнализов": []
}
],
"ТоварныеКатегории": [
{
"Ссылка": "026bdb77-297f-11eb-9068-04d4c4acd0dd",
"Наименование": "Мягкие сыры"
},
{
"Ссылка": "026bdb78-297f-11eb-9068-04d4c4acd0dd",
"Наименование": "Твердые сыры"
},
{
"Ссылка": "026bdb79-297f-11eb-9068-04d4c4acd0dd",
"Наименование": "Полутвердые сыры"
},
{
"Ссылка": "026bdb7b-297f-11eb-9068-04d4c4acd0dd",
"Наименование": "Мясо птицы"
}
],
"Номенклатура": [
{
"Ссылка": "026bdb98-297f-11eb-9068-04d4c4acd0dd",
"Наименование": "Сыры",
"Код": "00-00000001",
"ЭтоГруппа": true,
"ДополнительныеРеквизиты": [],
"ВидыАнализов": []
},
{
"Ссылка": "026bdb99-297f-11eb-9068-04d4c4acd0dd",
"Наименование": "Мясо птицы",
"Код": "00-00000002",
"ЭтоГруппа": true,
"ДополнительныеРеквизиты": [],
"ВидыАнализов": []
},
{
"Ссылка": "026bdb9a-297f-11eb-9068-04d4c4acd0dd",
"Наименование": "Сыр Адыгейский",
"Код": "00-00000003",
"Родитель": {
"Тип": "СправочникСсылка.Номенклатура",
"Значение": "026bdb98-297f-11eb-9068-04d4c4acd0dd"
},
"ЭтоГруппа": false,
"Артикул": "999-0123",
"ТоварнаяКатегория": {
"Тип": "СправочникСсылка.к2ТоварныеКатегории",
"Значение": "026bdb77-297f-11eb-9068-04d4c4acd0dd"
},
"ВидНоменклатуры": {
"Тип": "СправочникСсылка.ВидыНоменклатуры",
"Значение": "026bdb84-297f-11eb-9068-04d4c4acd0dd"
},
"НаименованиеПолное": "Сыр Адыгейский",
"ЕдиницаИзмерения": {
"Тип": "СправочникСсылка.УпаковкиЕдиницыИзмерения",
"Значение": {
"КодПоОКЕИ": "166"
}
},
"Кратность": "1",
"Производитель": {
"Тип": "СправочникСсылка.к2Производители",
"Значение": "026bdb97-297f-11eb-9068-04d4c4acd0dd"
},
"ТипНоменклатуры": "ГотоваяПродукция",
"Комментарий": "Сыр \"Адыгейский\", мягкий сыр",
"НаборУпаковок": {
"Тип": "СправочникСсылка.к2НаборыУпаковок",
"Значение": "026bdb7c-297f-11eb-9068-04d4c4acd0dd"
},
"ИспользоватьУпаковки": "true",
"ИспользованиеХарактеристик": "ОбщиеДляВидаНоменклатуры",
"ИспользованиеДопЕдиницИзмерения": "НеИспользовать",
"СырьеваяСтатьяЗатрат": {
"Тип": "СправочникСсылка.к2СырьевыеСтатьиЗатрат",
"Значение": "Сырье"
},
"ВесЕдиницаИзмерения": {
"Тип": "СправочникСсылка.УпаковкиЕдиницыИзмерения",
"Значение": {
"КодПоОКЕИ": "166"
}
},
"ВесИспользовать": "true",
"ВесЧислитель": "1",
"ВесЗнаменатель": "1",
"ОбъемЕдиницаИзмерения": {
"Тип": "СправочникСсылка.УпаковкиЕдиницыИзмерения",
"Значение": {
"КодПоОКЕИ": "113"
}
},
"ОбъемИспользовать": "true",
"ОбъемЧислитель": "1.123",
"ОбъемЗнаменатель": "1",
"СтавкаНДС": "НДС20",
"Описание": "Мягкий сыр \"Адыгейский\" ",
"ПравилоОкругления": "НеОкруглять",
"ВестиУчетСертификатовНоменклатуры": "true",
"ДополнительныеРеквизиты": [],
"ВидыАнализов": []
},
{
"Ссылка": "026bdb9e-297f-11eb-9068-04d4c4acd0dd",
"Наименование": "Сыр Костромской",
"Код": "00-00000004",
"Родитель": {
"Тип": "СправочникСсылка.Номенклатура",
"Значение": "026bdb98-297f-11eb-9068-04d4c4acd0dd"
},
"ЭтоГруппа": false,
"Артикул": "999-0234",
"ТоварнаяКатегория": {
"Тип": "СправочникСсылка.к2ТоварныеКатегории",
"Значение": "026bdb78-297f-11eb-9068-04d4c4acd0dd"
},
"ВидНоменклатуры": {
"Тип": "СправочникСсылка.ВидыНоменклатуры",
"Значение": "026bdb8a-297f-11eb-9068-04d4c4acd0dd"
},
"НаименованиеПолное": "Сыр Костромской",
"ЕдиницаИзмерения": {
"Тип": "СправочникСсылка.УпаковкиЕдиницыИзмерения",
"Значение": {
"КодПоОКЕИ": "166"
}
},
"Кратность": "1",
"Производитель": {
"Тип": "СправочникСсылка.к2Производители",
"Значение": "026bdb97-297f-11eb-9068-04d4c4acd0dd"
},
"ТипНоменклатуры": "ГотоваяПродукция",
"Комментарий": "Сыр \"Костромской\", твердый сыр",
"НаборУпаковок": {
"Тип": "СправочникСсылка.к2НаборыУпаковок",
"Значение": "026bdb7c-297f-11eb-9068-04d4c4acd0dd"
},
"ИспользоватьУпаковки": "true",
"ИспользованиеХарактеристик": "ОбщиеДляВидаНоменклатуры",
"ИспользованиеДопЕдиницИзмерения": "НеИспользовать",
"СырьеваяСтатьяЗатрат": {
"Тип": "СправочникСсылка.к2СырьевыеСтатьиЗатрат",
"Значение": "Сырье"
},
"ВесЕдиницаИзмерения": {
"Тип": "СправочникСсылка.УпаковкиЕдиницыИзмерения",
"Значение": {
"КодПоОКЕИ": "166"
}
},
"ВесИспользовать": "true",
"ВесЧислитель": "1",
"ВесЗнаменатель": "1",
"СтавкаНДС": "НДС18",
"Описание": "Твердый сыр \"Костромской\" ",
"ПравилоОкругления": "НеОкруглять",
"ВестиУчетСертификатовНоменклатуры": "true",
"ДополнительныеРеквизиты": [],
"ВидыАнализов": []
},
{
"Ссылка": "026bdba1-297f-11eb-9068-04d4c4acd0dd",
"Наименование": "Сыр Пошехонский",
"Код": "00-00000005",
"Родитель": {
"Тип": "СправочникСсылка.Номенклатура",
"Значение": "026bdb98-297f-11eb-9068-04d4c4acd0dd"
},
"ЭтоГруппа": false,
"Артикул": "999-0345",
"ТоварнаяКатегория": {
"Тип": "СправочникСсылка.к2ТоварныеКатегории",
"Значение": "026bdb79-297f-11eb-9068-04d4c4acd0dd"
},
"ВидНоменклатуры": {
"Тип": "СправочникСсылка.ВидыНоменклатуры",
"Значение": "026bdb90-297f-11eb-9068-04d4c4acd0dd"
},
"НаименованиеПолное": "Сыр Пошехонский",
"ЕдиницаИзмерения": {
"Тип": "СправочникСсылка.УпаковкиЕдиницыИзмерения",
"Значение": {
"КодПоОКЕИ": "166"
}
},
"Кратность": "1",
"Производитель": {
"Тип": "СправочникСсылка.к2Производители",
"Значение": "026bdb97-297f-11eb-9068-04d4c4acd0dd"
},
"ТипНоменклатуры": "ГотоваяПродукция",
"Комментарий": "Сыр \"Пошехонский\", полутвердый сыр",
"НаборУпаковок": {
"Тип": "СправочникСсылка.к2НаборыУпаковок",
"Значение": "026bdb7c-297f-11eb-9068-04d4c4acd0dd"
},
"ИспользоватьУпаковки": "true",
"ИспользованиеХарактеристик": "ОбщиеДляВидаНоменклатуры",
"ИспользованиеДопЕдиницИзмерения": "НеИспользовать",
"СырьеваяСтатьяЗатрат": {
"Тип": "СправочникСсылка.к2СырьевыеСтатьиЗатрат",
"Значение": "Сырье"
},
"ВесЕдиницаИзмерения": {
"Тип": "СправочникСсылка.УпаковкиЕдиницыИзмерения",
"Значение": {
"КодПоОКЕИ": "166"
}
},
"ВесИспользовать": "true",
"ВесЧислитель": "1",
"ВесЗнаменатель": "1",
"СтавкаНДС": "НДС10",
"Описание": "Полутвердый сыр \"Пошехонский\" ",
"ПравилоОкругления": "НеОкруглять",
"ВестиУчетСертификатовНоменклатуры": "true",
"ДополнительныеРеквизиты": [],
"ВидыАнализов": []
},
{
"Ссылка": "026bdba4-297f-11eb-9068-04d4c4acd0dd",
"Наименование": "Крылья куринные (подложка)",
"Код": "00-00000006",
"Родитель": {
"Тип": "СправочникСсылка.Номенклатура",
"Значение": "026bdb99-297f-11eb-9068-04d4c4acd0dd"
},
"ЭтоГруппа": false,
"Артикул": "999-0456",
"ТоварнаяКатегория": {
"Тип": "СправочникСсылка.к2ТоварныеКатегории",
"Значение": "026bdb7b-297f-11eb-9068-04d4c4acd0dd"
},
"ВидНоменклатуры": {
"Тип": "СправочникСсылка.ВидыНоменклатуры",
"Значение": "026bdb96-297f-11eb-9068-04d4c4acd0dd"
},
"НаименованиеПолное": "Крылья куринные (подложка)",
"ЕдиницаИзмерения": {
"Тип": "СправочникСсылка.УпаковкиЕдиницыИзмерения",
"Значение": {
"КодПоОКЕИ": "166"
}
},
"Кратность": "1",
"Производитель": {
"Тип": "СправочникСсылка.к2Производители",
"Значение": "026bdb97-297f-11eb-9068-04d4c4acd0dd"
},
"ТипНоменклатуры": "ГотоваяПродукция",
"Комментарий": "Мясо птицы: подложка куринных крыльев",
"ИспользованиеХарактеристик": "НеИспользовать",
"ИспользованиеДопЕдиницИзмерения": "НеИспользовать",
"СырьеваяСтатьяЗатрат": {
"Тип": "СправочникСсылка.к2СырьевыеСтатьиЗатрат",
"Значение": "Сырье"
},
"ВесЕдиницаИзмерения": {
"Тип": "СправочникСсылка.УпаковкиЕдиницыИзмерения",
"Значение": {
"КодПоОКЕИ": "166"
}
},
"ВесИспользовать": "true",
"ВесЧислитель": "1",
"ВесЗнаменатель": "1",
"СтавкаНДС": "НДС20",
"Описание": "Мясо птицы: подложка куринных крыльев ",
"ПравилоОкругления": "НеОкруглять",
"ДополнительныеРеквизиты": [],
"ВидыАнализов": []
}
],
"Характеристики": [
{
"Ссылка": "026bdb85-297f-11eb-9068-04d4c4acd0dd",
"Наименование": "Ашан",
"Владелец": {
"Тип": "СправочникСсылка.ВидыНоменклатуры",
"Значение": "026bdb84-297f-11eb-9068-04d4c4acd0dd"
},
"НаименованиеПолное": "Ашан",
"Контрагент": {
"Тип": "СправочникСсылка.Контрагенты",
"Значение": "31b9494b-297f-11eb-9068-04d4c4acd0dd"
}
},
{
"Ссылка": "026bdb86-297f-11eb-9068-04d4c4acd0dd",
"Наименование": "Перекресток",
"Владелец": {
"Тип": "СправочникСсылка.ВидыНоменклатуры",
"Значение": "026bdb84-297f-11eb-9068-04d4c4acd0dd"
},
"НаименованиеПолное": "Перекресток",
"Контрагент": {
"Тип": "СправочникСсылка.Контрагенты",
"Значение": "31b9494f-297f-11eb-9068-04d4c4acd0dd"
}
},
{
"Ссылка": "026bdb87-297f-11eb-9068-04d4c4acd0dd",
"Наименование": "5ка",
"Владелец": {
"Тип": "СправочникСсылка.ВидыНоменклатуры",
"Значение": "026bdb84-297f-11eb-9068-04d4c4acd0dd"
},
"НаименованиеПолное": "5ка",
"Контрагент": {
"Тип": "СправочникСсылка.Контрагенты",
"Значение": "31b9494d-297f-11eb-9068-04d4c4acd0dd"
}
},
{
"Ссылка": "026bdb88-297f-11eb-9068-04d4c4acd0dd",
"Наименование": "<Без маркировки>",
"Владелец": {
"Тип": "СправочникСсылка.ВидыНоменклатуры",
"Значение": "026bdb84-297f-11eb-9068-04d4c4acd0dd"
},
"НаименованиеПолное": "<Без маркировки>",
"НемаркированнаяПродукция": "true"
},
{
"Ссылка": "026bdb8b-297f-11eb-9068-04d4c4acd0dd",
"Наименование": "Ашан",
"Владелец": {
"Тип": "СправочникСсылка.ВидыНоменклатуры",
"Значение": "026bdb8a-297f-11eb-9068-04d4c4acd0dd"
},
"НаименованиеПолное": "Ашан",
"Контрагент": {
"Тип": "СправочникСсылка.Контрагенты",
"Значение": "31b9494b-297f-11eb-9068-04d4c4acd0dd"
}
},
{
"Ссылка": "026bdb8c-297f-11eb-9068-04d4c4acd0dd",
"Наименование": "Перекресток",
"Владелец": {
"Тип": "СправочникСсылка.ВидыНоменклатуры",
"Значение": "026bdb8a-297f-11eb-9068-04d4c4acd0dd"
},
"НаименованиеПолное": "Перекресток",
"Контрагент": {
"Тип": "СправочникСсылка.Контрагенты",
"Значение": "31b9494f-297f-11eb-9068-04d4c4acd0dd"
}
},
{
"Ссылка": "026bdb8d-297f-11eb-9068-04d4c4acd0dd",
"Наименование": "5ка",
"Владелец": {
"Тип": "СправочникСсылка.ВидыНоменклатуры",
"Значение": "026bdb8a-297f-11eb-9068-04d4c4acd0dd"
},
"НаименованиеПолное": "5ка",
"Контрагент": {
"Тип": "СправочникСсылка.Контрагенты",
"Значение": "31b9494d-297f-11eb-9068-04d4c4acd0dd"
}
},
{
"Ссылка": "026bdb8e-297f-11eb-9068-04d4c4acd0dd",
"Наименование": "<Без маркировки>",
"Владелец": {
"Тип": "СправочникСсылка.ВидыНоменклатуры",
"Значение": "026bdb8a-297f-11eb-9068-04d4c4acd0dd"
},
"НаименованиеПолное": "<Без маркировки>",
"НемаркированнаяПродукция": "true"
},
{
"Ссылка": "026bdb91-297f-11eb-9068-04d4c4acd0dd",
"Наименование": "Ашан",
"Владелец": {
"Тип": "СправочникСсылка.ВидыНоменклатуры",
"Значение": "026bdb90-297f-11eb-9068-04d4c4acd0dd"
},
"НаименованиеПолное": "Ашан",
"Контрагент": {
"Тип": "СправочникСсылка.Контрагенты",
"Значение": "31b9494b-297f-11eb-9068-04d4c4acd0dd"
}
},
{
"Ссылка": "026bdb92-297f-11eb-9068-04d4c4acd0dd",
"Наименование": "Перекресток",
"Владелец": {
"Тип": "СправочникСсылка.ВидыНоменклатуры",
"Значение": "026bdb90-297f-11eb-9068-04d4c4acd0dd"
},
"НаименованиеПолное": "Перекресток",
"Контрагент": {
"Тип": "СправочникСсылка.Контрагенты",
"Значение": "31b9494f-297f-11eb-9068-04d4c4acd0dd"
}
},
{
"Ссылка": "026bdb93-297f-11eb-9068-04d4c4acd0dd",
"Наименование": "5ка",
"Владелец": {
"Тип": "СправочникСсылка.ВидыНоменклатуры",
"Значение": "026bdb90-297f-11eb-9068-04d4c4acd0dd"
},
"НаименованиеПолное": "5ка",
"Контрагент": {
"Тип": "СправочникСсылка.Контрагенты",
"Значение": "31b9494d-297f-11eb-9068-04d4c4acd0dd"
}
},
{
"Ссылка": "026bdb94-297f-11eb-9068-04d4c4acd0dd",
"Наименование": "<Без маркировки>",
"Владелец": {
"Тип": "СправочникСсылка.ВидыНоменклатуры",
"Значение": "026bdb90-297f-11eb-9068-04d4c4acd0dd"
},
"НаименованиеПолное": "<Без маркировки>",
"НемаркированнаяПродукция": "true"
}
],
"НаборыУпаковок": [
{
"Ссылка": "026bdb7c-297f-11eb-9068-04d4c4acd0dd",
"Наименование": "Набор упаковок для сыров",
"ЕдиницаИзмерения": {
"Тип": "СправочникСсылка.УпаковкиЕдиницыИзмерения",
"Значение": {
"КодПоОКЕИ": "166"
}
}
}
],
"Производители": [
{
"Ссылка": "026bdb97-297f-11eb-9068-04d4c4acd0dd",
"Наименование": "Производитель продукции",
"Код": "000000001"
}
],
"Склады": [
{
"Ссылка": "4240da40-2a24-11eb-9068-04d4c4acd0dd",
"Наименование": "Группа складов для отгрузки",
"ЭтоГруппа": true,
"ЕмкостьСклада": [],
"ВидыПоказателей": [],
"КонтактнаяИнформация": [],
"УточненияПоДоставке": [],
"ДниДоставки": [],
"ПорядокПравилРазмещенияНоменклатуры": [],
"УточненияПоПриемке": []
},
{
"Ссылка": "1792edbb-297f-11eb-9068-04d4c4acd0dd",
"Наименование": "Сырная ГП",
"Родитель": {
"Тип": "СправочникСсылка.Склады",
"Значение": "4240da40-2a24-11eb-9068-04d4c4acd0dd"
},
"ЭтоГруппа": false,
"НастройкаКонтроляОстатков": "НеКонтролировать",
"ЕмкостьСклада": [],
"ВидыПоказателей": [],
"КонтактнаяИнформация": [
{
"Тип": "Адрес",
"Вид": {
"Тип": "СправочникСсылка.ВидыКонтактнойИнформации",
"Значение": "АдресСклада"
},
"Представление": "г. Москва, ул. Выборгская, д. 22",
"ЗначенияПолей": "<КонтактнаяИнформация xmlns=\"http://www.v8.1c.ru/ssl/contactinfo\" xmlns:xs=\"http://www.w3.org/2001/XMLSchema\" xmlns:xsi=\"http://www.w3.org/2001/XMLSchema-instance\" Представление=\"г. Москва, ул. Выборгская, д. 22\"><Состав xsi:type=\"Адрес\" Страна=\"РОССИЯ\"><Состав xsi:type=\"АдресРФ\"/></Состав></КонтактнаяИнформация>",
"Страна": "РОССИЯ",
"ВидДляСписка": {
"Тип": "СправочникСсылка.ВидыКонтактнойИнформации",
"Значение": "АдресСклада"
},
"Значение": "{\r\n\"value\": \"г. Москва, ул. Выборгская, д. 22\",\r\n\"comment\": \"\",\r\n\"type\": \"Адрес\",\r\n\"country\": \"РОССИЯ\",\r\n\"addressType\": \"ВСвободнойФорме\",\r\n\"countryCode\": \"643\",\r\n\"ZIPcode\": \"\",\r\n\"area\": \"\",\r\n\"areaType\": \"\",\r\n\"city\": \"\",\r\n\"cityType\": \"\",\r\n\"street\": \"\",\r\n\"streetType\": \"\",\r\n\"id\": \"\",\r\n\"areaCode\": \"\",\r\n\"areaId\": \"\",\r\n\"district\": \"\",\r\n\"districtType\": \"\",\r\n\"districtId\": \"\",\r\n\"munDistrict\": \"\",\r\n\"munDistrictType\": \"\",\r\n\"munDistrictId\": \"\",\r\n\"cityId\": \"\",\r\n\"settlement\": \"\",\r\n\"settlementType\": \"\",\r\n\"settlementId\": \"\",\r\n\"cityDistrict\": \"\",\r\n\"cityDistrictType\": \"\",\r\n\"cityDistrictId\": \"\",\r\n\"territory\": \"\",\r\n\"territoryType\": \"\",\r\n\"territoryId\": \"\",\r\n\"locality\": \"\",\r\n\"localityType\": \"\",\r\n\"localityId\": \"\",\r\n\"streetId\": \"\",\r\n\"houseType\": \"\",\r\n\"houseNumber\": \"\",\r\n\"houseId\": \"\",\r\n\"buildings\": [],\r\n\"apartments\": [],\r\n\"codeKLADR\": \"\",\r\n\"oktmo\": \"\",\r\n\"okato\": \"\",\r\n\"asInDocument\": \"\",\r\n\"ifnsFLCode\": \"\",\r\n\"ifnsULCode\": \"\",\r\n\"ifnsFLAreaCode\": \"\",\r\n\"ifnsULAreaCode\": \"\",\r\n\"stead\": \"\",\r\n\"steadId\": \"\"\r\n}"
}
],
"УточненияПоДоставке": [],
"ДниДоставки": [
{
"ДеньНедели": "Понедельник"
},
{
"ДеньНедели": "Вторник"
},
{
"ДеньНедели": "Среда"
},
{
"ДеньНедели": "Четверг"
},
{
"ДеньНедели": "Пятница"
},
{
"ДеньНедели": "Суббота"
},
{
"ДеньНедели": "Воскресенье"
}
],
"ПорядокПравилРазмещенияНоменклатуры": [],
"УточненияПоПриемке": []
},
{
"Ссылка": "4240da3f-2a24-11eb-9068-04d4c4acd0dd",
"Наименование": "Склад готовой продукции",
"ЭтоГруппа": false,
"НастройкаКонтроляОстатков": "НеКонтролировать",
"ЕмкостьСклада": [],
"ВидыПоказателей": [],
"КонтактнаяИнформация": [],
"УточненияПоДоставке": [],
"ДниДоставки": [
{
"ДеньНедели": "Понедельник"
},
{
"ДеньНедели": "Вторник"
},
{
"ДеньНедели": "Среда"
},
{
"ДеньНедели": "Четверг"
},
{
"ДеньНедели": "Пятница"
},
{
"ДеньНедели": "Суббота"
},
{
"ДеньНедели": "Воскресенье"
}
],
"ПорядокПравилРазмещенияНоменклатуры": [],
"УточненияПоПриемке": []
},
{
"Ссылка": "4240da4f-2a24-11eb-9068-04d4c4acd0dd",
"Наименование": "Склад (планы отгрузки по заказам)",
"ЭтоГруппа": false,
"НастройкаКонтроляОстатков": "НеКонтролировать",
"ЕмкостьСклада": [],
"ВидыПоказателей": [],
"КонтактнаяИнформация": [],
"УточненияПоДоставке": [],
"ДниДоставки": [
{
"ДеньНедели": "Понедельник"
},
{
"ДеньНедели": "Вторник"
},
{
"ДеньНедели": "Среда"
},
{
"ДеньНедели": "Четверг"
},
{
"ДеньНедели": "Пятница"
},
{
"ДеньНедели": "Суббота"
},
{
"ДеньНедели": "Воскресенье"
}
],
"ПорядокПравилРазмещенияНоменклатуры": [],
"УточненияПоПриемке": []
},
{
"Ссылка": "1792edbc-297f-11eb-9068-04d4c4acd0dd",
"Наименование": "Куриная ГП",
"Родитель": {
"Тип": "СправочникСсылка.Склады",
"Значение": "4240da40-2a24-11eb-9068-04d4c4acd0dd"
},
"ЭтоГруппа": false,
"НастройкаКонтроляОстатков": "НеКонтролировать",
"ЕмкостьСклада": [],
"ВидыПоказателей": [],
"КонтактнаяИнформация": [
{
"Тип": "Адрес",
"Вид": {
"Тип": "СправочникСсылка.ВидыКонтактнойИнформации",
"Значение": "АдресСклада"
},
"Представление": "г. Нижний Новгород, ул. Советская, д. 24",
"ЗначенияПолей": "<КонтактнаяИнформация xmlns=\"http://www.v8.1c.ru/ssl/contactinfo\" xmlns:xs=\"http://www.w3.org/2001/XMLSchema\" xmlns:xsi=\"http://www.w3.org/2001/XMLSchema-instance\" Представление=\"г. Нижний Новгород, ул. Советская, д. 24\"><Состав xsi:type=\"Адрес\" Страна=\"РОССИЯ\"><Состав xsi:type=\"АдресРФ\"/></Состав></КонтактнаяИнформация>",
"Страна": "РОССИЯ",
"ВидДляСписка": {
"Тип": "СправочникСсылка.ВидыКонтактнойИнформации",
"Значение": "АдресСклада"
},
"Значение": "{\r\n\"value\": \"г. Нижний Новгород, ул. Советская, д. 24\",\r\n\"comment\": \"\",\r\n\"type\": \"Адрес\",\r\n\"country\": \"РОССИЯ\",\r\n\"addressType\": \"ВСвободнойФорме\",\r\n\"countryCode\": \"643\",\r\n\"ZIPcode\": \"\",\r\n\"area\": \"\",\r\n\"areaType\": \"\",\r\n\"city\": \"\",\r\n\"cityType\": \"\",\r\n\"street\": \"\",\r\n\"streetType\": \"\",\r\n\"id\": \"\",\r\n\"areaCode\": \"\",\r\n\"areaId\": \"\",\r\n\"district\": \"\",\r\n\"districtType\": \"\",\r\n\"districtId\": \"\",\r\n\"munDistrict\": \"\",\r\n\"munDistrictType\": \"\",\r\n\"munDistrictId\": \"\",\r\n\"cityId\": \"\",\r\n\"settlement\": \"\",\r\n\"settlementType\": \"\",\r\n\"settlementId\": \"\",\r\n\"cityDistrict\": \"\",\r\n\"cityDistrictType\": \"\",\r\n\"cityDistrictId\": \"\",\r\n\"territory\": \"\",\r\n\"territoryType\": \"\",\r\n\"territoryId\": \"\",\r\n\"locality\": \"\",\r\n\"localityType\": \"\",\r\n\"localityId\": \"\",\r\n\"streetId\": \"\",\r\n\"houseType\": \"\",\r\n\"houseNumber\": \"\",\r\n\"houseId\": \"\",\r\n\"buildings\": [],\r\n\"apartments\": [],\r\n\"codeKLADR\": \"\",\r\n\"oktmo\": \"\",\r\n\"okato\": \"\",\r\n\"asInDocument\": \"\",\r\n\"ifnsFLCode\": \"\",\r\n\"ifnsULCode\": \"\",\r\n\"ifnsFLAreaCode\": \"\",\r\n\"ifnsULAreaCode\": \"\",\r\n\"stead\": \"\",\r\n\"steadId\": \"\"\r\n}"
}
],
"УточненияПоДоставке": [],
"ДниДоставки": [
{
"ДеньНедели": "Понедельник"
},
{
"ДеньНедели": "Вторник"
},
{
"ДеньНедели": "Среда"
},
{
"ДеньНедели": "Четверг"
},
{
"ДеньНедели": "Пятница"
},
{
"ДеньНедели": "Суббота"
},
{
"ДеньНедели": "Воскресенье"
}
],
"ПорядокПравилРазмещенияНоменклатуры": [],
"УточненияПоПриемке": []
}
],
"Подразделения": [
{
"Ссылка": "1792edc3-297f-11eb-9068-04d4c4acd0dd",
"Наименование": "Подразделения формирования документов",
"Код": "000000001",
"ЭтоГруппа": true,
"КонтактнаяИнформация": []
},
{
"Ссылка": "1792edc4-297f-11eb-9068-04d4c4acd0dd",
"Наименование": "Подразделение приемки заказов",
"Код": "000000002",
"Родитель": {
"Тип": "СправочникСсылка.Подразделения",
"Значение": "1792edc3-297f-11eb-9068-04d4c4acd0dd"
},
"ЭтоГруппа": false,
"ЮрФизЛицо": "ЮрЛицо",
"КонтактнаяИнформация": []
},
{
"Ссылка": "4240da39-2a24-11eb-9068-04d4c4acd0dd",
"Наименование": "Подразделение с лицами с правом подписи",
"Код": "000000003",
"Родитель": {
"Тип": "СправочникСсылка.Подразделения",
"Значение": "1792edc3-297f-11eb-9068-04d4c4acd0dd"
},
"ЭтоГруппа": false,
"ЮрФизЛицо": "ЮрЛицо",
"КонтактнаяИнформация": []
},
{
"Ссылка": "4240da3a-2a24-11eb-9068-04d4c4acd0dd",
"Наименование": "Обособленное подразделение",
"Код": "000000004",
"Родитель": {
"Тип": "СправочникСсылка.Подразделения",
"Значение": "1792edc3-297f-11eb-9068-04d4c4acd0dd"
},
"ЭтоГруппа": false,
"Обособленное": "true",
"ИНН": "131313131313",
"КПП": "141414141",
"ОГРН": "151515151515151",
"НаименованиеПолное": "Общество с ограниченной ответственностью Обособленное подразделение",
"НаименованиеСокращенное": "ООО Обособленное подразделение",
"НаименованиеМеждународное": "Obosoblennoe podrazdelenie",
"КодОКВЭД": "17171717",
"КодПоОКПО": "1616161661",
"ЮрФизЛицо": "ЮрЛицо",
"КонтактнаяИнформация": [
{
"Тип": "Адрес",
"Вид": {
"Тип": "СправочникСсылка.ВидыКонтактнойИнформации",
"Значение": "АдресПодразделения"
},
"Представление": "Адрес Обособленного подразделения",
"ЗначенияПолей": "<КонтактнаяИнформация xmlns=\"http://www.v8.1c.ru/ssl/contactinfo\" xmlns:xs=\"http://www.w3.org/2001/XMLSchema\" xmlns:xsi=\"http://www.w3.org/2001/XMLSchema-instance\" Представление=\"Адрес Обособленного подразделения\"><Состав xsi:type=\"Адрес\" Страна=\"РОССИЯ\"><Состав xsi:type=\"АдресРФ\"/></Состав></КонтактнаяИнформация>",
"Страна": "РОССИЯ",
"Значение": "{\r\n\"value\": \"Адрес Обособленного подразделения\",\r\n\"comment\": \"\",\r\n\"type\": \"Адрес\",\r\n\"country\": \"РОССИЯ\",\r\n\"addressType\": \"ВСвободнойФорме\",\r\n\"countryCode\": \"643\",\r\n\"ZIPcode\": \"\",\r\n\"area\": \"\",\r\n\"areaType\": \"\",\r\n\"city\": \"\",\r\n\"cityType\": \"\",\r\n\"street\": \"\",\r\n\"streetType\": \"\",\r\n\"id\": \"\",\r\n\"areaCode\": \"\",\r\n\"areaId\": \"\",\r\n\"district\": \"\",\r\n\"districtType\": \"\",\r\n\"districtId\": \"\",\r\n\"munDistrict\": \"\",\r\n\"munDistrictType\": \"\",\r\n\"munDistrictId\": \"\",\r\n\"cityId\": \"\",\r\n\"settlement\": \"\",\r\n\"settlementType\": \"\",\r\n\"settlementId\": \"\",\r\n\"cityDistrict\": \"\",\r\n\"cityDistrictType\": \"\",\r\n\"cityDistrictId\": \"\",\r\n\"territory\": \"\",\r\n\"territoryType\": \"\",\r\n\"territoryId\": \"\",\r\n\"locality\": \"\",\r\n\"localityType\": \"\",\r\n\"localityId\": \"\",\r\n\"streetId\": \"\",\r\n\"houseType\": \"\",\r\n\"houseNumber\": \"\",\r\n\"houseId\": \"\",\r\n\"buildings\": [],\r\n\"apartments\": [],\r\n\"codeKLADR\": \"\",\r\n\"oktmo\": \"\",\r\n\"okato\": \"\",\r\n\"asInDocument\": \"\",\r\n\"ifnsFLCode\": \"\",\r\n\"ifnsULCode\": \"\",\r\n\"ifnsFLAreaCode\": \"\",\r\n\"ifnsULAreaCode\": \"\",\r\n\"stead\": \"\",\r\n\"steadId\": \"\"\r\n}"
},
{
"Тип": "Телефон",
"Вид": {
"Тип": "СправочникСсылка.ВидыКонтактнойИнформации",
"Значение": "ТелефонПодразделения"
},
"Представление": "+79995556677",
"ЗначенияПолей": "<КонтактнаяИнформация xmlns=\"http://www.v8.1c.ru/ssl/contactinfo\" xmlns:xs=\"http://www.w3.org/2001/XMLSchema\" xmlns:xsi=\"http://www.w3.org/2001/XMLSchema-instance\" Представление=\"+79995556677\"><Состав xsi:type=\"НомерТелефона\" КодСтраны=\"79995556677\" КодГорода=\"\" Номер=\"\" Добавочный=\"\"/></КонтактнаяИнформация>",
"НомерТелефона": "79995556677",
"Значение": "{\r\n\"value\": \"+79995556677\",\r\n\"comment\": \"\",\r\n\"type\": \"Телефон\",\r\n\"countryCode\": \"79995556677\",\r\n\"areaCode\": \"\",\r\n\"number\": \"\",\r\n\"extNumber\": \"\"\r\n}"
},
{
"Тип": "АдресЭлектроннойПочты",
"Вид": {
"Тип": "СправочникСсылка.ВидыКонтактнойИнформации",
"Значение": "EmailПодразделения"
},
"Представление": "obpodrazdelenie@bk.ru",
"ЗначенияПолей": "<КонтактнаяИнформация xmlns=\"http://www.v8.1c.ru/ssl/contactinfo\" xmlns:xs=\"http://www.w3.org/2001/XMLSchema\" xmlns:xsi=\"http://www.w3.org/2001/XMLSchema-instance\" Представление=\"obpodrazdelenie@bk.ru\"><Состав xsi:type=\"ЭлектроннаяПочта\" Значение=\"obpodrazdelenie@bk.ru\"/></КонтактнаяИнформация>",
"АдресЭП": "obpodrazdelenie@bk.ru",
"ДоменноеИмяСервера": "bk.ru",
"Значение": "{\r\n\"value\": \"obpodrazdelenie@bk.ru\",\r\n\"comment\": \"\",\r\n\"type\": \"АдресЭлектроннойПочты\"\r\n}"
},
{
"Тип": "Адрес",
"Вид": {
"Тип": "СправочникСсылка.ВидыКонтактнойИнформации",
"Значение": "ФактАдресПодразделения"
},
"Представление": "Фактический Адрес Обособленного подразделения",
"ЗначенияПолей": "<КонтактнаяИнформация xmlns=\"http://www.v8.1c.ru/ssl/contactinfo\" xmlns:xs=\"http://www.w3.org/2001/XMLSchema\" xmlns:xsi=\"http://www.w3.org/2001/XMLSchema-instance\" Представление=\"Фактический Адрес Обособленного подразделения\"><Состав xsi:type=\"Адрес\" Страна=\"РОССИЯ\"><Состав xsi:type=\"АдресРФ\"/></Состав></КонтактнаяИнформация>",
"Страна": "РОССИЯ",
"Значение": "{\r\n\"value\": \"Фактический Адрес Обособленного подразделения\",\r\n\"comment\": \"\",\r\n\"type\": \"Адрес\",\r\n\"country\": \"РОССИЯ\",\r\n\"addressType\": \"ВСвободнойФорме\",\r\n\"countryCode\": \"643\",\r\n\"ZIPcode\": \"\",\r\n\"area\": \"\",\r\n\"areaType\": \"\",\r\n\"city\": \"\",\r\n\"cityType\": \"\",\r\n\"street\": \"\",\r\n\"streetType\": \"\",\r\n\"id\": \"\",\r\n\"areaCode\": \"\",\r\n\"areaId\": \"\",\r\n\"district\": \"\",\r\n\"districtType\": \"\",\r\n\"districtId\": \"\",\r\n\"munDistrict\": \"\",\r\n\"munDistrictType\": \"\",\r\n\"munDistrictId\": \"\",\r\n\"cityId\": \"\",\r\n\"settlement\": \"\",\r\n\"settlementType\": \"\",\r\n\"settlementId\": \"\",\r\n\"cityDistrict\": \"\",\r\n\"cityDistrictType\": \"\",\r\n\"cityDistrictId\": \"\",\r\n\"territory\": \"\",\r\n\"territoryType\": \"\",\r\n\"territoryId\": \"\",\r\n\"locality\": \"\",\r\n\"localityType\": \"\",\r\n\"localityId\": \"\",\r\n\"streetId\": \"\",\r\n\"houseType\": \"\",\r\n\"houseNumber\": \"\",\r\n\"houseId\": \"\",\r\n\"buildings\": [],\r\n\"apartments\": [],\r\n\"codeKLADR\": \"\",\r\n\"oktmo\": \"\",\r\n\"okato\": \"\",\r\n\"asInDocument\": \"\",\r\n\"ifnsFLCode\": \"\",\r\n\"ifnsULCode\": \"\",\r\n\"ifnsFLAreaCode\": \"\",\r\n\"ifnsULAreaCode\": \"\",\r\n\"stead\": \"\",\r\n\"steadId\": \"\"\r\n}"
},
{
"Тип": "Адрес",
"Вид": {
"Тип": "СправочникСсылка.ВидыКонтактнойИнформации",
"Значение": "ЮрАдресПодразделения"
},
"Представление": "Юридический Адрес Обособленного подразделения",
"ЗначенияПолей": "<КонтактнаяИнформация xmlns=\"http://www.v8.1c.ru/ssl/contactinfo\" xmlns:xs=\"http://www.w3.org/2001/XMLSchema\" xmlns:xsi=\"http://www.w3.org/2001/XMLSchema-instance\" Представление=\"Юридический Адрес Обособленного подразделения\"><Состав xsi:type=\"Адрес\" Страна=\"РОССИЯ\"><Состав xsi:type=\"АдресРФ\"/></Состав></КонтактнаяИнформация>",
"Страна": "РОССИЯ",
"Значение": "{\r\n\"value\": \"Юридический Адрес Обособленного подразделения\",\r\n\"comment\": \"\",\r\n\"type\": \"Адрес\",\r\n\"country\": \"РОССИЯ\",\r\n\"addressType\": \"ВСвободнойФорме\",\r\n\"countryCode\": \"643\",\r\n\"ZIPcode\": \"\",\r\n\"area\": \"\",\r\n\"areaType\": \"\",\r\n\"city\": \"\",\r\n\"cityType\": \"\",\r\n\"street\": \"\",\r\n\"streetType\": \"\",\r\n\"id\": \"\",\r\n\"areaCode\": \"\",\r\n\"areaId\": \"\",\r\n\"district\": \"\",\r\n\"districtType\": \"\",\r\n\"districtId\": \"\",\r\n\"munDistrict\": \"\",\r\n\"munDistrictType\": \"\",\r\n\"munDistrictId\": \"\",\r\n\"cityId\": \"\",\r\n\"settlement\": \"\",\r\n\"settlementType\": \"\",\r\n\"settlementId\": \"\",\r\n\"cityDistrict\": \"\",\r\n\"cityDistrictType\": \"\",\r\n\"cityDistrictId\": \"\",\r\n\"territory\": \"\",\r\n\"territoryType\": \"\",\r\n\"territoryId\": \"\",\r\n\"locality\": \"\",\r\n\"localityType\": \"\",\r\n\"localityId\": \"\",\r\n\"streetId\": \"\",\r\n\"houseType\": \"\",\r\n\"houseNumber\": \"\",\r\n\"houseId\": \"\",\r\n\"buildings\": [],\r\n\"apartments\": [],\r\n\"codeKLADR\": \"\",\r\n\"oktmo\": \"\",\r\n\"okato\": \"\",\r\n\"asInDocument\": \"\",\r\n\"ifnsFLCode\": \"\",\r\n\"ifnsULCode\": \"\",\r\n\"ifnsFLAreaCode\": \"\",\r\n\"ifnsULAreaCode\": \"\",\r\n\"stead\": \"\",\r\n\"steadId\": \"\"\r\n}"
}
]
}
],
"Контрагенты": [
{
"Ссылка": "31b9494b-297f-11eb-9068-04d4c4acd0dd",
"Наименование": "Ашан",
"Код": "00-00000001",
"ЭтоГруппа": false,
"НаименованиеПолное": "ООО Ашан",
"Тип": "ЛокальнаяТочка",
"Покупатель": "true",
"ИНН": "0012123456",
"КПП": "5678999",
"КодПоОКПО": "66666677",
"СтранаРегистрации": {
"Тип": "СправочникСсылка.СтраныМира",
"Значение": "Россия"
},
"ОсновныеСведения": "ООО Ашан\nИНН 0012123456\nКПП 5678999\nОКПО 66666677\n+79056784325\naaaaaaaa@bk.ru\nФактическая Нижегородская область, город Нижний Новгород, проспект Гагарина, дом 223\nЮридическая Нижегородская область, город Нижний Новгород, проспект Гагарина, дом 223\nОсновной менеджер",
"ЮрФизЛицо": "ЮрЛицо",
"РегистрационныйНомер": "1027739329408",
"ДополнительныеРеквизиты": [],
"КонтактнаяИнформация": [
{
"Тип": "Телефон",
"Вид": {
"Тип": "СправочникСсылка.ВидыКонтактнойИнформации",
"Значение": "ТелефонКонтрагента"
},
"Представление": "+79056784325",
"ЗначенияПолей": "<КонтактнаяИнформация xmlns=\"http://www.v8.1c.ru/ssl/contactinfo\" xmlns:xs=\"http://www.w3.org/2001/XMLSchema\" xmlns:xsi=\"http://www.w3.org/2001/XMLSchema-instance\" Представление=\"+79056784325\"><Состав xsi:type=\"НомерТелефона\" КодСтраны=\"79056784325\" КодГорода=\"\" Номер=\"\" Добавочный=\"\"/></КонтактнаяИнформация>",
"НомерТелефона": "79056784325",
"ВидДляСписка": {
"Тип": "СправочникСсылка.ВидыКонтактнойИнформации",
"Значение": "ТелефонКонтрагента"
},
"Значение": "{\r\n\"value\": \"+79056784325\",\r\n\"comment\": \"\",\r\n\"type\": \"Телефон\",\r\n\"countryCode\": \"79056784325\",\r\n\"areaCode\": \"\",\r\n\"number\": \"\",\r\n\"extNumber\": \"\"\r\n}"
},
{
"Тип": "АдресЭлектроннойПочты",
"Вид": {
"Тип": "СправочникСсылка.ВидыКонтактнойИнформации",
"Значение": "EmailКонтрагента"
},
"Представление": "aaaaaaaa@bk.ru",
"ЗначенияПолей": "<КонтактнаяИнформация xmlns=\"http://www.v8.1c.ru/ssl/contactinfo\" xmlns:xs=\"http://www.w3.org/2001/XMLSchema\" xmlns:xsi=\"http://www.w3.org/2001/XMLSchema-instance\" Представление=\"aaaaaaaa@bk.ru\"><Состав xsi:type=\"ЭлектроннаяПочта\" Значение=\"aaaaaaaa@bk.ru\"/></КонтактнаяИнформация>",
"АдресЭП": "aaaaaaaa@bk.ru",
"ДоменноеИмяСервера": "bk.ru",
"ВидДляСписка": {
"Тип": "СправочникСсылка.ВидыКонтактнойИнформации",
"Значение": "EmailКонтрагента"
},
"Значение": "{\r\n\"value\": \"aaaaaaaa@bk.ru\",\r\n\"comment\": \"\",\r\n\"type\": \"АдресЭлектроннойПочты\"\r\n}"
},
{
"Тип": "Адрес",
"Вид": {
"Тип": "СправочникСсылка.ВидыКонтактнойИнформации",
"Значение": "ФактАдресКонтрагента"
},
"Представление": "Фактическая Нижегородская область, город Нижний Новгород, проспект Гагарина, дом 223",
"ЗначенияПолей": "<КонтактнаяИнформация xmlns=\"http://www.v8.1c.ru/ssl/contactinfo\" xmlns:xs=\"http://www.w3.org/2001/XMLSchema\" xmlns:xsi=\"http://www.w3.org/2001/XMLSchema-instance\" Представление=\"Фактическая Нижегородская область, город Нижний Новгород, проспект Гагарина, дом 223\"><Состав xsi:type=\"Адрес\" Страна=\"РОССИЯ\"><Состав xsi:type=\"АдресРФ\"/></Состав></КонтактнаяИнформация>",
"Страна": "РОССИЯ",
"ВидДляСписка": {
"Тип": "СправочникСсылка.ВидыКонтактнойИнформации",
"Значение": "ФактАдресКонтрагента"
},
"Значение": "{\r\n\"value\": \"Фактическая Нижегородская область, город Нижний Новгород, проспект Гагарина, дом 223\",\r\n\"comment\": \"\",\r\n\"type\": \"Адрес\",\r\n\"country\": \"РОССИЯ\",\r\n\"addressType\": \"ВСвободнойФорме\",\r\n\"countryCode\": \"643\",\r\n\"ZIPcode\": \"\",\r\n\"area\": \"\",\r\n\"areaType\": \"\",\r\n\"city\": \"\",\r\n\"cityType\": \"\",\r\n\"street\": \"\",\r\n\"streetType\": \"\",\r\n\"id\": \"\",\r\n\"areaCode\": \"\",\r\n\"areaId\": \"\",\r\n\"district\": \"\",\r\n\"districtType\": \"\",\r\n\"districtId\": \"\",\r\n\"munDistrict\": \"\",\r\n\"munDistrictType\": \"\",\r\n\"munDistrictId\": \"\",\r\n\"cityId\": \"\",\r\n\"settlement\": \"\",\r\n\"settlementType\": \"\",\r\n\"settlementId\": \"\",\r\n\"cityDistrict\": \"\",\r\n\"cityDistrictType\": \"\",\r\n\"cityDistrictId\": \"\",\r\n\"territory\": \"\",\r\n\"territoryType\": \"\",\r\n\"territoryId\": \"\",\r\n\"locality\": \"\",\r\n\"localityType\": \"\",\r\n\"localityId\": \"\",\r\n\"streetId\": \"\",\r\n\"houseType\": \"\",\r\n\"houseNumber\": \"\",\r\n\"houseId\": \"\",\r\n\"buildings\": [],\r\n\"apartments\": [],\r\n\"codeKLADR\": \"\",\r\n\"oktmo\": \"\",\r\n\"okato\": \"\",\r\n\"asInDocument\": \"\",\r\n\"ifnsFLCode\": \"\",\r\n\"ifnsULCode\": \"\",\r\n\"ifnsFLAreaCode\": \"\",\r\n\"ifnsULAreaCode\": \"\",\r\n\"stead\": \"\",\r\n\"steadId\": \"\"\r\n}"
},
{
"Тип": "Адрес",
"Вид": {
"Тип": "СправочникСсылка.ВидыКонтактнойИнформации",
"Значение": "ЮрАдресКонтрагента"
},
"Представление": "Юридическая Нижегородская область, город Нижний Новгород, проспект Гагарина, дом 223",
"ЗначенияПолей": "<КонтактнаяИнформация xmlns=\"http://www.v8.1c.ru/ssl/contactinfo\" xmlns:xs=\"http://www.w3.org/2001/XMLSchema\" xmlns:xsi=\"http://www.w3.org/2001/XMLSchema-instance\" Представление=\"Юридическая Нижегородская область, город Нижний Новгород, проспект Гагарина, дом 223\"><Состав xsi:type=\"Адрес\" Страна=\"РОССИЯ\"><Состав xsi:type=\"АдресРФ\"/></Состав></КонтактнаяИнформация>",
"Страна": "РОССИЯ",
"ВидДляСписка": {
"Тип": "СправочникСсылка.ВидыКонтактнойИнформации",
"Значение": "ЮрАдресКонтрагента"
},
"Значение": "{\r\n\"value\": \"Юридическая Нижегородская область, город Нижний Новгород, проспект Гагарина, дом 223\",\r\n\"comment\": \"\",\r\n\"type\": \"Адрес\",\r\n\"country\": \"РОССИЯ\",\r\n\"addressType\": \"ВСвободнойФорме\",\r\n\"countryCode\": \"643\",\r\n\"ZIPcode\": \"\",\r\n\"area\": \"\",\r\n\"areaType\": \"\",\r\n\"city\": \"\",\r\n\"cityType\": \"\",\r\n\"street\": \"\",\r\n\"streetType\": \"\",\r\n\"id\": \"\",\r\n\"areaCode\": \"\",\r\n\"areaId\": \"\",\r\n\"district\": \"\",\r\n\"districtType\": \"\",\r\n\"districtId\": \"\",\r\n\"munDistrict\": \"\",\r\n\"munDistrictType\": \"\",\r\n\"munDistrictId\": \"\",\r\n\"cityId\": \"\",\r\n\"settlement\": \"\",\r\n\"settlementType\": \"\",\r\n\"settlementId\": \"\",\r\n\"cityDistrict\": \"\",\r\n\"cityDistrictType\": \"\",\r\n\"cityDistrictId\": \"\",\r\n\"territory\": \"\",\r\n\"territoryType\": \"\",\r\n\"territoryId\": \"\",\r\n\"locality\": \"\",\r\n\"localityType\": \"\",\r\n\"localityId\": \"\",\r\n\"streetId\": \"\",\r\n\"houseType\": \"\",\r\n\"houseNumber\": \"\",\r\n\"houseId\": \"\",\r\n\"buildings\": [],\r\n\"apartments\": [],\r\n\"codeKLADR\": \"\",\r\n\"oktmo\": \"\",\r\n\"okato\": \"\",\r\n\"asInDocument\": \"\",\r\n\"ifnsFLCode\": \"\",\r\n\"ifnsULCode\": \"\",\r\n\"ifnsFLAreaCode\": \"\",\r\n\"ifnsULAreaCode\": \"\",\r\n\"stead\": \"\",\r\n\"steadId\": \"\"\r\n}"
}
]
},
{
"Ссылка": "31b9494d-297f-11eb-9068-04d4c4acd0dd",
"Наименование": "5ка",
"Код": "00-00000002",
"ЭтоГруппа": false,
"НаименованиеПолное": "ООО 5ка",
"Тип": "ЛокальнаяТочка",
"Покупатель": "true",
"ИНН": "0065428976",
"КПП": "9858421",
"КодПоОКПО": "87654377",
"СтранаРегистрации": {
"Тип": "СправочникСсылка.СтраныМира",
"Значение": "Россия"
},
"ОсновныеСведения": "ООО 5ка\nИНН 0065428976\nКПП 9858421\nОКПО 87654377\n+79096784995\n5555555@bk.ru\nНижегородская область, город Нижний Новгород, ул. Генкиной, дом 23\nОсновной менеджер",
"ЮрФизЛицо": "ЮрЛицо",
"РегистрационныйНомер": "1026739325673",
"ДополнительныеРеквизиты": [],
"КонтактнаяИнформация": [
{
"Тип": "Телефон",
"Вид": {
"Тип": "СправочникСсылка.ВидыКонтактнойИнформации",
"Значение": "ТелефонКонтрагента"
},
"Представление": "+79096784995",
"ЗначенияПолей": "<КонтактнаяИнформация xmlns=\"http://www.v8.1c.ru/ssl/contactinfo\" xmlns:xs=\"http://www.w3.org/2001/XMLSchema\" xmlns:xsi=\"http://www.w3.org/2001/XMLSchema-instance\" Представление=\"+79096784995\"><Состав xsi:type=\"НомерТелефона\" КодСтраны=\"79096784995\" КодГорода=\"\" Номер=\"\" Добавочный=\"\"/></КонтактнаяИнформация>",
"НомерТелефона": "79096784995",
"ВидДляСписка": {
"Тип": "СправочникСсылка.ВидыКонтактнойИнформации",
"Значение": "ТелефонКонтрагента"
},
"Значение": "{\r\n\"value\": \"+79096784995\",\r\n\"comment\": \"\",\r\n\"type\": \"Телефон\",\r\n\"countryCode\": \"79096784995\",\r\n\"areaCode\": \"\",\r\n\"number\": \"\",\r\n\"extNumber\": \"\"\r\n}"
},
{
"Тип": "АдресЭлектроннойПочты",
"Вид": {
"Тип": "СправочникСсылка.ВидыКонтактнойИнформации",
"Значение": "EmailКонтрагента"
},
"Представление": "5555555@bk.ru",
"ЗначенияПолей": "<КонтактнаяИнформация xmlns=\"http://www.v8.1c.ru/ssl/contactinfo\" xmlns:xs=\"http://www.w3.org/2001/XMLSchema\" xmlns:xsi=\"http://www.w3.org/2001/XMLSchema-instance\" Представление=\"5555555@bk.ru\"><Состав xsi:type=\"ЭлектроннаяПочта\" Значение=\"5555555@bk.ru\"/></КонтактнаяИнформация>",
"АдресЭП": "5555555@bk.ru",
"ДоменноеИмяСервера": "bk.ru",
"ВидДляСписка": {
"Тип": "СправочникСсылка.ВидыКонтактнойИнформации",
"Значение": "EmailКонтрагента"
},
"Значение": "{\r\n\"value\": \"5555555@bk.ru\",\r\n\"comment\": \"\",\r\n\"type\": \"АдресЭлектроннойПочты\"\r\n}"
},
{
"Тип": "Адрес",
"Вид": {
"Тип": "СправочникСсылка.ВидыКонтактнойИнформации",
"Значение": "ФактАдресКонтрагента"
},
"Представление": "Нижегородская область, город Нижний Новгород, ул. Генкиной, дом 23",
"ЗначенияПолей": "<КонтактнаяИнформация xmlns=\"http://www.v8.1c.ru/ssl/contactinfo\" xmlns:xs=\"http://www.w3.org/2001/XMLSchema\" xmlns:xsi=\"http://www.w3.org/2001/XMLSchema-instance\" Представление=\"Нижегородская область, город Нижний Новгород, ул. Генкиной, дом 23\"><Состав xsi:type=\"Адрес\" Страна=\"РОССИЯ\"><Состав xsi:type=\"АдресРФ\"/></Состав></КонтактнаяИнформация>",
"Страна": "РОССИЯ",
"ВидДляСписка": {
"Тип": "СправочникСсылка.ВидыКонтактнойИнформации",
"Значение": "ФактАдресКонтрагента"
},
"Значение": "{\r\n\"value\": \"Нижегородская область, город Нижний Новгород, ул. Генкиной, дом 23\",\r\n\"comment\": \"\",\r\n\"type\": \"Адрес\",\r\n\"country\": \"РОССИЯ\",\r\n\"addressType\": \"ВСвободнойФорме\",\r\n\"countryCode\": \"643\",\r\n\"ZIPcode\": \"\",\r\n\"area\": \"\",\r\n\"areaType\": \"\",\r\n\"city\": \"\",\r\n\"cityType\": \"\",\r\n\"street\": \"\",\r\n\"streetType\": \"\",\r\n\"id\": \"\",\r\n\"areaCode\": \"\",\r\n\"areaId\": \"\",\r\n\"district\": \"\",\r\n\"districtType\": \"\",\r\n\"districtId\": \"\",\r\n\"munDistrict\": \"\",\r\n\"munDistrictType\": \"\",\r\n\"munDistrictId\": \"\",\r\n\"cityId\": \"\",\r\n\"settlement\": \"\",\r\n\"settlementType\": \"\",\r\n\"settlementId\": \"\",\r\n\"cityDistrict\": \"\",\r\n\"cityDistrictType\": \"\",\r\n\"cityDistrictId\": \"\",\r\n\"territory\": \"\",\r\n\"territoryType\": \"\",\r\n\"territoryId\": \"\",\r\n\"locality\": \"\",\r\n\"localityType\": \"\",\r\n\"localityId\": \"\",\r\n\"streetId\": \"\",\r\n\"houseType\": \"\",\r\n\"houseNumber\": \"\",\r\n\"houseId\": \"\",\r\n\"buildings\": [],\r\n\"apartments\": [],\r\n\"codeKLADR\": \"\",\r\n\"oktmo\": \"\",\r\n\"okato\": \"\",\r\n\"asInDocument\": \"\",\r\n\"ifnsFLCode\": \"\",\r\n\"ifnsULCode\": \"\",\r\n\"ifnsFLAreaCode\": \"\",\r\n\"ifnsULAreaCode\": \"\",\r\n\"stead\": \"\",\r\n\"steadId\": \"\"\r\n}"
}
]
},
{
"Ссылка": "31b9494f-297f-11eb-9068-04d4c4acd0dd",
"Наименование": "Перекресток",
"Код": "00-00000003",
"ЭтоГруппа": false,
"НаименованиеПолное": "ООО Перекресток",
"Тип": "ЛокальнаяТочка",
"Покупатель": "true",
"ИНН": "0026426679",
"КПП": "9800326",
"КодПоОКПО": "24654355",
"СтранаРегистрации": {
"Тип": "СправочникСсылка.СтраныМира",
"Значение": "Россия"
},
"ОсновныеСведения": "ООО Перекресток\nИНН 0026426679\nКПП 9800326\nОКПО 24654355\n+79076784775\nppppppp@bk.ru\nНижегородская область, город Нижний Новгород, проспект Ленина, дом 218\nОсновной менеджер",
"ЮрФизЛицо": "ЮрЛицо",
"РегистрационныйНомер": "1025229325867",
"ДополнительныеРеквизиты": [],
"КонтактнаяИнформация": [
{
"Тип": "Телефон",
"Вид": {
"Тип": "СправочникСсылка.ВидыКонтактнойИнформации",
"Значение": "ТелефонКонтрагента"
},
"Представление": "+79076784775",
"ЗначенияПолей": "<КонтактнаяИнформация xmlns=\"http://www.v8.1c.ru/ssl/contactinfo\" xmlns:xs=\"http://www.w3.org/2001/XMLSchema\" xmlns:xsi=\"http://www.w3.org/2001/XMLSchema-instance\" Представление=\"+79076784775\"><Состав xsi:type=\"НомерТелефона\" КодСтраны=\"79076784775\" КодГорода=\"\" Номер=\"\" Добавочный=\"\"/></КонтактнаяИнформация>",
"НомерТелефона": "79076784775",
"ВидДляСписка": {
"Тип": "СправочникСсылка.ВидыКонтактнойИнформации",
"Значение": "ТелефонКонтрагента"
},
"Значение": "{\r\n\"value\": \"+79076784775\",\r\n\"comment\": \"\",\r\n\"type\": \"Телефон\",\r\n\"countryCode\": \"79076784775\",\r\n\"areaCode\": \"\",\r\n\"number\": \"\",\r\n\"extNumber\": \"\"\r\n}"
},
{
"Тип": "АдресЭлектроннойПочты",
"Вид": {
"Тип": "СправочникСсылка.ВидыКонтактнойИнформации",
"Значение": "EmailКонтрагента"
},
"Представление": "ppppppp@bk.ru",
"ЗначенияПолей": "<КонтактнаяИнформация xmlns=\"http://www.v8.1c.ru/ssl/contactinfo\" xmlns:xs=\"http://www.w3.org/2001/XMLSchema\" xmlns:xsi=\"http://www.w3.org/2001/XMLSchema-instance\" Представление=\"ppppppp@bk.ru\"><Состав xsi:type=\"ЭлектроннаяПочта\" Значение=\"ppppppp@bk.ru\"/></КонтактнаяИнформация>",
"АдресЭП": "ppppppp@bk.ru",
"ДоменноеИмяСервера": "bk.ru",
"ВидДляСписка": {
"Тип": "СправочникСсылка.ВидыКонтактнойИнформации",
"Значение": "EmailКонтрагента"
},
"Значение": "{\r\n\"value\": \"ppppppp@bk.ru\",\r\n\"comment\": \"\",\r\n\"type\": \"АдресЭлектроннойПочты\"\r\n}"
},
{
"Тип": "Адрес",
"Вид": {
"Тип": "СправочникСсылка.ВидыКонтактнойИнформации",
"Значение": "ФактАдресКонтрагента"
},
"Представление": "Нижегородская область, город Нижний Новгород, проспект Ленина, дом 218",
"ЗначенияПолей": "<КонтактнаяИнформация xmlns=\"http://www.v8.1c.ru/ssl/contactinfo\" xmlns:xs=\"http://www.w3.org/2001/XMLSchema\" xmlns:xsi=\"http://www.w3.org/2001/XMLSchema-instance\" Представление=\"Нижегородская область, город Нижний Новгород, проспект Ленина, дом 218\"><Состав xsi:type=\"Адрес\" Страна=\"РОССИЯ\"><Состав xsi:type=\"АдресРФ\"/></Состав></КонтактнаяИнформация>",
"Страна": "РОССИЯ",
"ВидДляСписка": {
"Тип": "СправочникСсылка.ВидыКонтактнойИнформации",
"Значение": "ФактАдресКонтрагента"
},
"Значение": "{\r\n\"value\": \"Нижегородская область, город Нижний Новгород, проспект Ленина, дом 218\",\r\n\"comment\": \"\",\r\n\"type\": \"Адрес\",\r\n\"country\": \"РОССИЯ\",\r\n\"addressType\": \"ВСвободнойФорме\",\r\n\"countryCode\": \"643\",\r\n\"ZIPcode\": \"\",\r\n\"area\": \"\",\r\n\"areaType\": \"\",\r\n\"city\": \"\",\r\n\"cityType\": \"\",\r\n\"street\": \"\",\r\n\"streetType\": \"\",\r\n\"id\": \"\",\r\n\"areaCode\": \"\",\r\n\"areaId\": \"\",\r\n\"district\": \"\",\r\n\"districtType\": \"\",\r\n\"districtId\": \"\",\r\n\"munDistrict\": \"\",\r\n\"munDistrictType\": \"\",\r\n\"munDistrictId\": \"\",\r\n\"cityId\": \"\",\r\n\"settlement\": \"\",\r\n\"settlementType\": \"\",\r\n\"settlementId\": \"\",\r\n\"cityDistrict\": \"\",\r\n\"cityDistrictType\": \"\",\r\n\"cityDistrictId\": \"\",\r\n\"territory\": \"\",\r\n\"territoryType\": \"\",\r\n\"territoryId\": \"\",\r\n\"locality\": \"\",\r\n\"localityType\": \"\",\r\n\"localityId\": \"\",\r\n\"streetId\": \"\",\r\n\"houseType\": \"\",\r\n\"houseNumber\": \"\",\r\n\"houseId\": \"\",\r\n\"buildings\": [],\r\n\"apartments\": [],\r\n\"codeKLADR\": \"\",\r\n\"oktmo\": \"\",\r\n\"okato\": \"\",\r\n\"asInDocument\": \"\",\r\n\"ifnsFLCode\": \"\",\r\n\"ifnsULCode\": \"\",\r\n\"ifnsFLAreaCode\": \"\",\r\n\"ifnsULAreaCode\": \"\",\r\n\"stead\": \"\",\r\n\"steadId\": \"\"\r\n}"
}
]
},
{
"Ссылка": "31b94951-297f-11eb-9068-04d4c4acd0dd",
"Наименование": "Обычный покупатель",
"Код": "00-00000004",
"ЭтоГруппа": false,
"НаименованиеПолное": "Обычный покупатель",
"Тип": "ЛокальнаяТочка",
"Покупатель": "true",
"СтранаРегистрации": {
"Тип": "СправочникСсылка.СтраныМира",
"Значение": "Россия"
},
"ЮрФизЛицо": "ЮрЛицо",
"ДополнительныеРеквизиты": [],
"КонтактнаяИнформация": []
},
{
"Ссылка": "69d1b63c-2a24-11eb-9068-04d4c4acd0dd",
"Наименование": "Перевозчик(Газель)",
"Код": "00-00000005",
"ЭтоГруппа": false,
"НаименованиеПолное": "Перевозчик(Газель)",
"Тип": "ЛокальнаяСеть",
"Поставщик": "true",
"Перевозчик": "true",
"ИНН": "2215",
"КПП": "14825",
"СтранаРегистрации": {
"Тип": "СправочникСсылка.СтраныМира",
"Значение": "Россия"
},
"ОсновныеСведения": "ИНН 2215\nКПП 14825",
"ЮрФизЛицо": "ЮрЛицо",
"ДополнительныеРеквизиты": [],
"КонтактнаяИнформация": []
}
],
"ТочкиДоставки": [
{
"Ссылка": "31b9495b-297f-11eb-9068-04d4c4acd0dd",
"Наименование": "Ашан. Бесскидочный регион",
"Код": "00-00000001",
"Владелец": {
"Тип": "СправочникСсылка.Контрагенты",
"Значение": "31b9494b-297f-11eb-9068-04d4c4acd0dd"
},
"Регион": {
"Тип": "СправочникСсылка.к2БизнесРегионы",
"Значение": "1bda1388-2a66-11eb-9068-04d4c4acd0dd"
},
"КоличествоДнейДоставки": "1",
"СкладОтгрузки": {
"Тип": "СправочникСсылка.Склады",
"Значение": "1792edbb-297f-11eb-9068-04d4c4acd0dd"
},
"НаименованиеПолное": "Ашан. Бесскидочный регион",
"ГруппаПланированияОтгрузки": {
"Тип": "СправочникСсылка.к2ГруппыПланированияОтгрузки",
"Значение": "ОбеспечениеПоЗаказам"
},
"ОсновныеСведения": "Дни: Понедельник, Вторник, Среда, Четверг, Пятница, Суббота, Воскресенье\nНижегородская область, город Бор, улица Центральная, дом 11\n+73924885643",
"ДополнительныеРеквизиты": [],
"КонтактнаяИнформация": [
{
"Тип": "Адрес",
"Вид": {
"Тип": "СправочникСсылка.ВидыКонтактнойИнформации",
"Значение": "АдресТочкиДоставки"
},
"Представление": "Нижегородская область, город Бор, улица Центральная, дом 11",
"ЗначенияПолей": "<КонтактнаяИнформация xmlns=\"http://www.v8.1c.ru/ssl/contactinfo\" xmlns:xs=\"http://www.w3.org/2001/XMLSchema\" xmlns:xsi=\"http://www.w3.org/2001/XMLSchema-instance\" Представление=\"Нижегородская область, город Бор, улица Центральная, дом 11\"><Состав xsi:type=\"Адрес\" Страна=\"РОССИЯ\"><Состав xsi:type=\"АдресРФ\"/></Состав></КонтактнаяИнформация>",
"Страна": "РОССИЯ",
"ВидДляСписка": {
"Тип": "СправочникСсылка.ВидыКонтактнойИнформации",
"Значение": "АдресТочкиДоставки"
},
"Значение": "{\r\n\"value\": \"Нижегородская область, город Бор, улица Центральная, дом 11\",\r\n\"comment\": \"\",\r\n\"type\": \"Адрес\",\r\n\"country\": \"РОССИЯ\",\r\n\"addressType\": \"ВСвободнойФорме\",\r\n\"countryCode\": \"643\",\r\n\"ZIPcode\": \"\",\r\n\"area\": \"\",\r\n\"areaType\": \"\",\r\n\"city\": \"\",\r\n\"cityType\": \"\",\r\n\"street\": \"\",\r\n\"streetType\": \"\",\r\n\"id\": \"\",\r\n\"areaCode\": \"\",\r\n\"areaId\": \"\",\r\n\"district\": \"\",\r\n\"districtType\": \"\",\r\n\"districtId\": \"\",\r\n\"munDistrict\": \"\",\r\n\"munDistrictType\": \"\",\r\n\"munDistrictId\": \"\",\r\n\"cityId\": \"\",\r\n\"settlement\": \"\",\r\n\"settlementType\": \"\",\r\n\"settlementId\": \"\",\r\n\"cityDistrict\": \"\",\r\n\"cityDistrictType\": \"\",\r\n\"cityDistrictId\": \"\",\r\n\"territory\": \"\",\r\n\"territoryType\": \"\",\r\n\"territoryId\": \"\",\r\n\"locality\": \"\",\r\n\"localityType\": \"\",\r\n\"localityId\": \"\",\r\n\"streetId\": \"\",\r\n\"houseType\": \"\",\r\n\"houseNumber\": \"\",\r\n\"houseId\": \"\",\r\n\"buildings\": [],\r\n\"apartments\": [],\r\n\"codeKLADR\": \"\",\r\n\"oktmo\": \"\",\r\n\"okato\": \"\",\r\n\"asInDocument\": \"\",\r\n\"ifnsFLCode\": \"\",\r\n\"ifnsULCode\": \"\",\r\n\"ifnsFLAreaCode\": \"\",\r\n\"ifnsULAreaCode\": \"\",\r\n\"stead\": \"\",\r\n\"steadId\": \"\"\r\n}"
},
{
"Тип": "Телефон",
"Вид": {
"Тип": "СправочникСсылка.ВидыКонтактнойИнформации",
"Значение": "ТелефонТочкиДоставки"
},
"Представление": "+73924885643",
"ЗначенияПолей": "<КонтактнаяИнформация xmlns=\"http://www.v8.1c.ru/ssl/contactinfo\" xmlns:xs=\"http://www.w3.org/2001/XMLSchema\" xmlns:xsi=\"http://www.w3.org/2001/XMLSchema-instance\" Представление=\"+73924885643\"><Состав xsi:type=\"НомерТелефона\" КодСтраны=\"73924885643\" КодГорода=\"\" Номер=\"\" Добавочный=\"\"/></КонтактнаяИнформация>",
"НомерТелефона": "73924885643",
"ВидДляСписка": {
"Тип": "СправочникСсылка.ВидыКонтактнойИнформации",
"Значение": "ТелефонТочкиДоставки"
},
"Значение": "{\r\n\"value\": \"+73924885643\",\r\n\"comment\": \"\",\r\n\"type\": \"Телефон\",\r\n\"countryCode\": \"73924885643\",\r\n\"areaCode\": \"\",\r\n\"number\": \"\",\r\n\"extNumber\": \"\"\r\n}"
}
],
"ДниДоставки": [
{
"ДеньНедели": "Понедельник"
},
{
"ДеньНедели": "Вторник"
},
{
"ДеньНедели": "Среда"
},
{
"ДеньНедели": "Четверг"
},
{
"ДеньНедели": "Пятница"
},
{
"ДеньНедели": "Суббота"
},
{
"ДеньНедели": "Воскресенье"
}
],
"УточненияПоОтгрузке": [],
"УточненияПоДоставке": []
},
{
"Ссылка": "31b9495c-297f-11eb-9068-04d4c4acd0dd",
"Наименование": "Ашан. Скидочный регион",
"Код": "00-00000002",
"Владелец": {
"Тип": "СправочникСсылка.Контрагенты",
"Значение": "31b9494b-297f-11eb-9068-04d4c4acd0dd"
},
"Регион": {
"Тип": "СправочникСсылка.к2БизнесРегионы",
"Значение": "1bda1389-2a66-11eb-9068-04d4c4acd0dd"
},
"КоличествоДнейДоставки": "1",
"СкладОтгрузки": {
"Тип": "СправочникСсылка.Склады",
"Значение": "1792edbb-297f-11eb-9068-04d4c4acd0dd"
},
"НаименованиеПолное": "Ашан. Скидочный регион",
"ГруппаПланированияОтгрузки": {
"Тип": "СправочникСсылка.к2ГруппыПланированияОтгрузки",
"Значение": "ОбеспечениеПоЗаказам"
},
"ОсновныеСведения": "Дни: Понедельник, Вторник, Среда, Четверг, Пятница, Суббота, Воскресенье\nФактическая Нижегородская область, город Нижний Новгород, проспект Гагарина, дом 223\n+73294458863",
"ДополнительныеРеквизиты": [],
"КонтактнаяИнформация": [
{
"Тип": "Адрес",
"Вид": {
"Тип": "СправочникСсылка.ВидыКонтактнойИнформации",
"Значение": "АдресТочкиДоставки"
},
"Представление": "Фактическая Нижегородская область, город Нижний Новгород, проспект Гагарина, дом 223",
"ЗначенияПолей": "<КонтактнаяИнформация xmlns=\"http://www.v8.1c.ru/ssl/contactinfo\" xmlns:xs=\"http://www.w3.org/2001/XMLSchema\" xmlns:xsi=\"http://www.w3.org/2001/XMLSchema-instance\" Представление=\"Фактическая Нижегородская область, город Нижний Новгород, проспект Гагарина, дом 223\"><Состав xsi:type=\"Адрес\" Страна=\"РОССИЯ\"><Состав xsi:type=\"АдресРФ\"/></Состав></КонтактнаяИнформация>",
"Страна": "РОССИЯ",
"ВидДляСписка": {
"Тип": "СправочникСсылка.ВидыКонтактнойИнформации",
"Значение": "АдресТочкиДоставки"
},
"Значение": "{\r\n\"value\": \"Фактическая Нижегородская область, город Нижний Новгород, проспект Гагарина, дом 223\",\r\n\"comment\": \"\",\r\n\"type\": \"Адрес\",\r\n\"country\": \"РОССИЯ\",\r\n\"addressType\": \"ВСвободнойФорме\",\r\n\"countryCode\": \"643\",\r\n\"ZIPcode\": \"\",\r\n\"area\": \"\",\r\n\"areaType\": \"\",\r\n\"city\": \"\",\r\n\"cityType\": \"\",\r\n\"street\": \"\",\r\n\"streetType\": \"\",\r\n\"id\": \"\",\r\n\"areaCode\": \"\",\r\n\"areaId\": \"\",\r\n\"district\": \"\",\r\n\"districtType\": \"\",\r\n\"districtId\": \"\",\r\n\"munDistrict\": \"\",\r\n\"munDistrictType\": \"\",\r\n\"munDistrictId\": \"\",\r\n\"cityId\": \"\",\r\n\"settlement\": \"\",\r\n\"settlementType\": \"\",\r\n\"settlementId\": \"\",\r\n\"cityDistrict\": \"\",\r\n\"cityDistrictType\": \"\",\r\n\"cityDistrictId\": \"\",\r\n\"territory\": \"\",\r\n\"territoryType\": \"\",\r\n\"territoryId\": \"\",\r\n\"locality\": \"\",\r\n\"localityType\": \"\",\r\n\"localityId\": \"\",\r\n\"streetId\": \"\",\r\n\"houseType\": \"\",\r\n\"houseNumber\": \"\",\r\n\"houseId\": \"\",\r\n\"buildings\": [],\r\n\"apartments\": [],\r\n\"codeKLADR\": \"\",\r\n\"oktmo\": \"\",\r\n\"okato\": \"\",\r\n\"asInDocument\": \"\",\r\n\"ifnsFLCode\": \"\",\r\n\"ifnsULCode\": \"\",\r\n\"ifnsFLAreaCode\": \"\",\r\n\"ifnsULAreaCode\": \"\",\r\n\"stead\": \"\",\r\n\"steadId\": \"\"\r\n}"
},
{
"Тип": "Телефон",
"Вид": {
"Тип": "СправочникСсылка.ВидыКонтактнойИнформации",
"Значение": "ТелефонТочкиДоставки"
},
"Представление": "+73294458863",
"ЗначенияПолей": "<КонтактнаяИнформация xmlns=\"http://www.v8.1c.ru/ssl/contactinfo\" xmlns:xs=\"http://www.w3.org/2001/XMLSchema\" xmlns:xsi=\"http://www.w3.org/2001/XMLSchema-instance\" Представление=\"+73294458863\"><Состав xsi:type=\"НомерТелефона\" КодСтраны=\"73294458863\" КодГорода=\"\" Номер=\"\" Добавочный=\"\"/></КонтактнаяИнформация>",
"НомерТелефона": "73294458863",
"ВидДляСписка": {
"Тип": "СправочникСсылка.ВидыКонтактнойИнформации",
"Значение": "ТелефонТочкиДоставки"
},
"Значение": "{\r\n\"value\": \"+73294458863\",\r\n\"comment\": \"\",\r\n\"type\": \"Телефон\",\r\n\"countryCode\": \"73294458863\",\r\n\"areaCode\": \"\",\r\n\"number\": \"\",\r\n\"extNumber\": \"\"\r\n}"
}
],
"ДниДоставки": [
{
"ДеньНедели": "Понедельник"
},
{
"ДеньНедели": "Вторник"
},
{
"ДеньНедели": "Среда"
},
{
"ДеньНедели": "Четверг"
},
{
"ДеньНедели": "Пятница"
},
{
"ДеньНедели": "Суббота"
},
{
"ДеньНедели": "Воскресенье"
}
],
"УточненияПоОтгрузке": [],
"УточненияПоДоставке": []
},
{
"Ссылка": "69d1b64b-2a24-11eb-9068-04d4c4acd0dd",
"Наименование": "Точка доставки с зоной",
"Код": "00-00000006",
"Владелец": {
"Тип": "СправочникСсылка.Контрагенты",
"Значение": "31b9494b-297f-11eb-9068-04d4c4acd0dd"
},
"НаименованиеПолное": "Точка доставки с зоной",
"ОсновныеСведения": "Дни: Понедельник, Вторник, Среда, Четверг, Пятница, Суббота, Воскресенье",
"ДополнительныеРеквизиты": [],
"КонтактнаяИнформация": [],
"ДниДоставки": [
{
"ДеньНедели": "Понедельник"
},
{
"ДеньНедели": "Вторник"
},
{
"ДеньНедели": "Среда"
},
{
"ДеньНедели": "Четверг"
},
{
"ДеньНедели": "Пятница"
},
{
"ДеньНедели": "Суббота"
},
{
"ДеньНедели": "Воскресенье"
}
],
"УточненияПоОтгрузке": [],
"УточненияПоДоставке": []
},
{
"Ссылка": "31b9495d-297f-11eb-9068-04d4c4acd0dd",
"Наименование": "Точка доставки для 5ка. Без региона",
"Код": "00-00000003",
"Владелец": {
"Тип": "СправочникСсылка.Контрагенты",
"Значение": "31b9494d-297f-11eb-9068-04d4c4acd0dd"
},
"КоличествоДнейДоставки": "1",
"СкладОтгрузки": {
"Тип": "СправочникСсылка.Склады",
"Значение": "1792edbb-297f-11eb-9068-04d4c4acd0dd"
},
"НаименованиеПолное": "Точка доставки для 5ка. Без региона",
"ГруппаПланированияОтгрузки": {
"Тип": "СправочникСсылка.к2ГруппыПланированияОтгрузки",
"Значение": "ОбеспечениеПоЗаказам"
},
"ОсновныеСведения": "Дни: Понедельник, Вторник, Среда, Четверг, Пятница, Суббота, Воскресенье\nНижегородская область, город Нижний Новгород, проспект Ленина, дом 13\n+73274455663",
"ДополнительныеРеквизиты": [],
"КонтактнаяИнформация": [
{
"Тип": "Адрес",
"Вид": {
"Тип": "СправочникСсылка.ВидыКонтактнойИнформации",
"Значение": "АдресТочкиДоставки"
},
"Представление": "Нижегородская область, город Нижний Новгород, проспект Ленина, дом 13",
"ЗначенияПолей": "<КонтактнаяИнформация xmlns=\"http://www.v8.1c.ru/ssl/contactinfo\" xmlns:xs=\"http://www.w3.org/2001/XMLSchema\" xmlns:xsi=\"http://www.w3.org/2001/XMLSchema-instance\" Представление=\"Нижегородская область, город Нижний Новгород, проспект Ленина, дом 13\"><Состав xsi:type=\"Адрес\" Страна=\"РОССИЯ\"><Состав xsi:type=\"АдресРФ\"/></Состав></КонтактнаяИнформация>",
"Страна": "РОССИЯ",
"ВидДляСписка": {
"Тип": "СправочникСсылка.ВидыКонтактнойИнформации",
"Значение": "АдресТочкиДоставки"
},
"Значение": "{\r\n\"value\": \"Нижегородская область, город Нижний Новгород, проспект Ленина, дом 13\",\r\n\"comment\": \"\",\r\n\"type\": \"Адрес\",\r\n\"country\": \"РОССИЯ\",\r\n\"addressType\": \"ВСвободнойФорме\",\r\n\"countryCode\": \"643\",\r\n\"ZIPcode\": \"\",\r\n\"area\": \"\",\r\n\"areaType\": \"\",\r\n\"city\": \"\",\r\n\"cityType\": \"\",\r\n\"street\": \"\",\r\n\"streetType\": \"\",\r\n\"id\": \"\",\r\n\"areaCode\": \"\",\r\n\"areaId\": \"\",\r\n\"district\": \"\",\r\n\"districtType\": \"\",\r\n\"districtId\": \"\",\r\n\"munDistrict\": \"\",\r\n\"munDistrictType\": \"\",\r\n\"munDistrictId\": \"\",\r\n\"cityId\": \"\",\r\n\"settlement\": \"\",\r\n\"settlementType\": \"\",\r\n\"settlementId\": \"\",\r\n\"cityDistrict\": \"\",\r\n\"cityDistrictType\": \"\",\r\n\"cityDistrictId\": \"\",\r\n\"territory\": \"\",\r\n\"territoryType\": \"\",\r\n\"territoryId\": \"\",\r\n\"locality\": \"\",\r\n\"localityType\": \"\",\r\n\"localityId\": \"\",\r\n\"streetId\": \"\",\r\n\"houseType\": \"\",\r\n\"houseNumber\": \"\",\r\n\"houseId\": \"\",\r\n\"buildings\": [],\r\n\"apartments\": [],\r\n\"codeKLADR\": \"\",\r\n\"oktmo\": \"\",\r\n\"okato\": \"\",\r\n\"asInDocument\": \"\",\r\n\"ifnsFLCode\": \"\",\r\n\"ifnsULCode\": \"\",\r\n\"ifnsFLAreaCode\": \"\",\r\n\"ifnsULAreaCode\": \"\",\r\n\"stead\": \"\",\r\n\"steadId\": \"\"\r\n}"
},
{
"Тип": "Телефон",
"Вид": {
"Тип": "СправочникСсылка.ВидыКонтактнойИнформации",
"Значение": "ТелефонТочкиДоставки"
},
"Представление": "+73274455663",
"ЗначенияПолей": "<КонтактнаяИнформация xmlns=\"http://www.v8.1c.ru/ssl/contactinfo\" xmlns:xs=\"http://www.w3.org/2001/XMLSchema\" xmlns:xsi=\"http://www.w3.org/2001/XMLSchema-instance\" Представление=\"+73274455663\"><Состав xsi:type=\"НомерТелефона\" КодСтраны=\"73274455663\" КодГорода=\"\" Номер=\"\" Добавочный=\"\"/></КонтактнаяИнформация>",
"НомерТелефона": "73274455663",
"ВидДляСписка": {
"Тип": "СправочникСсылка.ВидыКонтактнойИнформации",
"Значение": "ТелефонТочкиДоставки"
},
"Значение": "{\r\n\"value\": \"+73274455663\",\r\n\"comment\": \"\",\r\n\"type\": \"Телефон\",\r\n\"countryCode\": \"73274455663\",\r\n\"areaCode\": \"\",\r\n\"number\": \"\",\r\n\"extNumber\": \"\"\r\n}"
}
],
"ДниДоставки": [
{
"ДеньНедели": "Понедельник"
},
{
"ДеньНедели": "Вторник"
},
{
"ДеньНедели": "Среда"
},
{
"ДеньНедели": "Четверг"
},
{
"ДеньНедели": "Пятница"
},
{
"ДеньНедели": "Суббота"
},
{
"ДеньНедели": "Воскресенье"
}
],
"УточненияПоОтгрузке": [],
"УточненияПоДоставке": []
},
{
"Ссылка": "31b9495e-297f-11eb-9068-04d4c4acd0dd",
"Наименование": "Обычная точка доставки. Без региона",
"Код": "00-00000004",
"Владелец": {
"Тип": "СправочникСсылка.Контрагенты",
"Значение": "31b94951-297f-11eb-9068-04d4c4acd0dd"
},
"КоличествоДнейДоставки": "1",
"СкладОтгрузки": {
"Тип": "СправочникСсылка.Склады",
"Значение": "1792edbb-297f-11eb-9068-04d4c4acd0dd"
},
"НаименованиеПолное": "Обычная точка доставки. Без региона",
"ГруппаПланированияОтгрузки": {
"Тип": "СправочникСсылка.к2ГруппыПланированияОтгрузки",
"Значение": "ОбеспечениеПоЗаказам"
},
"ОсновныеСведения": "Дни: Понедельник, Вторник, Среда, Четверг, Пятница, Суббота, Воскресенье\nНижегородская область, город Нижний Новгород, ул. Верхнепечерская, дом 21\n+71294778863",
"ДополнительныеРеквизиты": [],
"КонтактнаяИнформация": [
{
"Тип": "Адрес",
"Вид": {
"Тип": "СправочникСсылка.ВидыКонтактнойИнформации",
"Значение": "АдресТочкиДоставки"
},
"Представление": "Нижегородская область, город Нижний Новгород, ул. Верхнепечерская, дом 21",
"ЗначенияПолей": "<КонтактнаяИнформация xmlns=\"http://www.v8.1c.ru/ssl/contactinfo\" xmlns:xs=\"http://www.w3.org/2001/XMLSchema\" xmlns:xsi=\"http://www.w3.org/2001/XMLSchema-instance\" Представление=\"Нижегородская область, город Нижний Новгород, ул. Верхнепечерская, дом 21\"><Состав xsi:type=\"Адрес\" Страна=\"РОССИЯ\"><Состав xsi:type=\"АдресРФ\"/></Состав></КонтактнаяИнформация>",
"Страна": "РОССИЯ",
"ВидДляСписка": {
"Тип": "СправочникСсылка.ВидыКонтактнойИнформации",
"Значение": "АдресТочкиДоставки"
},
"Значение": "{\r\n\"value\": \"Нижегородская область, город Нижний Новгород, ул. Верхнепечерская, дом 21\",\r\n\"comment\": \"\",\r\n\"type\": \"Адрес\",\r\n\"country\": \"РОССИЯ\",\r\n\"addressType\": \"ВСвободнойФорме\",\r\n\"countryCode\": \"643\",\r\n\"ZIPcode\": \"\",\r\n\"area\": \"\",\r\n\"areaType\": \"\",\r\n\"city\": \"\",\r\n\"cityType\": \"\",\r\n\"street\": \"\",\r\n\"streetType\": \"\",\r\n\"id\": \"\",\r\n\"areaCode\": \"\",\r\n\"areaId\": \"\",\r\n\"district\": \"\",\r\n\"districtType\": \"\",\r\n\"districtId\": \"\",\r\n\"munDistrict\": \"\",\r\n\"munDistrictType\": \"\",\r\n\"munDistrictId\": \"\",\r\n\"cityId\": \"\",\r\n\"settlement\": \"\",\r\n\"settlementType\": \"\",\r\n\"settlementId\": \"\",\r\n\"cityDistrict\": \"\",\r\n\"cityDistrictType\": \"\",\r\n\"cityDistrictId\": \"\",\r\n\"territory\": \"\",\r\n\"territoryType\": \"\",\r\n\"territoryId\": \"\",\r\n\"locality\": \"\",\r\n\"localityType\": \"\",\r\n\"localityId\": \"\",\r\n\"streetId\": \"\",\r\n\"houseType\": \"\",\r\n\"houseNumber\": \"\",\r\n\"houseId\": \"\",\r\n\"buildings\": [],\r\n\"apartments\": [],\r\n\"codeKLADR\": \"\",\r\n\"oktmo\": \"\",\r\n\"okato\": \"\",\r\n\"asInDocument\": \"\",\r\n\"ifnsFLCode\": \"\",\r\n\"ifnsULCode\": \"\",\r\n\"ifnsFLAreaCode\": \"\",\r\n\"ifnsULAreaCode\": \"\",\r\n\"stead\": \"\",\r\n\"steadId\": \"\"\r\n}"
},
{
"Тип": "Телефон",
"Вид": {
"Тип": "СправочникСсылка.ВидыКонтактнойИнформации",
"Значение": "ТелефонТочкиДоставки"
},
"Представление": "+71294778863",
"ЗначенияПолей": "<КонтактнаяИнформация xmlns=\"http://www.v8.1c.ru/ssl/contactinfo\" xmlns:xs=\"http://www.w3.org/2001/XMLSchema\" xmlns:xsi=\"http://www.w3.org/2001/XMLSchema-instance\" Представление=\"+71294778863\"><Состав xsi:type=\"НомерТелефона\" КодСтраны=\"71294778863\" КодГорода=\"\" Номер=\"\" Добавочный=\"\"/></КонтактнаяИнформация>",
"НомерТелефона": "71294778863",
"ВидДляСписка": {
"Тип": "СправочникСсылка.ВидыКонтактнойИнформации",
"Значение": "ТелефонТочкиДоставки"
},
"Значение": "{\r\n\"value\": \"+71294778863\",\r\n\"comment\": \"\",\r\n\"type\": \"Телефон\",\r\n\"countryCode\": \"71294778863\",\r\n\"areaCode\": \"\",\r\n\"number\": \"\",\r\n\"extNumber\": \"\"\r\n}"
}
],
"ДниДоставки": [
{
"ДеньНедели": "Понедельник"
},
{
"ДеньНедели": "Вторник"
},
{
"ДеньНедели": "Среда"
},
{
"ДеньНедели": "Четверг"
},
{
"ДеньНедели": "Пятница"
},
{
"ДеньНедели": "Суббота"
},
{
"ДеньНедели": "Воскресенье"
}
],
"УточненияПоОтгрузке": [],
"УточненияПоДоставке": []
},
{
"Ссылка": "31b9495f-297f-11eb-9068-04d4c4acd0dd",
"Наименование": "Точка доставки для Перекрестка",
"Код": "00-00000005",
"Владелец": {
"Тип": "СправочникСсылка.Контрагенты",
"Значение": "31b9494f-297f-11eb-9068-04d4c4acd0dd"
},
"СкладОтгрузки": {
"Тип": "СправочникСсылка.Склады",
"Значение": "1792edbb-297f-11eb-9068-04d4c4acd0dd"
},
"НаименованиеПолное": "Точка доставки для Перекрестка",
"ОсновныеСведения": "Дни: Понедельник, Вторник, Среда, Четверг, Пятница, Суббота, Воскресенье",
"ДополнительныеРеквизиты": [],
"КонтактнаяИнформация": [],
"ДниДоставки": [
{
"ДеньНедели": "Понедельник"
},
{
"ДеньНедели": "Вторник"
},
{
"ДеньНедели": "Среда"
},
{
"ДеньНедели": "Четверг"
},
{
"ДеньНедели": "Пятница"
},
{
"ДеньНедели": "Суббота"
},
{
"ДеньНедели": "Воскресенье"
}
],
"УточненияПоОтгрузке": [],
"УточненияПоДоставке": []
}
],
"СоглашенияСКлиентами": [
{
"Ссылка": "45b58471-2a26-11eb-9068-04d4c4acd0dd",
"Наименование": "Соглашение для Обычного покупателя",
"Контрагент": {
"Тип": "СправочникСсылка.Контрагенты",
"Значение": "31b94951-297f-11eb-9068-04d4c4acd0dd"
},
"Организация": {
"Тип": "СправочникСсылка.Организации",
"Значение": {
"Наименование": "Организация"
}
},
"Валюта": {
"Тип": "СправочникСсылка.Валюты",
"Значение": {
"Код": "643",
"Наименование": "RUB"
}
},
"ВидЦен": {
"Тип": "СправочникСсылка.ВидыЦен",
"Значение": "29dc35ff-2a26-11eb-9068-04d4c4acd0dd"
},
"ЦенаВключаетНДС": "true",
"Налогообложение": "ОблагаетсяНДС",
"МоментОпределенияЦены": "НаДатуЗаказа",
"Статус": "Действует",
"ДатаНачалаДействия": "2019-05-09T00:00:00",
"ДатаОкончанияДействия": "2025-09-09T00:00:00",
"НаименованиеДляПечати": "Соглашение для Обычного покупателя",
"ВидСоглашения": "СПокупателем",
"ЦеновыеУточнения": [],
"КоэффициентыВРасчетеСтоимости": []
},
{
"Ссылка": "45b58472-2a26-11eb-9068-04d4c4acd0dd",
"Наименование": "Соглашение для Ашана по региону без скидки",
"Контрагент": {
"Тип": "СправочникСсылка.Контрагенты",
"Значение": "31b9494b-297f-11eb-9068-04d4c4acd0dd"
},
"Организация": {
"Тип": "СправочникСсылка.Организации",
"Значение": {
"Наименование": "Организация"
}
},
"Регион": {
"Тип": "СправочникСсылка.к2БизнесРегионы",
"Значение": "1bda1388-2a66-11eb-9068-04d4c4acd0dd"
},
"Валюта": {
"Тип": "СправочникСсылка.Валюты",
"Значение": {
"Код": "643",
"Наименование": "RUB"
}
},
"ВидЦен": {
"Тип": "СправочникСсылка.ВидыЦен",
"Значение": "29dc3601-2a26-11eb-9068-04d4c4acd0dd"
},
"ЦенаВключаетНДС": "true",
"Налогообложение": "ОблагаетсяНДС",
"МоментОпределенияЦены": "НаДатуЗаказа",
"Статус": "Действует",
"ДатаНачалаДействия": "2019-05-09T00:00:00",
"ДатаОкончанияДействия": "2025-09-09T00:00:00",
"НаименованиеДляПечати": "Соглашение для Ашана по региону без скидки",
"ВидСоглашения": "СПокупателем",
"ЦеновыеУточнения": [],
"КоэффициентыВРасчетеСтоимости": []
},
{
"Ссылка": "45b58473-2a26-11eb-9068-04d4c4acd0dd",
"Наименование": "Соглашение для Ашана по Скидочному региону",
"Контрагент": {
"Тип": "СправочникСсылка.Контрагенты",
"Значение": "31b9494b-297f-11eb-9068-04d4c4acd0dd"
},
"Организация": {
"Тип": "СправочникСсылка.Организации",
"Значение": {
"Наименование": "Организация"
}
},
"Регион": {
"Тип": "СправочникСсылка.к2БизнесРегионы",
"Значение": "1bda1389-2a66-11eb-9068-04d4c4acd0dd"
},
"Валюта": {
"Тип": "СправочникСсылка.Валюты",
"Значение": {
"Код": "643",
"Наименование": "RUB"
}
},
"ВидЦен": {
"Тип": "СправочникСсылка.ВидыЦен",
"Значение": "29dc3601-2a26-11eb-9068-04d4c4acd0dd"
},
"ЦенаВключаетНДС": "true",
"Налогообложение": "ОблагаетсяНДС",
"МоментОпределенияЦены": "НаДатуЗаказа",
"Статус": "Действует",
"ДатаНачалаДействия": "2019-05-09T00:00:00",
"ДатаОкончанияДействия": "2025-09-09T00:00:00",
"НаименованиеДляПечати": "Соглашение для Ашана по Скидочному региону",
"ВидСоглашения": "СПокупателем",
"ЦеновыеУточнения": [
{
"ТоварнаяКатегория": {
"Тип": "СправочникСсылка.к2ТоварныеКатегории",
"Значение": "026bdb77-297f-11eb-9068-04d4c4acd0dd"
},
"ПроцентСкидки": "7.77"
},
{
"ТоварнаяКатегория": {
"Тип": "СправочникСсылка.к2ТоварныеКатегории",
"Значение": "026bdb78-297f-11eb-9068-04d4c4acd0dd"
},
"ПроцентСкидки": "7.77"
},
{
"ТоварнаяКатегория": {
"Тип": "СправочникСсылка.к2ТоварныеКатегории",
"Значение": "026bdb79-297f-11eb-9068-04d4c4acd0dd"
},
"ПроцентСкидки": "7.77"
},
{
"ТоварнаяКатегория": {
"Тип": "СправочникСсылка.к2ТоварныеКатегории",
"Значение": "026bdb7b-297f-11eb-9068-04d4c4acd0dd"
},
"ПроцентСкидки": "7.77"
}
],
"КоэффициентыВРасчетеСтоимости": []
},
{
"Ссылка": "45b58474-2a26-11eb-9068-04d4c4acd0dd",
"Наименование": "Соглашение для 5ка",
"Контрагент": {
"Тип": "СправочникСсылка.Контрагенты",
"Значение": "31b9494d-297f-11eb-9068-04d4c4acd0dd"
},
"Организация": {
"Тип": "СправочникСсылка.Организации",
"Значение": {
"Наименование": "Организация"
}
},
"Валюта": {
"Тип": "СправочникСсылка.Валюты",
"Значение": {
"Код": "643",
"Наименование": "RUB"
}
},
"ВидЦен": {
"Тип": "СправочникСсылка.ВидыЦен",
"Значение": "29dc3602-2a26-11eb-9068-04d4c4acd0dd"
},
"Налогообложение": "ОблагаетсяНДС",
"МоментОпределенияЦены": "НаДатуОтгрузки",
"Статус": "Действует",
"ДатаНачалаДействия": "2019-05-09T00:00:00",
"ДатаОкончанияДействия": "2025-09-09T00:00:00",
"НаименованиеДляПечати": "Соглашение для 5ка",
"ВидСоглашения": "СПокупателем",
"ЦеновыеУточнения": [],
"КоэффициентыВРасчетеСтоимости": []
},
{
"Ссылка": "45b58475-2a26-11eb-9068-04d4c4acd0dd",
"Наименование": "Соглашение для Перекресток",
"Контрагент": {
"Тип": "СправочникСсылка.Контрагенты",
"Значение": "31b9494f-297f-11eb-9068-04d4c4acd0dd"
},
"Организация": {
"Тип": "СправочникСсылка.Организации",
"Значение": {
"Наименование": "Организация"
}
},
"Валюта": {
"Тип": "СправочникСсылка.Валюты",
"Значение": {
"Код": "643",
"Наименование": "RUB"
}
},
"ВидЦен": {
"Тип": "СправочникСсылка.ВидыЦен",
"Значение": "29dc3603-2a26-11eb-9068-04d4c4acd0dd"
},
"ЦенаВключаетНДС": "true",
"Налогообложение": "НеОблагаетсяНДС",
"МоментОпределенияЦены": "НаДатуЗаказа",
"Статус": "Действует",
"ДатаНачалаДействия": "2019-05-09T00:00:00",
"ДатаОкончанияДействия": "2025-09-09T00:00:00",
"НаименованиеДляПечати": "Соглашение для Перекресток",
"ВидСоглашения": "СПокупателем",
"ЦеновыеУточнения": [],
"КоэффициентыВРасчетеСтоимости": []
},
{
"Ссылка": "8a786af2-2ef4-11eb-9068-04d4c4acd0dd",
"Наименование": "Соглашение Обычный покупатель(Организация2)",
"Контрагент": {
"Тип": "СправочникСсылка.Контрагенты",
"Значение": "31b94951-297f-11eb-9068-04d4c4acd0dd"
},
"Организация": {
"Тип": "СправочникСсылка.Организации",
"Значение": {
"Наименование": "Организация2"
}
},
"Валюта": {
"Тип": "СправочникСсылка.Валюты",
"Значение": {
"Код": "643",
"Наименование": "RUB"
}
},
"ВидЦен": {
"Тип": "СправочникСсылка.ВидыЦен",
"Значение": "29dc35ff-2a26-11eb-9068-04d4c4acd0dd"
},
"ЦенаВключаетНДС": "true",
"Налогообложение": "ОблагаетсяНДС",
"МоментОпределенияЦены": "НаДатуЗаказа",
"Статус": "Действует",
"ДатаНачалаДействия": "2019-05-09T00:00:00",
"ДатаОкончанияДействия": "2025-09-09T00:00:00",
"НаименованиеДляПечати": "Соглашение Обычный покупатель(Организация2)",
"ВидСоглашения": "СПокупателем",
"ЦеновыеУточнения": [],
"КоэффициентыВРасчетеСтоимости": []
}
],
"ВидыЦен": [
{
"Ссылка": "29dc35fe-2a26-11eb-9068-04d4c4acd0dd",
"Наименование": "Базовый для зависимых",
"Код": 5,
"СпособЗадания": "РучнойВвод",
"ЦенаВключаетНДС": "true",
"ДоступныУточненияВСоглашениях": "true",
"ВалютаЦены": {
"Тип": "СправочникСсылка.Валюты",
"Значение": {
"Код": "643",
"Наименование": "RUB"
}
},
"Уточнения": []
},
{
"Ссылка": "29dc37fe-2a26-11eb-9068-04d4c4acd0dd",
"Наименование": "Для проверки суммы в перемещении - цена без НДС",
"Код": 12,
"СпособЗадания": "РучнойВвод",
"ЦенаВключаетНДС": "false",
"ДоступныУточненияВСоглашениях": "true",
"ВалютаЦены": {
"Тип": "СправочникСсылка.Валюты",
"Значение": {
"Код": "643",
"Наименование": "RUB"
}
},
"Уточнения": []
},
{
"Ссылка": "29dc35ff-2a26-11eb-9068-04d4c4acd0dd",
"Наименование": "Зависимый 1",
"Код": 6,
"СпособЗадания": "НаценкаНаВидЦены",
"БазовыйВидЦены": {
"Тип": "СправочникСсылка.ВидыЦен",
"Значение": "29dc35fe-2a26-11eb-9068-04d4c4acd0dd"
},
"ЦенаВключаетНДС": "true",
"ПроцентСкидки": "10",
"ДоступныУточненияВСоглашениях": "true",
"ВалютаЦены": {
"Тип": "СправочникСсылка.Валюты",
"Значение": {
"Код": "643",
"Наименование": "RUB"
}
},
"Уточнения": [
{
"ТоварнаяКатегория": {
"Тип": "СправочникСсылка.к2ТоварныеКатегории",
"Значение": "026bdb77-297f-11eb-9068-04d4c4acd0dd"
},
"ПроцентСкидки": "15"
}
]
},
{
"Ссылка": "29dc36ff-2a26-11eb-9068-04d4c4acd0dd",
"Наименование": "Зависимый 2",
"Код": 7,
"СпособЗадания": "НаценкаНаВидЦены",
"БазовыйВидЦены": {
"Тип": "СправочникСсылка.ВидыЦен",
"Значение": "29dc35fe-2a26-11eb-9068-04d4c4acd0dd"
},
"ЦенаВключаетНДС": "true",
"ПроцентСкидки": "15",
"ДоступныУточненияВСоглашениях": "true",
"ВалютаЦены": {
"Тип": "СправочникСсылка.Валюты",
"Значение": {
"Код": "643",
"Наименование": "RUB"
}
},
"Уточнения": [
{
"ТоварнаяКатегория": {
"Тип": "СправочникСсылка.к2ТоварныеКатегории",
"Значение": "026bdb78-297f-11eb-9068-04d4c4acd0dd"
},
"ПроцентСкидки": "20"
}
]
},
{
"Ссылка": "29dc3601-2a26-11eb-9068-04d4c4acd0dd",
"Наименование": "Ашан",
"Код": 8,
"СпособЗадания": "РучнойВвод",
"ЦенаВключаетНДС": "true",
"ДоступныУточненияВСоглашениях": "true",
"ВалютаЦены": {
"Тип": "СправочникСсылка.Валюты",
"Значение": {
"Код": "643",
"Наименование": "RUB"
}
},
"Уточнения": []
},
{
"Ссылка": "29dc3602-2a26-11eb-9068-04d4c4acd0dd",
"Наименование": "5ка",
"Код": 9,
"СпособЗадания": "РучнойВвод",
"ДоступныУточненияВСоглашениях": "true",
"ВалютаЦены": {
"Тип": "СправочникСсылка.Валюты",
"Значение": {
"Код": "643",
"Наименование": "RUB"
}
},
"Уточнения": []
},
{
"Ссылка": "29dc3603-2a26-11eb-9068-04d4c4acd0dd",
"Наименование": "Перекресток",
"Код": 10,
"СпособЗадания": "РучнойВвод",
"ЦенаВключаетНДС": "true",
"ДоступныУточненияВСоглашениях": "true",
"ВалютаЦены": {
"Тип": "СправочникСсылка.Валюты",
"Значение": {
"Код": "643",
"Наименование": "RUB"
}
},
"Уточнения": []
},
{
"Ссылка": "29dc3604-2a26-11eb-9068-04d4c4acd0dd",
"Наименование": "Базовый",
"Код": 4,
"СпособЗадания": "РучнойВвод",
"ЦенаВключаетНДС": "true",
"ДоступныУточненияВСоглашениях": "true",
"ВалютаЦены": {
"Тип": "СправочникСсылка.Валюты",
"Значение": {
"Код": "643",
"Наименование": "RUB"
}
},
"Уточнения": []
}
],
"БизнесРегионы": [
{
"Ссылка": "1bda1388-2a66-11eb-9068-04d4c4acd0dd",
"Наименование": "Бесскидочный регион",
"Код": "000000001"
},
{
"Ссылка": "1bda1389-2a66-11eb-9068-04d4c4acd0dd",
"Наименование": "Скидочный регион",
"Код": "000000002"
}
]
}