﻿														
Движения документа Реализация товаров *														
														
Регистр накопления "Просроченная задолженность" (3)									
Стандартные реквизиты			Измерения						Ресурсы
Вид движения	Активность	Период	Организация	Контрагент	Соглашение	Объект расчетов	Валюта	Дата планового погашения	Сумма
Приход	Да	19.03.2021 23:59:59	Нижегородский МК	Лента	Соглашение с Лентой с 01.01.2021	Соглашение с Лентой с 01.01.2021	RUB	19.03.2021	3 750,00
Приход	Да	18.03.2021 23:59:59	Нижегородский МК	Лента	Соглашение с Лентой с 01.01.2021	Соглашение с Лентой с 01.01.2021	RUB	18.03.2021	3 352,50
Приход	Да	22.03.2021 23:59:59	Нижегородский МК	Лента	Соглашение с Лентой с 01.01.2021	Соглашение с Лентой с 01.01.2021	RUB	22.03.2021	33 922,50

Регистр накопления "Расчеты с контрагентами" (3)										
Стандартные реквизиты			Измерения					Ресурсы	Реквизиты	
Вид движения	Активность	Период	Организация	Контрагент	Соглашение	Объект расчетов	Валюта	Сумма	Дата платежа	Плановая дата погашения
Приход	Да	17.03.2021 *	Нижегородский МК	Лента	Соглашение с Лентой с 01.01.2021	Соглашение с Лентой с 01.01.2021	RUB	3 750,00	17.03.2021 *	19.03.2021 23:59:59
Приход	Да	17.03.2021 *	Нижегородский МК	Лента	Соглашение с Лентой с 01.01.2021	Соглашение с Лентой с 01.01.2021	RUB	33 922,50	17.03.2021 *	22.03.2021 23:59:59
Приход	Да	17.03.2021 *	Нижегородский МК	Лента	Соглашение с Лентой с 01.01.2021	Соглашение с Лентой с 01.01.2021	RUB	3 352,50	17.03.2021 *	18.03.2021 23:59:59
																						
Регистр накопления "Реализации товаров" (3)												
Стандартные реквизиты		Измерения						Ресурсы				Реквизиты
Активность	Период	Заказ клиента	Аналитика учета номенклатуры	Аналитика учета по партнерам	Упаковка	Подразделение	Склад	Количество упаковок	Количество	Сумма	Вес	Цена
Да	17.03.2021 *	Заказ клиента * от 15.03.2021 [Создан]	Молоко 3,2 %,,000001 до 31.03.2021 0:00:00	Нижегородский МК,Лента,Лента,Лента		Бухгалтерия	Склад готовой продукции	150,000	150,000	7 500,00	150,000	50,00
Да	17.03.2021 *	Заказ клиента * от 15.03.2021 [Создан]	Кефир,,000001 до 31.03.2021 0:00:00	Нижегородский МК,Лента,Лента,Лента		Бухгалтерия	Склад готовой продукции	165,000	165,000	10 725,00	165,000	65,00
Да	17.03.2021 *	Заказ клиента * от 15.03.2021 [Создан]	Творог,,000001 до 31.03.2021 0:00:00	Нижегородский МК,Лента,Лента,Лента		Бухгалтерия	Склад готовой продукции	190,000	190,000	22 800,00	190,000	120,00

Регистр накопления "Товары к оформлению" (3)										
Стандартные реквизиты			Измерения						Ресурсы	Реквизиты
Вид движения	Активность	Период	Заказ	Склад	Номенклатура	Характеристика	Серия	Задание на доставку	Количество	Причина расхождения
Расход	Да	17.03.2021 *	Заказ клиента * от 15.03.2021 [Создан]	Склад готовой продукции	Молоко 3,2 %		000001 до 31.03.2021 0:00:00		150,000	
Расход	Да	17.03.2021 *	Заказ клиента * от 15.03.2021 [Создан]	Склад готовой продукции	Кефир		000001 до 31.03.2021 0:00:00		165,000	
Расход	Да	17.03.2021 *	Заказ клиента * от 15.03.2021 [Создан]	Склад готовой продукции	Творог		000001 до 31.03.2021 0:00:00		190,000	