﻿											
КАССА за 01.04.2021					Лист 1	КАССА за 01.04.2021					Лист 1
											
Номер документа	От кого получено или кому выдано			"Приход,
руб. коп."	"Расход,
руб. коп."	Номер документа	От кого получено или кому выдано			"Приход,
руб. коп."	"Расход,
руб. коп."
1	2			4	5	1	2			4	5
Остаток на начало дня				52 800=00	Х	Остаток на начало дня				52 800=00	Х
	Приходный кассовый ордер * от 1 апреля 2021 г.			7 000=00			Приходный кассовый ордер * от 1 апреля 2021 г.			7 000=00	
Итого за день				7 000=00		Итого за день				7 000=00	
Остаток на конец дня				59 800=00	Х	Остаток на конец дня				59 800=00	Х
											
											
Кассир						Кассир					
	подпись		расшифровка подписи				подпись		расшифровка подписи		
Записи в кассовой книге проверил и документы в количестве						Записи в кассовой книге проверил и документы в количестве					
1 документов кассовых операций						1 документов кассовых операций					
											
Бухгалтер			Веселов М.			Бухгалтер			Веселов М.		
	подпись		расшифровка подписи				подпись		расшифровка подписи		
											