﻿								"Унифицированная форма № ТОРГ-13
Утверждена постановлением Госкомстата России от 25.12.98 № 132"
								Коды
							Форма по ОКУД	0330213
	ООО "Организация", ИНН 9999115007, 117342, Москва г, Севастопольский пр-кт, дом № 56, тел.: +79101234567						по ОКПО	12345678
		организация					Вид деятельности по ОКДП	
			Номер документа	Дата составления			Вид операции	
		Н А К Л А Д Н А Я	*	*				
		на внутреннее перемещение, передачу товаров, тары						
								
	Отправитель		Получатель			Корреспондирующий счет		
	структурное подразделение	вид деятельности	структурное подразделение		вид деятельности	счет, субсчет	код аналитического учета	
	Сырная ГП		Склад готовой продукции					
											Страница 1
	Товар, тара		Сорт	Единица измерения		Отпущено				По учетным ценам	
	наименование, характеристика	код		наиме- нование	код по ОКЕИ	Количество		Масса		цена, руб.коп.	сумма, руб.коп.
						в одном месте	мест, штук	брутто	нетто		
	1	2	3	4	5	6	7	8	9	10	11
	Сыр Адыгейский (<Без маркировки>)	*		кг	166		10,000	10,000	10,000	100,00	1 000,00
						Итого	10,000	10,000	10,000	Х	1 000,00
						Всего по накладной	10,000	10,000	10,000	Х	1 000,00
									
	Отпустил	Кладовщик				Ответственный за склад Петров Петр		товар и тару по количеству и надлежащего качества	
		должность		подпись		расшифровка подписи			
									
	на сумму	Одна тысяча рублей					руб.	00	коп.
		прописью							
									
	Получил								
		должность		подпись		расшифровка подписи			
									