﻿														
Движения документа План потребностей на [02.02.2019 - 09.02.2019] *														
														
Регистр накопления "Обеспечение товаров" (8)														
Стандартные реквизиты			Измерения						Ресурсы	Реквизиты				
Вид движения	Активность	Период	Организация	Номенклатура	Характеристика	Склад	Дата выпуска	Волна	Количество	Тип обеспечения	Схема обеспечения	Код строки	Склад материалов	Спецификация
Расход	Да	02.02.2019 0:00:00		Сервелат Финский в/у	Маркировка нашего завода		02.02.2019		100,000					
Расход	Да	03.02.2019 0:00:00		Сервелат Финский в/у	Маркировка нашего завода		03.02.2019		200,000					
Расход	Да	04.02.2019 0:00:00		Сервелат Финский в/у	Маркировка нашего завода		04.02.2019		300,000					
Расход	Да	05.02.2019 0:00:00		Сервелат Финский в/у	Маркировка нашего завода		05.02.2019		400,000					
Расход	Да	06.02.2019 0:00:00		Сервелат Финский в/у	Маркировка нашего завода		06.02.2019		500,000					
Расход	Да	07.02.2019 0:00:00		Сервелат Финский в/у	Маркировка нашего завода		07.02.2019		600,000					
Расход	Да	08.02.2019 0:00:00		Сервелат Финский в/у	Маркировка нашего завода		08.02.2019		700,000					
Расход	Да	09.02.2019 0:00:00		Сервелат Финский в/у	Маркировка нашего завода		09.02.2019		800,000					

Регистр сведений "План потребностей в отгрузке" (8)										
Стандартные реквизиты		Измерения						Ресурсы		
Активность	Период	Сценарий	Дата отгрузки	Номенклатура	Характеристика	Склад	Волна отгрузки	План	Заблокировано	Комментарий
Да	*	Основной	02.02.2019	Сервелат Финский в/у	Маркировка нашего завода			100,000	Да	
Да	*	Основной	03.02.2019	Сервелат Финский в/у	Маркировка нашего завода			200,000	Нет	Это 200
Да	*	Основной	04.02.2019	Сервелат Финский в/у	Маркировка нашего завода			300,000	Да	
Да	*	Основной	05.02.2019	Сервелат Финский в/у	Маркировка нашего завода			400,000	Нет	Это 400
Да	*	Основной	06.02.2019	Сервелат Финский в/у	Маркировка нашего завода			500,000	Да	
Да	*	Основной	07.02.2019	Сервелат Финский в/у	Маркировка нашего завода			600,000	Нет	Это 600
Да	*	Основной	08.02.2019	Сервелат Финский в/у	Маркировка нашего завода			700,000	Да	
Да	*	Основной	09.02.2019	Сервелат Финский в/у	Маркировка нашего завода			800,000	Нет	Это 800