﻿											
КАССА за 26.03.2021					Лист 1	КАССА за 26.03.2021					Лист 1
											
Номер документа	От кого получено или кому выдано			"Приход,
руб. коп."	"Расход,
руб. коп."	Номер документа	От кого получено или кому выдано			"Приход,
руб. коп."	"Расход,
руб. коп."
1	2			4	5	1	2			4	5
Остаток на начало дня					Х	Остаток на начало дня					Х
	Приходный кассовый ордер * от 26 марта 2021 г.			41 050=00			Приходный кассовый ордер * от 26 марта 2021 г.			41 050=00	
Итого за день				41 050=00		Итого за день				41 050=00	
Остаток на конец дня				41 050=00	Х	Остаток на конец дня				41 050=00	Х
											
											
Кассир						Кассир					
	подпись		расшифровка подписи				подпись		расшифровка подписи		
Записи в кассовой книге проверил и документы в количестве						Записи в кассовой книге проверил и документы в количестве					
1 документов кассовых операций						1 документов кассовых операций					
											
Бухгалтер			Веселов М.			Бухгалтер			Веселов М.		
	подпись		расшифровка подписи				подпись		расшифровка подписи		
											