{
    "Валюты": [{
        "Ссылка": "ba0adc0a-fca1-11e9-80f7-0025902f7068",
        "Наименование": "RUB",
        "Код": "643",
        "НаименованиеПолное": "Российский рубль",
        "ПараметрыПрописи": "рубль, рубля, рублей, м, копейка, копейки, копеек, ж, 2 знака",
        "СпособУстановкиКурса": "РучнойВвод"
    }],
    "Организации": [{
        "Ссылка": "c7c8b906-1366-11eb-972d-a85e45b5ac90",
        "Наименование": "Организация",
        "ИНН": "9999115007",
        "КПП": "999911500",
        "ОГРН": "1234567890123",
        "ПрефиксGS1": "789      ",
        "НаименованиеПолное": "Общество с ограниченной ответственностью \"Организация\"",
        "НаименованиеСокращенное": "ООО \"Организация\"",
        "НаименованиеМеждународное": "Organizatcia LLC",
        "КодОКВЭД": "999",
        "КодПоОКПО": "12345678",
        "ЮрФизЛицо": "ЮрЛицо",
        "КонтактнаяИнформация": [{
                "Тип": "Адрес",
                "Вид": {
                    "Тип": "СправочникСсылка.ВидыКонтактнойИнформации",
                    "Значение": "АдресОрганизации"
                },
                "Представление": "117342, Москва г, Севастопольский пр-кт, дом № 56",
                "ЗначенияПолей": "<КонтактнаяИнформация xmlns=\"http://www.v8.1c.ru/ssl/contactinfo\" xmlns:xs=\"http://www.w3.org/2001/XMLSchema\" xmlns:xsi=\"http://www.w3.org/2001/XMLSchema-instance\" Представление=\"117342, Москва г, Севастопольский пр-кт, дом № 56\"><Состав xsi:type=\"Адрес\" Страна=\"РОССИЯ\"><Состав xsi:type=\"АдресРФ\"><ДопАдрЭл ТипАдрЭл=\"10100000\" Значение=\"117342\"/></Состав></Состав></КонтактнаяИнформация>",
                "Страна": "РОССИЯ",
                "ВидДляСписка": {
                    "Тип": "СправочникСсылка.ВидыКонтактнойИнформации",
                    "Значение": "АдресОрганизации"
                },
                "Значение": "{\r\n\"value\": \"117342, Москва г, Севастопольский пр-кт, дом № 56\",\r\n\"comment\": \"\",\r\n\"type\": \"Адрес\",\r\n\"country\": \"РОССИЯ\",\r\n\"addressType\": \"ВСвободнойФорме\",\r\n\"countryCode\": \"643\",\r\n\"ZIPcode\": \"117342\",\r\n\"area\": \"\",\r\n\"areaType\": \"\",\r\n\"city\": \"\",\r\n\"cityType\": \"\",\r\n\"street\": \"\",\r\n\"streetType\": \"\",\r\n\"id\": \"\",\r\n\"areaCode\": \"\",\r\n\"areaId\": \"\",\r\n\"district\": \"\",\r\n\"districtType\": \"\",\r\n\"districtId\": \"\",\r\n\"munDistrict\": \"\",\r\n\"munDistrictType\": \"\",\r\n\"munDistrictId\": \"\",\r\n\"cityId\": \"\",\r\n\"settlement\": \"\",\r\n\"settlementType\": \"\",\r\n\"settlementId\": \"\",\r\n\"cityDistrict\": \"\",\r\n\"cityDistrictType\": \"\",\r\n\"cityDistrictId\": \"\",\r\n\"territory\": \"\",\r\n\"territoryType\": \"\",\r\n\"territoryId\": \"\",\r\n\"locality\": \"\",\r\n\"localityType\": \"\",\r\n\"localityId\": \"\",\r\n\"streetId\": \"\",\r\n\"houseType\": \"\",\r\n\"houseNumber\": \"\",\r\n\"houseId\": \"\",\r\n\"buildings\": [],\r\n\"apartments\": [],\r\n\"codeKLADR\": \"\",\r\n\"oktmo\": \"\",\r\n\"okato\": \"\",\r\n\"asInDocument\": \"\",\r\n\"ifnsFLCode\": \"\",\r\n\"ifnsULCode\": \"\",\r\n\"ifnsFLAreaCode\": \"\",\r\n\"ifnsULAreaCode\": \"\",\r\n\"stead\": \"\",\r\n\"steadId\": \"\"\r\n}"
            },
            {
                "Тип": "Телефон",
                "Вид": {
                    "Тип": "СправочникСсылка.ВидыКонтактнойИнформации",
                    "Значение": "ТелефонОрганизации"
                },
                "Представление": "+79101234567",
                "ЗначенияПолей": "<КонтактнаяИнформация xmlns=\"http://www.v8.1c.ru/ssl/contactinfo\" xmlns:xs=\"http://www.w3.org/2001/XMLSchema\" xmlns:xsi=\"http://www.w3.org/2001/XMLSchema-instance\" Представление=\"+79101234567\"><Состав xsi:type=\"НомерТелефона\" КодСтраны=\"79101234567\" КодГорода=\"\" Номер=\"\" Добавочный=\"\"/></КонтактнаяИнформация>",
                "НомерТелефона": "79101234567",
                "ВидДляСписка": {
                    "Тип": "СправочникСсылка.ВидыКонтактнойИнформации",
                    "Значение": "ТелефонОрганизации"
                },
                "Значение": "{\r\n\"value\": \"+79101234567\",\r\n\"comment\": \"\",\r\n\"type\": \"Телефон\",\r\n\"countryCode\": \"79101234567\",\r\n\"areaCode\": \"\",\r\n\"number\": \"\",\r\n\"extNumber\": \"\"\r\n}"
            }
        ]
    }],
    "ВидыНоменклатуры": [{
            "Ссылка": "c7c8b90f-1366-11eb-972d-a85e45b5ac90",
            "Наименование": "Полуфабрикаты(ФЗП)",
            "ЭтоГруппа": false,
            "ЕдиницаИзмерения": {
                "Тип": "СправочникСсылка.УпаковкиЕдиницыИзмерения",
                "Значение": {
                    "КодПоОКЕИ": "166"
                }
            },
            "ИспользованиеХарактеристик": "НеИспользовать",
            "ТипВоспроизводства": "Производство",
            "СырьеваяСтатьяЗатрат": {
                "Тип": "СправочникСсылка.к2СырьевыеСтатьиЗатрат",
                "Значение": "Сырье"
            },
            "НаборСвойств": {
                "Тип": "СправочникСсылка.НаборыДополнительныхРеквизитовИСведений",
                "Значение": "c7c8b90e-1366-11eb-972d-a85e45b5ac90"
            },
            "Тип": "Прочее",
            "ВариантНумерацииСерий": "ПоНоменклатуреВПределахДня",
            "ВидыАнализов": []
        },
        {
            "Ссылка": "c7c8b911-1366-11eb-972d-a85e45b5ac90",
            "Наименование": "Готовая продукция(ФЗП)",
            "ЭтоГруппа": false,
            "ИспользованиеХарактеристик": "ОбщиеДляВидаНоменклатуры",
            "ИспользоватьХарактеристики": "true",
            "ТипВоспроизводства": "Производство",
            "СырьеваяСтатьяЗатрат": {
                "Тип": "СправочникСсылка.к2СырьевыеСтатьиЗатрат",
                "Значение": "Сырье"
            },
            "НаборСвойств": {
                "Тип": "СправочникСсылка.НаборыДополнительныхРеквизитовИСведений",
                "Значение": "c7c8b910-1366-11eb-972d-a85e45b5ac90"
            },
            "Тип": "Прочее",
            "ВариантНумерацииСерий": "ПоНоменклатуреВПределахДня",
            "ВидыАнализов": []
        }
    ],
    "ТоварныеКатегории": [{
        "Ссылка": "c7c8b903-1366-11eb-972d-a85e45b5ac90",
        "Наименование": "Копченые колбасы"
    }],
    "ТочкиДоставки": [{
            "Ссылка": "eddc6240-174d-11eb-9732-a85e45b5ac90",
            "Наименование": "Ашан (ФЗП)",
            "Код": "00-00000001",
            "Владелец": {
                "Тип": "СправочникСсылка.Контрагенты",
                "Значение": "c7c8b922-1366-11eb-972d-a85e45b5ac90"
            },
            "Менеджер": {
                "Тип": "СправочникСсылка.Пользователи",
                "Значение": "2b8187f2-29c6-11e9-8501-00155d010e00"
            },
            "СкладОтгрузки": {
                "Тип": "СправочникСсылка.Склады",
                "Значение": "c7c8b914-1366-11eb-972d-a85e45b5ac90"
            },
            "НаименованиеПолное": "Ашан (ФЗП)",
            "ОсновныеСведения": "Дни: Понедельник, Вторник, Среда, Четверг, Пятница, Суббота, Воскресенье",
            "ДополнительныеРеквизиты": [],
            "КонтактнаяИнформация": [],
            "ДниДоставки": [{
                    "ДеньНедели": "Понедельник"
                },
                {
                    "ДеньНедели": "Вторник"
                },
                {
                    "ДеньНедели": "Среда"
                },
                {
                    "ДеньНедели": "Четверг"
                },
                {
                    "ДеньНедели": "Пятница"
                },
                {
                    "ДеньНедели": "Суббота"
                },
                {
                    "ДеньНедели": "Воскресенье"
                }
            ],
            "УточненияПоОтгрузке": [],
            "УточненияПоДоставке": []
        },
        {
            "Ссылка": "eddc6241-174d-11eb-9732-a85e45b5ac90",
            "Наименование": "Атак (ФЗП)",
            "Код": "00-00000002",
            "Владелец": {
                "Тип": "СправочникСсылка.Контрагенты",
                "Значение": "c7c8b924-1366-11eb-972d-a85e45b5ac90"
            },
            "Менеджер": {
                "Тип": "СправочникСсылка.Пользователи",
                "Значение": "2b8187f2-29c6-11e9-8501-00155d010e00"
            },
            "СкладОтгрузки": {
                "Тип": "СправочникСсылка.Склады",
                "Значение": "c7c8b914-1366-11eb-972d-a85e45b5ac90"
            },
            "НаименованиеПолное": "Атак(ФЗП)",
            "ОсновныеСведения": "Дни: Понедельник, Вторник, Среда, Четверг, Пятница, Суббота, Воскресенье",
            "ДополнительныеРеквизиты": [],
            "КонтактнаяИнформация": [],
            "ДниДоставки": [{
                    "ДеньНедели": "Понедельник"
                },
                {
                    "ДеньНедели": "Вторник"
                },
                {
                    "ДеньНедели": "Среда"
                },
                {
                    "ДеньНедели": "Четверг"
                },
                {
                    "ДеньНедели": "Пятница"
                },
                {
                    "ДеньНедели": "Суббота"
                },
                {
                    "ДеньНедели": "Воскресенье"
                }
            ],
            "УточненияПоОтгрузке": [],
            "УточненияПоДоставке": []
        }
    ],
    "Номенклатура": [{
            "Ссылка": "c7c8b917-1366-11eb-972d-a85e45b5ac90",
            "Наименование": "Сервелат Финский",
            "ЭтоГруппа": false,
            "СезоннаяГруппа": {
                "Тип": "СправочникСсылка.к2СезонныеГруппы",
                "Значение": "c7c8b915-1366-11eb-972d-a85e45b5ac90"
            },
            "ТоварнаяКатегория": {
                "Тип": "СправочникСсылка.к2ТоварныеКатегории",
                "Значение": "c7c8b903-1366-11eb-972d-a85e45b5ac90"
            },
            "ВидНоменклатуры": {
                "Тип": "СправочникСсылка.ВидыНоменклатуры",
                "Значение": "c7c8b911-1366-11eb-972d-a85e45b5ac90"
            },
            "НаименованиеПолное": "Сервелат Финский",
            "ЕдиницаИзмерения": {
                "Тип": "СправочникСсылка.УпаковкиЕдиницыИзмерения",
                "Значение": {
                    "КодПоОКЕИ": "796"
                }
            },
            "УпаковкаПоУмолчанию": {
                "Тип": "СправочникСсылка.УпаковкиЕдиницыИзмерения",
                "Значение": "c7c8b919-1366-11eb-972d-a85e45b5ac90"
            },
            "Кратность": "1",
            "Производитель": {
                "Тип": "СправочникСсылка.к2Производители",
                "Значение": "c7c8b904-1366-11eb-972d-a85e45b5ac90"
            },
            "ТипНоменклатуры": "ГотоваяПродукция",
            "НаборУпаковок": {
                "Тип": "СправочникСсылка.к2НаборыУпаковок",
                "Значение": "ИндивидуальныйДляНоменклатуры"
            },
            "ИспользоватьУпаковки": "true",
            "ИспользованиеХарактеристик": "ОбщиеДляВидаНоменклатуры",
            "ИспользованиеДопЕдиницИзмерения": "НеИспользовать",
            "СырьеваяСтатьяЗатрат": {
                "Тип": "СправочникСсылка.к2СырьевыеСтатьиЗатрат",
                "Значение": "Сырье"
            },
            "ВесЕдиницаИзмерения": {
                "Тип": "СправочникСсылка.УпаковкиЕдиницыИзмерения",
                "Значение": {
                    "КодПоОКЕИ": "166"
                }
            },
            "ВесИспользовать": "true",
            "ВесЧислитель": "0.5",
            "ВесЗнаменатель": "1",
            "СкладВыпуска": {
                "Тип": "СправочникСсылка.Склады",
                "Значение": "c7c8b914-1366-11eb-972d-a85e45b5ac90"
            },
            "СтавкаНДС": "НДС18",
            "ПравилоОкругления": "НеОкруглять",
            "ДополнительныеРеквизиты": [],
            "ВидыАнализов": []
        },
        {
            "Ссылка": "c7c8b91a-1366-11eb-972d-a85e45b5ac90",
            "Наименование": "Сервелат Финский в/у",
            "ЭтоГруппа": false,
            "СезоннаяГруппа": {
                "Тип": "СправочникСсылка.к2СезонныеГруппы",
                "Значение": "c7c8b915-1366-11eb-972d-a85e45b5ac90"
            },
            "ТоварнаяКатегория": {
                "Тип": "СправочникСсылка.к2ТоварныеКатегории",
                "Значение": "c7c8b903-1366-11eb-972d-a85e45b5ac90"
            },
            "ВидНоменклатуры": {
                "Тип": "СправочникСсылка.ВидыНоменклатуры",
                "Значение": "c7c8b911-1366-11eb-972d-a85e45b5ac90"
            },
            "НаименованиеПолное": "Сервелат Финский в/у",
            "ЕдиницаИзмерения": {
                "Тип": "СправочникСсылка.УпаковкиЕдиницыИзмерения",
                "Значение": {
                    "КодПоОКЕИ": "796"
                }
            },
            "Кратность": "1",
            "Производитель": {
                "Тип": "СправочникСсылка.к2Производители",
                "Значение": "c7c8b904-1366-11eb-972d-a85e45b5ac90"
            },
            "ТипНоменклатуры": "ГотоваяПродукция",
            "НаборУпаковок": {
                "Тип": "СправочникСсылка.к2НаборыУпаковок",
                "Значение": "ИндивидуальныйДляНоменклатуры"
            },
            "ИспользоватьУпаковки": "true",
            "ИспользованиеХарактеристик": "ОбщиеДляВидаНоменклатуры",
            "ИспользованиеДопЕдиницИзмерения": "НеИспользовать",
            "СырьеваяСтатьяЗатрат": {
                "Тип": "СправочникСсылка.к2СырьевыеСтатьиЗатрат",
                "Значение": "Сырье"
            },
            "ВесЕдиницаИзмерения": {
                "Тип": "СправочникСсылка.УпаковкиЕдиницыИзмерения",
                "Значение": {
                    "КодПоОКЕИ": "166"
                }
            },
            "ВесИспользовать": "true",
            "ВесЧислитель": "1",
            "ВесЗнаменатель": "1",
            "СкладВыпуска": {
                "Тип": "СправочникСсылка.Склады",
                "Значение": "c7c8b914-1366-11eb-972d-a85e45b5ac90"
            },
            "СтавкаНДС": "НДС20",
            "ПравилоОкругления": "НеОкруглять",
            "ДополнительныеРеквизиты": [],
            "ВидыАнализов": []
        },
        {
            "Ссылка": "c7c8b91c-1366-11eb-972d-a85e45b5ac90",
            "Наименование": "Сервелат Финский Метро",
            "ЭтоГруппа": false,
            "СезоннаяГруппа": {
                "Тип": "СправочникСсылка.к2СезонныеГруппы",
                "Значение": "c7c8b915-1366-11eb-972d-a85e45b5ac90"
            },
            "ТоварнаяКатегория": {
                "Тип": "СправочникСсылка.к2ТоварныеКатегории",
                "Значение": "c7c8b903-1366-11eb-972d-a85e45b5ac90"
            },
            "ВидНоменклатуры": {
                "Тип": "СправочникСсылка.ВидыНоменклатуры",
                "Значение": "c7c8b911-1366-11eb-972d-a85e45b5ac90"
            },
            "НаименованиеПолное": "Сервелат Финский Метро",
            "ЕдиницаИзмерения": {
                "Тип": "СправочникСсылка.УпаковкиЕдиницыИзмерения",
                "Значение": {
                    "КодПоОКЕИ": "166"
                }
            },
            "Кратность": "1",
            "Производитель": {
                "Тип": "СправочникСсылка.к2Производители",
                "Значение": "c7c8b904-1366-11eb-972d-a85e45b5ac90"
            },
            "ТипНоменклатуры": "ГотоваяПродукция",
            "ИспользованиеХарактеристик": "ОбщиеДляВидаНоменклатуры",
            "ИспользованиеДопЕдиницИзмерения": "НеИспользовать",
            "СырьеваяСтатьяЗатрат": {
                "Тип": "СправочникСсылка.к2СырьевыеСтатьиЗатрат",
                "Значение": "Сырье"
            },
            "ВесЕдиницаИзмерения": {
                "Тип": "СправочникСсылка.УпаковкиЕдиницыИзмерения",
                "Значение": {
                    "КодПоОКЕИ": "166"
                }
            },
            "ВесИспользовать": "true",
            "ВесЧислитель": "1",
            "ВесЗнаменатель": "1",
            "СкладВыпуска": {
                "Тип": "СправочникСсылка.Склады",
                "Значение": "c7c8b914-1366-11eb-972d-a85e45b5ac90"
            },
            "СтавкаНДС": "НДС20",
            "ПравилоОкругления": "НеОкруглять",
            "ДополнительныеРеквизиты": [],
            "ВидыАнализов": []
        },
        {
            "Ссылка": "c7c8b91d-1366-11eb-972d-a85e45b5ac90",
            "Наименование": "(БП) Сервелат Финский",
            "ЭтоГруппа": false,
            "СезоннаяГруппа": {
                "Тип": "СправочникСсылка.к2СезонныеГруппы",
                "Значение": "c7c8b915-1366-11eb-972d-a85e45b5ac90"
            },
            "ТоварнаяКатегория": {
                "Тип": "СправочникСсылка.к2ТоварныеКатегории",
                "Значение": "c7c8b903-1366-11eb-972d-a85e45b5ac90"
            },
            "ВидНоменклатуры": {
                "Тип": "СправочникСсылка.ВидыНоменклатуры",
                "Значение": "c7c8b90f-1366-11eb-972d-a85e45b5ac90"
            },
            "НаименованиеПолное": "(БП) Сервелат Финский",
            "ЕдиницаИзмерения": {
                "Тип": "СправочникСсылка.УпаковкиЕдиницыИзмерения",
                "Значение": {
                    "КодПоОКЕИ": "166"
                }
            },
            "Кратность": "1",
            "Производитель": {
                "Тип": "СправочникСсылка.к2Производители",
                "Значение": "c7c8b904-1366-11eb-972d-a85e45b5ac90"
            },
            "СрокГодности": "10",
            "ТипНоменклатуры": "БазовыйПродукт",
            "ДлительностьПроизводственногоЦикла": "2",
            "МинимальныйЗамес": "200",
            "ИспользованиеХарактеристик": "НеИспользовать",
            "ИспользованиеДопЕдиницИзмерения": "НеИспользовать",
            "СырьеваяСтатьяЗатрат": {
                "Тип": "СправочникСсылка.к2СырьевыеСтатьиЗатрат",
                "Значение": "Сырье"
            },
            "ПравилоОкругления": "НеОкруглять",
            "ДополнительныеРеквизиты": [],
            "ВидыАнализов": []
        }
    ],
    "Характеристики": [{
            "Ссылка": "c7c8b912-1366-11eb-972d-a85e45b5ac90",
            "Наименование": "Маркировка нашего завода",
            "Владелец": {
                "Тип": "СправочникСсылка.ВидыНоменклатуры",
                "Значение": "c7c8b911-1366-11eb-972d-a85e45b5ac90"
            },
            "НаименованиеПолное": "Маркировка нашего завода"
        },
        {
            "Ссылка": "c7c8b913-1366-11eb-972d-a85e45b5ac90",
            "Наименование": "Немаркирвоанная",
            "Владелец": {
                "Тип": "СправочникСсылка.ВидыНоменклатуры",
                "Значение": "c7c8b911-1366-11eb-972d-a85e45b5ac90"
            },
            "НаименованиеПолное": "Немаркирвоанная",
            "НемаркированнаяПродукция": "true"
        }
    ],
    "НаборыУпаковок": [{
        "Ссылка": "c7c8b901-1366-11eb-972d-a85e45b5ac90",
        "Наименование": "Индивидуальный набор для номенклатуры"
    }],
    "УпаковкиЕдиницыИзмерения": [{
        "Ссылка": "c7c8b919-1366-11eb-972d-a85e45b5ac90",
        "Наименование": "кор (20 шт)",
        "Владелец": {
            "Тип": "СправочникСсылка.Номенклатура",
            "Значение": "c7c8b917-1366-11eb-972d-a85e45b5ac90"
        },
        "ВесЕдиницаИзмерения": {
            "Тип": "СправочникСсылка.УпаковкиЕдиницыИзмерения",
            "Значение": {
                "КодПоОКЕИ": "166"
            }
        },
        "ЕдиницаИзмерения": {
            "Тип": "СправочникСсылка.УпаковкиЕдиницыИзмерения",
            "Значение": {
                "КодПоОКЕИ": "796"
            }
        },
        "Числитель": "20",
        "Знаменатель": "1",
        "ТипИзмеряемойВеличины": "Упаковка",
        "ТипУпаковки": "Конечная"
    }],
    "СезонныеГруппы": [{
        "Ссылка": "c7c8b915-1366-11eb-972d-a85e45b5ac90",
        "Наименование": "Копченые колбасы"
    }],
    "Производители": [{
        "Ссылка": "c7c8b904-1366-11eb-972d-a85e45b5ac90",
        "Наименование": "Производитель"
    }],
    "Склады": [{
            "Ссылка": "c7c8b914-1366-11eb-972d-a85e45b5ac90",
            "Наименование": "Склад ГП(ФЗП)",
            "ЭтоГруппа": false,
            "НастройкаКонтроляОстатков": "НеКонтролировать",
            "ЕмкостьСклада": [{
                "ТоварнаяКатегория": {
                    "Тип": "СправочникСсылка.к2ТоварныеКатегории",
                    "Значение": "c7c8b903-1366-11eb-972d-a85e45b5ac90"
                },
                "Емкость": "15000"
            }],
            "ВидыПоказателей": [],
            "КонтактнаяИнформация": [],
            "УточненияПоДоставке": [],
            "ДниДоставки": [{
                    "ДеньНедели": "Понедельник"
                },
                {
                    "ДеньНедели": "Вторник"
                },
                {
                    "ДеньНедели": "Среда"
                },
                {
                    "ДеньНедели": "Четверг"
                },
                {
                    "ДеньНедели": "Пятница"
                },
                {
                    "ДеньНедели": "Суббота"
                },
                {
                    "ДеньНедели": "Воскресенье"
                }
            ],
            "ПорядокПравилРазмещенияНоменклатуры": [],
            "УточненияПоПриемке": []
        },
        {
            "Ссылка": "7cb1e1aa-1f7f-4495-8f99-ad5c63ef4640",
            "Наименование": "Новый Склад ГП(ФЗП)",
            "ЭтоГруппа": false,
            "НастройкаКонтроляОстатков": "НеКонтролировать",
            "ЕмкостьСклада": [{
                "ТоварнаяКатегория": {
                    "Тип": "СправочникСсылка.к2ТоварныеКатегории",
                    "Значение": "c7c8b903-1366-11eb-972d-a85e45b5ac90"
                },
                "Емкость": "20000"
            }],
            "ВидыПоказателей": [],
            "КонтактнаяИнформация": [],
            "УточненияПоДоставке": [],
            "ДниДоставки": [{
                    "ДеньНедели": "Понедельник"
                },
                {
                    "ДеньНедели": "Вторник"
                },
                {
                    "ДеньНедели": "Среда"
                },
                {
                    "ДеньНедели": "Четверг"
                },
                {
                    "ДеньНедели": "Пятница"
                },
                {
                    "ДеньНедели": "Суббота"
                },
                {
                    "ДеньНедели": "Воскресенье"
                }
            ],
            "ПорядокПравилРазмещенияНоменклатуры": [],
            "УточненияПоПриемке": []
        }
    ],
    "Контрагенты": [{
            "Ссылка": "c7c8b920-1366-11eb-972d-a85e45b5ac90",
            "Наименование": "Метро(ФЗП)",
            "ЭтоГруппа": false,
            "НаименованиеПолное": "Метро(ФЗП)",
            "ОсновнойМенеджер": {
                "Тип": "СправочникСсылка.Пользователи",
                "Значение": "2b8187f2-29c6-11e9-8501-00155d010e00"
            },
            "ГруппаПланирования": {
                "Тип": "СправочникСсылка.к2ГруппыПартнеровПланирования",
                "Значение": "c7c8b91f-1366-11eb-972d-a85e45b5ac90"
            },
            "Тип": "ФедеральнаяСеть",
            "Покупатель": "true",
            "РазрешенныйОСГ": "75",
            "СтранаРегистрации": {
                "Тип": "СправочникСсылка.СтраныМира",
                "Значение": "Россия"
            },
            "ОсновныеСведения": "Пользователь",
            "ЮрФизЛицо": "ЮрЛицо",
            "ДополнительныеРеквизиты": [],
            "КонтактнаяИнформация": []
        },
        {
            "Ссылка": "c7c8b922-1366-11eb-972d-a85e45b5ac90",
            "Наименование": "Ашан(ФЗП)",
            "ЭтоГруппа": false,
            "НаименованиеПолное": "Ашан(ФЗП)",
            "ОсновнойМенеджер": {
                "Тип": "СправочникСсылка.Пользователи",
                "Значение": "2b8187f2-29c6-11e9-8501-00155d010e00"
            },
            "ГруппаПланирования": {
                "Тип": "СправочникСсылка.к2ГруппыПартнеровПланирования",
                "Значение": "c7c8b921-1366-11eb-972d-a85e45b5ac90"
            },
            "Тип": "ФедеральнаяСеть",
            "Покупатель": "true",
            "РазрешенныйОСГ": "75",
            "СтранаРегистрации": {
                "Тип": "СправочникСсылка.СтраныМира",
                "Значение": "Россия"
            },
            "ОсновныеСведения": "Пользователь",
            "ЮрФизЛицо": "ЮрЛицо",
            "ДополнительныеРеквизиты": [],
            "КонтактнаяИнформация": []
        },
        {
            "Ссылка": "c7c8b924-1366-11eb-972d-a85e45b5ac90",
            "Наименование": "Атак(ФЗП)",
            "ЭтоГруппа": false,
            "НаименованиеПолное": "Атак(ФЗП)",
            "ОсновнойМенеджер": {
                "Тип": "СправочникСсылка.Пользователи",
                "Значение": "2b8187f2-29c6-11e9-8501-00155d010e00"
            },
            "ГруппаПланирования": {
                "Тип": "СправочникСсылка.к2ГруппыПартнеровПланирования",
                "Значение": "c7c8b923-1366-11eb-972d-a85e45b5ac90"
            },
            "Тип": "ФедеральнаяСеть",
            "Покупатель": "true",
            "РазрешенныйОСГ": "75",
            "СтранаРегистрации": {
                "Тип": "СправочникСсылка.СтраныМира",
                "Значение": "Россия"
            },
            "ОсновныеСведения": "Пользователь",
            "ЮрФизЛицо": "ЮрЛицо",
            "ДополнительныеРеквизиты": [],
            "КонтактнаяИнформация": []
        }
    ],
    "СоглашенияСКлиентами": [{
            "Ссылка": "c7c8b927-1366-11eb-972d-a85e45b5ac90",
            "Наименование": "Соглашение для Ашана(ФЗП)",
            "Контрагент": {
                "Тип": "СправочникСсылка.Контрагенты",
                "Значение": "c7c8b922-1366-11eb-972d-a85e45b5ac90"
            },
            "Организация": {
                "Тип": "СправочникСсылка.Организации",
                "Значение": {
                    "Наименование": "Организация"
                }
            },
            "Валюта": {
                "Тип": "СправочникСсылка.Валюты",
                "Значение": {
                    "Код": "643",
                    "Наименование": "RUB"
                }
            },
            "ВидЦен": {
                "Тип": "СправочникСсылка.ВидыЦен",
                "Значение": "c7c8b926-1366-11eb-972d-a85e45b5ac90"
            },
            "Налогообложение": "ОблагаетсяНДС",
            "МоментОпределенияЦены": "НаДатуЗаказа",
            "Статус": "Действует",
            "ДатаНачалаДействия": "2017-01-01T00:00:00",
            "ДатаОкончанияДействия": "2025-09-09T00:00:00",
            "Автор": {
                "Тип": "СправочникСсылка.Пользователи",
                "Значение": "bcf2c0e7-2394-11e9-8355-40f02fb6efe1"
            },
            "Ответственный": {
                "Тип": "СправочникСсылка.Пользователи",
                "Значение": "bcf2c0e7-2394-11e9-8355-40f02fb6efe1"
            },
            "НаименованиеДляПечати": "Соглашение для Ашана(ФЗП)",
            "ВидСоглашения": "СПокупателем",
            "ЦеновыеУточнения": [],
            "КоэффициентыВРасчетеСтоимости": []
        },
        {
            "Ссылка": "c7c8b928-1366-11eb-972d-a85e45b5ac90",
            "Наименование": "Соглашение для Атака(ФЗП)",
            "Контрагент": {
                "Тип": "СправочникСсылка.Контрагенты",
                "Значение": "c7c8b924-1366-11eb-972d-a85e45b5ac90"
            },
            "Организация": {
                "Тип": "СправочникСсылка.Организации",
                "Значение": {
                    "Наименование": "Организация"
                }
            },
            "Валюта": {
                "Тип": "СправочникСсылка.Валюты",
                "Значение": {
                    "Код": "643",
                    "Наименование": "RUB"
                }
            },
            "ВидЦен": {
                "Тип": "СправочникСсылка.ВидыЦен",
                "Значение": "c7c8b925-1366-11eb-972d-a85e45b5ac90"
            },
            "ЦенаВключаетНДС": "true",
            "Налогообложение": "ОблагаетсяНДС",
            "МоментОпределенияЦены": "НаДатуЗаказа",
            "Статус": "Действует",
            "ДатаНачалаДействия": "2017-01-01T00:00:00",
            "ДатаОкончанияДействия": "2025-12-31T00:00:00",
            "Автор": {
                "Тип": "СправочникСсылка.Пользователи",
                "Значение": "bcf2c0e7-2394-11e9-8355-40f02fb6efe1"
            },
            "Ответственный": {
                "Тип": "СправочникСсылка.Пользователи",
                "Значение": "bcf2c0e7-2394-11e9-8355-40f02fb6efe1"
            },
            "НаименованиеДляПечати": "Соглашение для Атака(ФЗП)",
            "ВидСоглашения": "СПокупателем",
            "ЦеновыеУточнения": [],
            "КоэффициентыВРасчетеСтоимости": []
        }
    ],
    "ВидыЦен": [{
            "Ссылка": "c7c8b925-1366-11eb-972d-a85e45b5ac90",
            "Наименование": "Цена для Атака(ФЗП)",
            "СпособЗадания": "РучнойВвод",
            "ЦенаВключаетНДС": "true",
            "ДоступныУточненияВСоглашениях": "true",
            "ВалютаЦены": {
                "Тип": "СправочникСсылка.Валюты",
                "Значение": {
                    "Код": "643",
                    "Наименование": "RUB"
                }
            },
            "Уточнения": []
        },
        {
            "Ссылка": "c7c8b926-1366-11eb-972d-a85e45b5ac90",
            "Наименование": "Цена для Ашана(ФЗП)",
            "СпособЗадания": "РучнойВвод",
            "ДоступныУточненияВСоглашениях": "true",
            "ВалютаЦены": {
                "Тип": "СправочникСсылка.Валюты",
                "Значение": {
                    "Код": "643",
                    "Наименование": "RUB"
                }
            },
            "Уточнения": []
        }
    ]
}