{
    "AWSTemplateFormatVersion": "2010-09-09",
    "Description": "Create EC2 instance",
    "Parameters": {
        "InstanceType": {
            "Description": "EC2 instance type",
            "Type": "String",
            "Default": "t3.micro",
            "AllowedValues": [
                "t3.micro",
                "t3.small",
                "t3.medium",
                "t3.large"
            ]
        }
    },
    "Resources": {
        "EC2Instance": {
            "Type": "AWS::EC2::Instance",
            "Properties": {
                "InstanceType": {
                    "Ref": "InstanceType"
                },
                "ImageId": "ami-02cad064a29d4550c",
                "SecurityGroups": [
                    {
                        "Ref": "InstanceSecurityGroup"
                    }
                ],
                "AvailabilityZone": {
                    "Fn::Select": [
                        0,
                        {
                            "Fn::GetAZs": ""
                        }
                    ]
                },
                "UserData": {
                    "Fn::Base64": {
                        "Fn::Sub": "#!/bin/bash \nyum install nginx ruby -y \nwget https://aws-codedeploy-eu-west-1.s3.eu-west-1.amazonaws.com/latest/install\nchmod +x ./install\nsudo ./install auto\necho \"Hello World\" > /usr/share/nginx/html/index.html\nsudo service nginx start\n"
                    }
                },
                "IamInstanceProfile": {
                    "Ref": "MyInstanceProfile"
                },
                "Tags": [
                    {
                        "Key": "Name",
                        "Value": "CodeDeployTarget"
                    }
                ]
            }
        },
        "MyInstanceProfile": {
            "Type": "AWS::IAM::InstanceProfile",
            "Properties": {
                "Roles": [
                    {
                        "Ref": "MyAppEC2CodeDeployRole"
                    }
                ]
            }
        },
        "MyAppEC2CodeDeployRole": {
            "Type": "AWS::IAM::Role",
            "Properties": {
                "AssumeRolePolicyDocument": {
                    "Version": "2012-10-17",
                    "Statement": [
                        {
                            "Effect": "Allow",
                            "Principal": {
                                "Service": "ec2.amazonaws.com"
                            },
                            "Action": "sts:AssumeRole"
                        }
                    ]
                },
                "Policies": [
                    {
                        "PolicyName": "CodeDeployPolicy",
                        "PolicyDocument": {
                            "Version": "2012-10-17",
                            "Statement": [
                                {
                                    "Effect": "Allow",
                                    "Action": [
                                        "s3:Get*",
                                        "s3:List*",
                                        "s3:Put*"
                                    ],
                                    "Resource": "*"
                                },
                                {
                                    "Effect": "Allow",
                                    "Action": [
                                        "ec2:Describe*",
                                        "ec2:TerminateInstances",
                                        "ec2:CreateTags"
                                    ],
                                    "Resource": "*"
                                }
                            ]
                        }
                    }
                ]
            }
        },
        "InstanceSecurityGroup": {
            "Type": "AWS::EC2::SecurityGroup",
            "Properties": {
                "GroupDescription": "Enable SSH access via port 22",
                "SecurityGroupIngress": [
                    {
                        "CidrIp": "0.0.0.0/0",
                        "FromPort": 80,
                        "ToPort": 80,
                        "IpProtocol": "tcp"
                    },
                    {
                        "CidrIp": "0.0.0.0/0",
                        "FromPort": 22,
                        "ToPort": 22,
                        "IpProtocol": "tcp"
                    }
                ]
            }
        },
        "CodeDeployApplication": {
            "Type": "AWS::CodeDeploy::Application",
            "Properties": {
                "ApplicationName": "myapp"
            }
        },
        "CodeDeployDeploymentGroup": {
            "Type": "AWS::CodeDeploy::DeploymentGroup",
            "Properties": {
                "ApplicationName": {
                    "Ref": "CodeDeployApplication"
                },
                "DeploymentGroupName": "myapp-deploymentgroup",
                "Ec2TagFilters": [
                    {
                        "Key": "Name",
                        "Value": "CodeDeployTarget",
                        "Type": "KEY_AND_VALUE"
                    }
                ],
                "ServiceRoleArn": {
                    "Fn::GetAtt": [
                        "CodeDeployServiceRole",
                        "Arn"
                    ]
                }
            }
        },
        "CodeDeployServiceRole": {
            "Type": "AWS::IAM::Role",
            "Properties": {
                "AssumeRolePolicyDocument": {
                    "Version": "2012-10-17",
                    "Statement": [
                        {
                            "Effect": "Allow",
                            "Principal": {
                                "Service": [
                                    "codedeploy.amazonaws.com"
                                ]
                            },
                            "Action": [
                                "sts:AssumeRole"
                            ]
                        }
                    ]
                },
                "Path": "/",
                "ManagedPolicyArns": [
                    "arn:aws:iam::aws:policy/service-role/AWSCodeDeployRole"
                ]
            }
        }
    },
    "Outputs": {
        "InstanceId": {
            "Description": "Instance ID",
            "Value": {
                "Ref": "EC2Instance"
            },
            "Export": {
                "Name": {
                    "Fn::Sub": "${AWS::StackName}-InstanceId"
                }
            }
        },
        "CodeDeployApplication": {
            "Description": "CodeDeploy Application",
            "Value": {
                "Ref": "CodeDeployApplication"
            }
        }
    }
}