{
  "version": "15.0.7",
  "scan": {
    "analyzer": {
      "id": "goat-scaner",
      "name": "goat-scan",
      "url": "https://owasp.org/www-project-webgoat/",
      "vendor": {
        "name": "OWASP"
      },
      "version": "42.1.666"
    },
    "scanner": {
      "id": "goat-scan",
      "name": "goat-scam",
      "url": "https://owasp.org/www-project-webgoat/",
      "vendor": {
        "name": "OWASP"
      },
      "version": "v42.1.666"
    },
    "type": "sast",
    "start_time": "2024-01-23T16:32:33",
    "end_time": "2024-01-23T16:33:03",
    "status": "success"
  },
  "vulnerabilities": [
    {
      "id": "9e96e0ab-23da-4d7d-a09e-0acbaa5e83ca",
      "category": "sast",
      "name": "whirly doodah",
      "message": "whirly doodah",
      "description": "whirly doodah doo",
      "severity": "Medium",
      "confidence": "Medium",
      "scanner": {
        "id": "find_sec_bugs",
        "name": "Find Security Bugs"
      },
      "location": {
        "file": "readme.md",
        "start_line": 1,
        "end_line": 1,
        "class": "com.gitlab.security_products.tests.App",
        "method": "generateSecretToken2",
        "dependency": {
          "package": {}
        }
      },
      "identifiers": [
        {
          "type": "OMGWTFBBQ",
          "name": "OMGWTFBBQ-01",
          "value": "42",
          "url": "https://zombo.com"
        }
      ]
    }
  ],
  "remediations": []
}
