{
    "IOT/San Donato/Ingresso": {
        "userThreshold": 3,
        "totalThreshold": 3,
        "type0": [
            "aleMuna"
        ],
        "type1": [],
        "type2": [],
        "type3": []
    },
    "IOT/San Donato/Out": {
        "userThreshold": 3,
        "totalThreshold": 3,
        "type0": [],
        "type1": [],
        "type2": [],
        "type3": []
    },
    "IOT/San Donato/Spinning": {
        "userThreshold": 3,
        "totalThreshold": 3,
        "type0": [],
        "type1": [],
        "type2": [],
        "type3": []
    },
    "IOT/San Donato/Cardio": {
        "userThreshold": 3,
        "totalThreshold": 3,
        "type0": [],
        "type1": [],
        "type2": [],
        "type3": []
    }
}