{
	"deviceID": "Cyclette_3",
	"gymName": "San Donato",
	"roomName": "Cardio",
	"type": "Cyclette",
	"description": "Cyclette number 3",
	"shortDesc": "Cycl3",
	"address": "",
    "port":50032
}




