a{"deviceID":"RFIDdoor1", "type":"", "topic":"IOT/GYM1/ROOM1"}
a{"deviceID":"door1", "type":"", "url":"http://127.0.0.1:50001/"}
a{"deviceID":"RFIDdoor2", "type":"", "topic":"IOT/GYM1/ROOM2"}
a{"deviceID":"door2", "type":"", "url":"http://127.0.0.1:50001/"}
a{"deviceID":"RFIDdoor3", "type":"", "topic":"IOT/GYM1/ROOM1"}
a{"deviceID":"door3", "type":"", "url":"http://127.0.0.1:50001/"}
d{"bn":"RFIDdoor1", "e":{ "from":"", "RFIDdata":"dodo", "doorID":"door1"}}
d{"bn":"RFIDdoor1", "e":{ "from":"", "RFIDdata":"roller", "doorID":"door1"}}
d{"bn":"RFIDdoor1", "e":{ "from":"", "RFIDdata":"papero", "doorID":"door1"}}
d{"bn":"RFIDdoor1", "e":{ "from":"", "RFIDdata":"mino", "doorID":"door1"}}
d{"bn":"RFIDdoor2", "e":{ "from":"IOT/GYM1/ROOM1", "RFIDdata":"roller", "doorID":"door1"}}
d{"bn":"RFIDdoor3", "e":{ "from":"IOT/GYM1/ROOM2", "RFIDdata":"roller", "doorID":"door1"}}

d{"bn":"RFIDdoor2", "e":{ "from":"IOT/GYM1/ROOM1", "RFIDdata":"dodo", "doorID":"door1"}}
d{"bn":"RFIDdoor3", "e":{ "from":"IOT/GYM1/ROOM2", "RFIDdata":"dodo", "doorID":"door1"}}

d{"bn":"RFIDdoor2", "e":{ "from":"IOT/GYM1/ROOM1", "RFIDdata":"mino", "doorID":"door1"}}
d{"bn":"RFIDdoor3", "e":{ "from":"IOT/GYM1/ROOM2", "RFIDdata":"mino", "doorID":"door1"}}

## comandi di inizializzazione macchine
confM1.txt
machine1.txt

confM2.txt
machine2.txt

confM3.txt
machine3.txt
