\relax 
\providecommand*\new@tpo@label[2]{}
\@writefile{toc}{\contentsline {section}{\numberline {1}02.03.2019}{1}}
\@writefile{toc}{\contentsline {section}{\numberline {2}04.03.2019}{1}}
\@writefile{toc}{\contentsline {section}{\numberline {3}07.03.2019}{1}}
\providecommand*\caption@xref[2]{\@setref\relax\@undefined{#1}}
\newlabel{fig:Timber_Log_1}{{1a}{2}}
\newlabel{sub@fig:Timber_Log_1}{{a}{2}}
\newlabel{fig:Timber_Log_2}{{1b}{2}}
\newlabel{sub@fig:Timber_Log_2}{{b}{2}}
\newlabel{fig:Timber_Log_3}{{1c}{2}}
\newlabel{sub@fig:Timber_Log_3}{{c}{2}}
\newlabel{fig:Timber_Log_4}{{1d}{2}}
\newlabel{sub@fig:Timber_Log_4}{{d}{2}}
\newlabel{fig:Timber_Log_5}{{1e}{2}}
\newlabel{sub@fig:Timber_Log_5}{{e}{2}}
\newlabel{fig:Timber_Log_6}{{1f}{2}}
\newlabel{sub@fig:Timber_Log_6}{{f}{2}}
\newlabel{fig:Timber_Log_7}{{1g}{2}}
\newlabel{sub@fig:Timber_Log_7}{{g}{2}}
\newlabel{fig:Timber_Log_8}{{1h}{2}}
\newlabel{sub@fig:Timber_Log_8}{{h}{2}}
\newlabel{fig:Timber_Log_9}{{1i}{2}}
\newlabel{sub@fig:Timber_Log_9}{{i}{2}}
\newlabel{fig:Timber_Log_10}{{1j}{2}}
\newlabel{sub@fig:Timber_Log_10}{{j}{2}}
