- limiti al numero di pacchetti che si possono inviare su ttn

- come fare un "gateway" con un singolo wemos (per fare testing)

- come girare pacchetti su un proprio mqtt

- si può fare traffico non crittato su rete propria?

- architettura ttn, come cavolo è fatta? "giro del fumo" completo

- lib LMIC Brianza, obbligata o si può usare qualcosa di standard?

- board "nodo" diverse?

- come testare un gw?

- sketch esempio per fare testing

- è cambiato qualcosa nella rete ttn? ci pare di avere meno portata

- come interrogare un gw? posso farlo anche senza avere una chiave/app? ci sono info di stato pubbliche?

- batteria che aveva nominato?

- come leggere log?

mag 15 22:50:07 lora ttn-gateway[7303]: ### [UPSTREAM] ###
mag 15 22:50:07 lora ttn-gateway[7303]: # RF packets received by concentrator: 0
mag 15 22:50:07 lora ttn-gateway[7303]: # CRC_OK: 0.00%, CRC_FAIL: 0.00%, NO_CRC: 0.00%
mag 15 22:50:07 lora ttn-gateway[7303]: # RF packets forwarded: 0 (0 bytes)
mag 15 22:50:07 lora ttn-gateway[7303]: # PUSH_DATA datagrams sent: 1 (220 bytes)
mag 15 22:50:07 lora ttn-gateway[7303]: # PUSH_DATA acknowledged: 100.00%
mag 15 22:50:07 lora ttn-gateway[7303]: ### [DOWNSTREAM] ###
mag 15 22:50:07 lora ttn-gateway[7303]: # PULL_DATA sent: 3 (100.00% acknowledged)
mag 15 22:50:07 lora ttn-gateway[7303]: # PULL_RESP(onse) datagrams received: 0 (0 bytes)
mag 15 22:50:07 lora ttn-gateway[7303]: # RF packets sent to concentrator: 0 (0 bytes)
mag 15 22:50:07 lora ttn-gateway[7303]: # TX errors: 0
mag 15 22:50:07 lora ttn-gateway[7303]: ### [GPS] ###
mag 15 22:50:07 lora ttn-gateway[7303]: # Invalid gps time reference (age: 1557953347 sec)
mag 15 22:50:07 lora ttn-gateway[7303]: # Manual GPS coordinates: latitude 45.54298, longitude 9.16831, altitude 166 m
mag 15 22:50:07 lora ttn-gateway[7303]: ##### END #####
mag 15 22:50:07 lora ttn-gateway[7303]: INFO: [up] PUSH_ACK for server router.eu.thethings.network received in 44 ms
mag 15 22:50:07 lora ttn-gateway[7303]: INFO: [down] for server router.eu.thethings.network PULL_ACK received in 45 ms
mag 15 22:50:07 lora ttn-gateway[7303]: INFO: [down] for server router.eu.thethings.network PULL_ACK received in 43 ms
mag 15 22:50:07 lora ttn-gateway[7303]: INFO: [down] for server router.eu.thethings.network PULL_ACK received in 44 ms
mag 15 22:50:07 lora ttn-gateway[7303]: ##### 2019-05-15 20:49:37 GMT #####
mag 15 22:50:07 lora ttn-gateway[7303]: ### [UPSTREAM] ###
mag 15 22:50:07 lora ttn-gateway[7303]: # RF packets received by concentrator: 0
mag 15 22:50:07 lora ttn-gateway[7303]: # CRC_OK: 0.00%, CRC_FAIL: 0.00%, NO_CRC: 0.00%
mag 15 22:50:07 lora ttn-gateway[7303]: # RF packets forwarded: 0 (0 bytes)
mag 15 22:50:07 lora ttn-gateway[7303]: # PUSH_DATA datagrams sent: 1 (220 bytes)
mag 15 22:50:07 lora ttn-gateway[7303]: # PUSH_DATA acknowledged: 100.00%
mag 15 22:50:07 lora ttn-gateway[7303]: ### [DOWNSTREAM] ###
mag 15 22:50:07 lora ttn-gateway[7303]: # PULL_DATA sent: 3 (100.00% acknowledged)
mag 15 22:50:07 lora ttn-gateway[7303]: # PULL_RESP(onse) datagrams received: 0 (0 bytes)
mag 15 22:50:07 lora ttn-gateway[7303]: # RF packets sent to concentrator: 0 (0 bytes)
mag 15 22:50:07 lora ttn-gateway[7303]: # TX errors: 0
mag 15 22:50:07 lora ttn-gateway[7303]: ### [GPS] ###
mag 15 22:50:07 lora ttn-gateway[7303]: # Invalid gps time reference (age: 1557953377 sec)
mag 15 22:50:07 lora ttn-gateway[7303]: # Manual GPS coordinates: latitude 45.54298, longitude 9.16831, altitude 166 m
mag 15 22:50:07 lora ttn-gateway[7303]: ##### END #####
mag 15 22:50:07 lora ttn-gateway[7303]: INFO: [up] PUSH_ACK for server router.eu.thethings.network received in 45 ms
mag 15 22:50:07 lora ttn-gateway[7303]: INFO: [down] for server router.eu.thethings.network PULL_ACK received in 44 ms
mag 15 22:50:07 lora ttn-gateway[7303]: INFO: [up] PUSH_ACK for server router.eu.thethings.network received in 46 ms
mag 15 22:50:07 lora ttn-gateway[7303]: INFO: [down] for server router.eu.thethings.network PULL_ACK received in 45 ms
mag 15 22:50:07 lora ttn-gateway[7303]: INFO: [down] for server router.eu.thethings.network PULL_ACK received in 44 ms
mag 15 22:50:07 lora ttn-gateway[7303]: ##### 2019-05-15 20:50:07 GMT #####
mag 15 22:50:07 lora ttn-gateway[7303]: ### [UPSTREAM] ###
  
