6 angstroem
free
O       99.814000000   100.835000000   101.232000000
H       99.329200000    99.976800000   101.063000000
H       99.151600000   101.561000000   101.414000000
O       98.804000000    98.512200000    97.758100000
H       99.782100000    98.646900000    97.916700000
H       98.421800000    99.326500000    97.321300000
