# Counts predicted by the Béthermin et al. (2012) model
# 1: Snu [Jy]
# 2: dN/dSnu total [gal/Jy/sr]
# 3: N(>Snu) total [gal/sr]
# 4: dN/dSnu main sequence [gal/Jy/sr]
# 5: dN/dSnu starburst [gal/Jy/sr]
# 6: dN/dSnu lensed galaxies [gal/Jy/sr]
# 7: dN/dSnu lensed main sequence [gal/Jy/sr]
# 8: dN/dSnu lensed starburst [gal/Jy/sr]
1.00000E-08  2.15119E+16  1.53717E+09  2.08209E+16  6.91046E+14  3.78532E+13  3.65781E+13  1.27507E+12
1.12202E-08  1.89022E+16  1.51252E+09  1.82950E+16  6.07206E+14  3.32605E+13  3.21401E+13  1.12036E+12
1.25893E-08  1.66091E+16  1.48805E+09  1.60756E+16  5.33540E+14  2.92250E+13  2.82406E+13  9.84420E+11
1.41254E-08  1.45943E+16  1.46392E+09  1.41255E+16  4.68811E+14  2.56792E+13  2.48142E+13  8.64977E+11
1.58489E-08  1.28239E+16  1.44014E+09  1.24120E+16  4.11937E+14  2.25637E+13  2.18036E+13  7.60029E+11
1.77828E-08  1.12683E+16  1.41669E+09  1.09064E+16  3.61962E+14  1.98261E+13  1.91583E+13  6.67813E+11
1.99526E-08  9.90147E+15  1.39356E+09  9.58342E+15  3.18052E+14  1.74207E+13  1.68339E+13  5.86787E+11
2.23872E-08  8.70047E+15  1.37077E+09  8.42100E+15  2.79469E+14  1.53072E+13  1.47916E+13  5.15593E+11
2.51189E-08  7.64516E+15  1.34830E+09  7.39960E+15  2.45567E+14  1.34501E+13  1.29971E+13  4.53036E+11
2.81838E-08  6.71791E+15  1.32614E+09  6.50213E+15  2.15779E+14  1.18184E+13  1.14203E+13  3.98071E+11
3.16228E-08  5.90314E+15  1.30429E+09  5.71353E+15  1.89605E+14  1.03846E+13  1.00348E+13  3.49774E+11
3.54814E-08  5.18722E+15  1.28275E+09  5.02061E+15  1.66606E+14  9.12479E+12  8.81746E+12  3.07338E+11
3.98107E-08  4.55816E+15  1.26152E+09  4.41176E+15  1.46398E+14  8.01785E+12  7.74780E+12  2.70051E+11
4.46684E-08  4.00541E+15  1.24058E+09  3.87677E+15  1.28642E+14  7.04520E+12  6.80792E+12  2.37288E+11
5.01187E-08  3.51972E+15  1.21993E+09  3.40668E+15  1.13040E+14  6.19058E+12  5.98208E+12  2.08500E+11
5.62341E-08  3.09295E+15  1.19958E+09  2.99362E+15  9.93302E+13  5.43963E+12  5.25643E+12  1.83205E+11
6.30958E-08  2.71795E+15  1.17951E+09  2.63067E+15  8.72841E+13  4.77980E+12  4.61882E+12  1.60979E+11
7.07946E-08  2.38844E+15  1.15972E+09  2.31174E+15  7.66995E+13  4.20003E+12  4.05858E+12  1.41450E+11
7.94328E-08  2.09890E+15  1.14021E+09  2.03151E+15  6.73988E+13  3.69060E+12  3.56631E+12  1.24291E+11
8.91251E-08  1.84449E+15  1.12098E+09  1.78526E+15  5.92265E+13  3.24297E+12  3.13376E+12  1.09213E+11
1.00000E-07  1.62093E+15  1.10201E+09  1.56888E+15  5.20456E+13  2.84965E+12  2.75369E+12  9.59651E+10
1.12202E-07  1.42449E+15  1.08331E+09  1.37875E+15  4.57357E+13  2.50405E+12  2.41973E+12  8.43243E+10
1.25893E-07  1.25187E+15  1.06486E+09  1.21168E+15  4.01913E+13  2.20038E+12  2.12629E+12  7.40959E+10
1.41254E-07  1.10019E+15  1.04668E+09  1.06487E+15  3.53194E+13  1.93355E+12  1.86844E+12  6.51084E+10
1.58489E-07  9.66903E+14  1.02875E+09  9.35864E+14  3.10385E+13  1.69909E+12  1.64188E+12  5.72114E+10
1.77828E-07  8.49780E+14  1.01107E+09  8.22504E+14  2.72768E+13  1.49307E+12  1.44280E+12  5.02724E+10
1.99526E-07  7.46861E+14  9.93630E+08  7.22889E+14  2.39713E+13  1.31204E+12  1.26787E+12  4.41753E+10
2.23872E-07  6.56421E+14  9.76435E+08  6.35355E+14  2.10668E+13  1.15298E+12  1.11416E+12  3.88179E+10
2.51189E-07  5.76947E+14  9.59479E+08  5.58433E+14  1.85145E+13  1.01321E+12  9.79096E+11  3.41104E+10
2.81838E-07  5.07109E+14  9.42758E+08  4.90837E+14  1.62717E+13  8.90391E+11  8.60417E+11  2.99741E+10
3.16228E-07  4.45737E+14  9.26267E+08  4.31436E+14  1.43009E+13  7.82471E+11  7.56131E+11  2.63395E+10
3.54814E-07  3.91805E+14  9.10003E+08  3.79236E+14  1.25691E+13  6.87640E+11  6.64495E+11  2.31458E+10
3.98107E-07  3.44410E+14  8.93962E+08  3.33363E+14  1.10473E+13  6.04313E+11  5.83973E+11  2.03396E+10
4.46684E-07  3.02759E+14  8.78142E+08  2.93049E+14  9.70993E+12  5.31091E+11  5.13217E+11  1.78738E+10
5.01187E-07  2.66156E+14  8.62538E+08  2.57622E+14  8.53475E+12  4.66749E+11  4.51042E+11  1.57071E+10
5.62341E-07  2.33988E+14  8.47146E+08  2.26486E+14  7.50201E+12  4.10210E+11  3.96407E+11  1.38032E+10
6.30958E-07  2.05718E+14  8.31964E+08  1.99124E+14  6.59446E+12  3.60527E+11  3.48397E+11  1.21302E+10
7.07946E-07  1.80873E+14  8.16987E+08  1.75076E+14  5.79691E+12  3.16869E+11  3.06209E+11  1.06602E+10
7.94328E-07  1.59036E+14  8.02212E+08  1.53940E+14  5.09602E+12  2.78504E+11  2.69135E+11  9.36844E+09
8.91251E-07  1.39845E+14  7.87636E+08  1.35365E+14  4.48006E+12  2.44791E+11  2.36557E+11  8.23336E+09
1.00000E-06  1.22977E+14  7.73255E+08  1.19038E+14  3.93873E+12  2.15164E+11  2.07929E+11  7.23592E+09
1.12202E-06  1.08151E+14  7.59066E+08  1.04688E+14  3.46297E+12  1.89130E+11  1.82770E+11  6.35945E+09
1.25893E-06  9.51201E+13  7.45064E+08  9.20753E+13  3.04485E+12  1.66251E+11  1.60661E+11  5.58926E+09
1.41254E-06  8.36660E+13  7.31247E+08  8.09886E+13  2.67737E+12  1.46145E+11  1.41232E+11  4.91247E+09
1.58489E-06  7.35976E+13  7.17611E+08  7.12432E+13  2.35439E+12  1.28475E+11  1.24158E+11  4.31773E+09
1.77828E-06  6.47469E+13  7.04152E+08  6.26764E+13  2.07051E+12  1.12947E+11  1.09152E+11  3.79510E+09
1.99526E-06  5.69665E+13  6.90867E+08  5.51455E+13  1.82100E+12  9.93002E+10  9.59644E+10  3.33582E+09
2.23872E-06  5.01267E+13  6.77752E+08  4.85250E+13  1.60168E+12  8.73066E+10  8.43743E+10  2.93222E+09
2.51189E-06  4.41135E+13  6.64804E+08  4.27046E+13  1.40890E+12  7.67658E+10  7.41883E+10  2.57754E+09
2.81838E-06  3.88267E+13  6.52018E+08  3.75873E+13  1.23943E+12  6.75016E+10  6.52358E+10  2.26585E+09
3.16228E-06  3.41784E+13  6.39392E+08  3.30879E+13  1.09046E+12  5.93591E+10  5.73672E+10  1.99193E+09
3.54814E-06  3.00911E+13  6.26921E+08  2.91316E+13  9.59504E+11  5.22024E+10  5.04512E+10  1.75120E+09
3.98108E-06  2.64970E+13  6.14602E+08  2.56526E+13  8.44372E+11  4.59120E+10  4.43724E+10  1.53963E+09
4.46684E-06  2.33364E+13  6.02430E+08  2.25932E+13  7.43151E+11  4.03829E+10  3.90292E+10  1.35370E+09
5.01187E-06  2.05568E+13  5.90403E+08  1.99026E+13  6.54155E+11  3.55228E+10  3.43325E+10  1.19029E+09
5.62341E-06  1.81120E+13  5.78515E+08  1.75361E+13  5.75902E+11  3.12505E+10  3.02038E+10  1.04666E+09
6.30958E-06  1.59615E+13  5.66763E+08  1.54544E+13  5.07093E+11  2.74948E+10  2.65744E+10  9.20428E+08
7.07946E-06  1.40698E+13  5.55143E+08  1.36232E+13  4.46583E+11  2.41932E+10  2.33837E+10  8.09476E+08
7.94328E-06  1.24056E+13  5.43650E+08  1.20122E+13  3.93368E+11  2.12906E+10  2.05787E+10  7.11953E+08
8.91251E-06  1.09413E+13  5.32280E+08  1.05948E+13  3.46566E+11  1.87387E+10  1.81125E+10  6.26232E+08
1.00000E-05  9.65282E+12  5.21028E+08  9.34742E+12  3.05399E+11  1.64950E+10  1.59441E+10  5.50880E+08
1.12202E-05  8.51886E+12  5.09890E+08  8.24968E+12  2.69187E+11  1.45221E+10  1.40375E+10  4.84643E+08
1.25893E-05  7.52078E+12  4.98861E+08  7.28345E+12  2.37329E+11  1.27873E+10  1.23609E+10  4.26414E+08
1.41254E-05  6.64218E+12  4.87937E+08  6.43288E+12  2.09300E+11  1.12617E+10  1.08865E+10  3.75225E+08
1.58489E-05  5.86862E+12  4.77111E+08  5.68398E+12  1.84637E+11  9.92003E+09  9.58981E+09  3.30221E+08
1.77828E-05  5.18743E+12  4.66379E+08  5.02450E+12  1.62932E+11  8.74000E+09  8.44935E+09  2.90654E+08
1.99526E-05  4.58748E+12  4.55735E+08  4.44365E+12  1.43829E+11  7.70206E+09  7.44620E+09  2.55864E+08
2.23872E-05  4.05897E+12  4.45174E+08  3.93195E+12  1.27013E+11  6.78902E+09  6.56375E+09  2.25274E+08
2.51189E-05  3.59329E+12  4.34689E+08  3.48108E+12  1.12208E+11  5.98578E+09  5.78741E+09  1.98374E+08
2.81838E-05  3.18288E+12  4.24275E+08  3.08371E+12  9.91716E+10  5.27906E+09  5.10434E+09  1.74718E+08
3.16228E-05  2.82107E+12  4.13924E+08  2.73338E+12  8.76900E+10  4.65718E+09  4.50326E+09  1.53914E+08
3.54814E-05  2.50203E+12  4.03631E+08  2.42445E+12  7.75759E+10  4.10989E+09  3.97428E+09  1.35615E+08
3.98108E-05  2.22059E+12  3.93388E+08  2.15193E+12  6.86645E+10  3.62819E+09  3.50867E+09  1.19519E+08
4.46684E-05  1.97225E+12  3.83187E+08  1.91144E+12  6.08107E+10  3.20416E+09  3.09880E+09  1.05360E+08
5.01187E-05  1.75301E+12  3.73022E+08  1.69912E+12  5.38872E+10  2.83083E+09  2.73793E+09  9.29033E+07
5.62341E-05  1.55937E+12  3.62885E+08  1.51159E+12  4.77817E+10  2.50209E+09  2.42014E+09  8.19426E+07
6.30958E-05  1.38826E+12  3.52767E+08  1.34586E+12  4.23958E+10  2.21254E+09  2.14025E+09  7.22976E+07
7.07946E-05  1.23695E+12  3.42660E+08  1.19931E+12  3.76428E+10  1.95748E+09  1.89367E+09  6.38091E+07
7.94328E-05  1.10306E+12  3.32556E+08  1.06962E+12  3.34464E+10  1.73274E+09  1.67640E+09  5.63376E+07
8.91251E-05  9.84492E+11  3.22446E+08  9.54753E+11  2.97396E+10  1.53467E+09  1.48491E+09  4.97601E+07
1.00000E-04  8.79382E+11  3.12322E+08  8.52918E+11  2.64631E+10  1.36005E+09  1.31608E+09  4.39687E+07
1.12202E-04  7.86099E+11  3.02175E+08  7.62534E+11  2.35653E+10  1.20605E+09  1.16718E+09  3.88686E+07
1.25893E-04  7.03207E+11  2.91998E+08  6.82207E+11  2.10002E+10  1.07021E+09  1.03583E+09  3.43764E+07
1.41254E-04  6.29437E+11  2.81784E+08  6.10709E+11  1.87277E+10  9.50322E+08  9.19903E+08  3.04188E+07
1.58489E-04  5.63673E+11  2.71525E+08  5.46961E+11  1.67123E+10  8.44474E+08  8.17543E+08  2.69312E+07
1.77828E-04  5.04937E+11  2.61217E+08  4.90014E+11  1.49230E+10  7.50974E+08  7.27116E+08  2.38572E+07
1.99526E-04  4.52367E+11  2.50856E+08  4.39035E+11  1.33323E+10  6.68332E+08  6.47185E+08  2.11467E+07
2.23872E-04  4.05212E+11  2.40442E+08  3.93296E+11  1.19162E+10  5.95241E+08  5.76485E+08  1.87560E+07
2.51189E-04  3.62814E+11  2.29975E+08  3.52160E+11  1.06535E+10  5.30546E+08  5.13900E+08  1.66466E+07
2.81838E-04  3.24604E+11  2.19459E+08  3.15078E+11  9.52583E+09  4.73235E+08  4.58450E+08  1.47845E+07
3.16228E-04  2.90092E+11  2.08903E+08  2.81575E+11  8.51700E+09  4.22414E+08  4.09274E+08  1.31400E+07
3.54814E-04  2.58856E+11  1.98318E+08  2.51243E+11  7.61286E+09  3.77296E+08  3.65610E+08  1.16867E+07
3.98107E-04  2.30536E+11  1.87721E+08  2.23735E+11  6.80115E+09  3.37191E+08  3.26790E+08  1.04017E+07
4.46684E-04  2.04830E+11  1.77131E+08  1.98759E+11  6.07119E+09  3.01490E+08  2.92225E+08  9.26454E+06
5.01188E-04  1.81481E+11  1.66574E+08  1.76067E+11  5.41375E+09  2.69658E+08  2.61400E+08  8.25740E+06
5.62341E-04  1.60274E+11  1.56079E+08  1.55453E+11  4.82086E+09  2.41226E+08  2.33862E+08  7.36456E+06
6.30958E-04  1.41028E+11  1.45680E+08  1.36742E+11  4.28562E+09  2.15785E+08  2.09212E+08  6.57217E+06
7.07946E-04  1.23588E+11  1.35413E+08  1.19786E+11  3.80212E+09  1.92974E+08  1.87106E+08  5.86808E+06
7.94328E-04  1.07823E+11  1.25318E+08  1.04458E+11  3.36525E+09  1.72482E+08  1.67240E+08  5.24162E+06
8.91252E-04  9.36155E+10  1.15435E+08  9.06449E+10  2.97060E+09  1.54037E+08  1.49354E+08  4.68340E+06
1.00000E-03  8.08603E+10  1.05808E+08  7.82459E+10  2.61435E+09  1.37407E+08  1.33221E+08  4.18522E+06
1.12202E-03  6.94592E+10  9.64783E+07  6.71661E+10  2.29317E+09  1.22388E+08  1.18648E+08  3.73989E+06
1.25893E-03  5.93192E+10  8.74859E+07  5.73151E+10  2.00411E+09  1.08808E+08  1.05467E+08  3.34115E+06
1.41254E-03  5.03496E+10  7.88693E+07  4.86050E+10  1.74457E+09  9.65212E+07  9.35377E+07  2.98351E+06
1.58489E-03  4.24614E+10  7.06631E+07  4.09492E+10  1.51218E+09  8.54003E+07  8.27380E+07  2.66224E+06
1.77828E-03  3.55672E+10  6.28981E+07  3.42624E+10  1.30479E+09  7.53383E+07  7.29651E+07  2.37321E+06
1.99526E-03  2.95807E+10  5.56003E+07  2.84603E+10  1.12041E+09  6.62429E+07  6.41300E+07  2.11286E+06
2.23872E-03  2.44178E+10  4.87902E+07  2.34606E+10  9.57180E+08  5.80343E+07  5.61562E+07  1.87812E+06
2.51189E-03  1.99967E+10  4.24828E+07  1.91834E+10  8.13330E+08  5.06423E+07  4.89760E+07  1.66632E+06
2.81838E-03  1.62392E+10  3.66871E+07  1.55520E+10  6.87193E+08  4.40042E+07  4.25290E+07  1.47517E+06
3.16228E-03  1.30706E+10  3.14062E+07  1.24934E+10  5.77180E+08  3.80632E+07  3.67605E+07  1.30270E+06
3.54814E-03  1.04208E+10  2.66370E+07  9.93902E+09  4.81771E+08  3.27663E+07  3.16191E+07  1.14718E+06
3.98107E-03  8.22456E+09  2.23708E+07  7.82504E+09  3.99525E+08  2.80641E+07  2.70570E+07  1.00710E+06
4.46684E-03  6.42145E+09  1.85928E+07  6.09238E+09  3.29072E+08  2.39093E+07  2.30281E+07  8.81141E+05
5.01188E-03  4.95618E+09  1.52832E+07  4.68706E+09  2.69120E+08  2.02565E+07  1.94883E+07  7.68121E+05
5.62341E-03  3.77854E+09  1.24171E+07  3.56008E+09  2.18460E+08  1.70622E+07  1.63952E+07  6.66975E+05
6.30958E-03  2.84324E+09  9.96540E+06  2.66728E+09  1.75961E+08  1.42845E+07  1.37078E+07  5.76731E+05
7.07946E-03  2.10991E+09  7.89547E+06  1.96933E+09  1.40581E+08  1.18834E+07  1.13869E+07  4.96497E+05
7.94328E-03  1.54283E+09  6.17198E+06  1.43147E+09  1.11362E+08  9.82062E+06  9.39518E+06  4.25436E+05
8.91252E-03  1.11078E+09  4.75792E+06  1.02335E+09  8.74332E+07  8.06004E+06  7.69727E+06  3.62766E+05
1.00000E-02  7.86803E+08  3.61564E+06  7.18794E+08  6.80085E+07  6.56764E+06  6.25988E+06  3.07751E+05
1.12202E-02  5.47937E+08  2.70780E+06  4.95552E+08  5.23850E+07  5.31161E+06  5.05192E+06  2.59689E+05
1.25893E-02  3.74957E+08  1.99843E+06  3.35016E+08  3.99404E+07  4.26253E+06  4.04461E+06  2.17919E+05
1.41254E-02  2.52026E+08  1.45377E+06  2.21898E+08  3.01282E+07  3.39323E+06  3.21142E+06  1.81815E+05
1.58489E-02  1.66366E+08  1.04300E+06  1.43893E+08  2.24739E+07  2.67893E+06  2.52815E+06  1.50787E+05
1.77828E-02  1.07878E+08  7.38768E+05  9.13079E+07  1.65696E+07  2.09714E+06  1.97286E+06  1.24281E+05
1.99526E-02  6.87578E+07  5.17420E+05  5.66894E+07  1.20683E+07  1.62759E+06  1.52581E+06  1.01780E+05
2.23872E-02  4.31299E+07  3.59125E+05  3.44510E+07  8.67887E+06  1.25223E+06  1.16943E+06  8.28025E+04
2.51189E-02  2.66772E+07  2.47716E+05  2.05180E+07  6.15926E+06  9.55102E+05  8.88196E+05  6.69059E+04
2.81838E-02  1.63158E+07  1.70397E+05  1.20044E+07  4.31137E+06  7.22241E+05  6.68557E+05  5.36837E+04
3.16228E-02  9.90237E+06  1.17338E+05  6.92727E+06  2.97510E+06  5.41591E+05  4.98824E+05  4.27666E+04
3.54814E-02  5.98969E+06  8.12071E+04  3.96686E+06  2.02284E+06  4.02852E+05  3.69031E+05  3.38208E+04
3.98107E-02  3.62791E+06  5.66855E+04  2.27338E+06  1.35453E+06  2.97359E+05  2.70811E+05  2.65475E+04
4.46684E-02  2.21050E+06  4.00207E+04  1.31764E+06  8.92866E+05  2.17913E+05  1.97232E+05  2.06815E+04
5.01188E-02  1.36017E+06  2.86277E+04  7.81037E+05  5.79138E+05  1.58633E+05  1.42643E+05  1.59894E+04
5.62341E-02  8.47458E+05  2.07620E+04  4.77937E+05  3.69522E+05  1.14779E+05  1.02511E+05  1.22678E+04
6.30958E-02  5.35289E+05  1.52633E+04  3.03407E+05  2.31883E+05  8.25929E+04  7.32519E+04  9.34094E+03
7.07946E-02  3.42779E+05  1.13662E+04  1.99675E+05  1.43105E+05  5.91397E+04  5.20808E+04  7.05892E+03
7.94328E-02  2.22374E+05  8.56622E+03  1.35503E+05  8.68718E+04  4.21581E+04  3.68632E+04  5.29491E+03
8.91252E-02  1.46021E+05  6.52810E+03  9.41193E+04  5.19016E+04  2.99312E+04  2.59882E+04  3.94299E+03
1.00000E-01  9.69839E+04  5.02648E+03  6.64342E+04  3.05497E+04  2.11706E+04  1.82549E+04  2.91565E+03
1.12202E-01  6.51268E+04  3.90744E+03  4.73812E+04  1.77456E+04  1.49202E+04  1.27788E+04  2.14141E+03
1.25893E-01  4.42093E+04  3.06429E+03  3.40100E+04  1.01993E+04  1.04776E+04  8.91501E+03  1.56261E+03
1.41254E-01  3.03302E+04  2.42211E+03  2.45080E+04  5.82218E+03  7.33069E+03  6.19743E+03  1.13326E+03
1.58489E-01  2.10222E+04  1.92778E+03  1.77042E+04  3.31799E+03  5.10876E+03  4.29162E+03  8.17132E+02
1.77828E-01  1.47104E+04  1.54334E+03  1.28103E+04  1.90013E+03  3.54494E+03  2.95895E+03  5.85989E+02
1.99526E-01  1.03819E+04  1.24151E+03  9.28015E+03  1.10175E+03  2.44794E+03  2.02985E+03  4.18088E+02
2.23872E-01  7.38092E+03  1.00250E+03  6.72920E+03  6.51715E+02  1.68120E+03  1.38434E+03  2.96868E+02
2.51189E-01  5.27910E+03  8.11838E+02  4.88341E+03  3.95691E+02  1.14748E+03  9.37645E+02  2.09839E+02
2.81838E-01  3.79392E+03  6.58832E+02  3.54654E+03  2.47380E+02  7.77726E+02  6.30044E+02  1.47681E+02
3.16228E-01  2.73670E+03  5.35456E+02  2.57752E+03  1.59181E+02  5.22976E+02  4.19478E+02  1.03498E+02
3.54814E-01  1.97970E+03  4.35600E+02  1.87466E+03  1.05042E+02  3.48594E+02  2.76366E+02  7.22283E+01
3.98107E-01  1.43526E+03  3.54552E+02  1.36456E+03  7.06996E+01  2.30124E+02  1.79933E+02  5.01906E+01
4.46684E-01  1.04238E+03  2.88623E+02  9.94131E+02  4.82517E+01  1.50330E+02  1.15609E+02  3.47209E+01
5.01188E-01  7.58186E+02  2.34899E+02  7.24966E+02  3.32196E+01  9.71088E+01  7.32039E+01  2.39049E+01
5.62341E-01  5.52207E+02  1.91054E+02  5.29230E+02  2.29764E+01  6.19942E+01  4.56207E+01  1.63735E+01
6.30958E-01  4.02666E+02  1.55224E+02  3.86748E+02  1.59173E+01  3.90975E+01  2.79458E+01  1.11517E+01
7.07946E-01  2.93925E+02  1.25909E+02  2.82903E+02  1.10220E+01  2.43549E+01  1.68064E+01  7.54849E+00
7.94328E-01  2.14716E+02  1.01899E+02  2.07098E+02  7.61822E+00  1.49866E+01  9.91154E+00  5.07505E+00
8.91252E-01  1.56913E+02  8.22201E+01  1.51662E+02  5.25129E+00  9.11341E+00  5.72625E+00  3.38716E+00
1.00000E+00  1.14633E+02  6.60838E+01  1.11027E+02  3.60787E+00  5.46632E+00  3.22590E+00  2.24294E+00
1.12202E+00  8.36550E+01  5.28571E+01  8.11917E+01  2.46976E+00  3.23857E+00  1.77205E+00  1.47297E+00
1.25893E+00  6.09182E+01  4.20268E+01  5.92453E+01  1.68415E+00  1.89497E+00  9.47098E-01  9.59070E-01
1.41254E+00  4.42165E+01  3.31778E+01  4.30844E+01  1.14385E+00  1.10242E+00  4.95019E-01  6.19089E-01
1.58489E+00  3.19296E+01  2.59713E+01  3.11716E+01  7.73688E-01  6.29430E-01  2.48831E-01  3.96262E-01
1.77828E+00  2.29057E+01  2.01323E+01  2.24013E+01  5.21040E-01  3.56442E-01  1.21485E-01  2.51594E-01
1.99526E+00  1.62991E+01  1.54324E+01  1.59616E+01  3.49263E-01  2.05743E-01  5.89683E-02  1.58558E-01
2.23872E+00  1.14788E+01  1.16800E+01  1.12528E+01  2.32921E-01  1.20673E-01  2.83041E-02  9.92712E-02
2.51189E+00  7.98347E+00  8.71489E+00  7.83301E+00  1.54447E-01  7.10871E-02  1.32539E-02  6.18177E-02
2.81838E+00  5.47257E+00  6.40105E+00  5.37309E+00  1.01749E-01  4.21314E-02  6.06183E-03  3.83381E-02
3.16228E+00  3.69014E+00  4.62140E+00  3.62488E+00  6.65363E-02  2.51512E-02  2.71353E-03  2.37129E-02
3.54814E+00  2.44308E+00  3.27495E+00  2.40064E+00  4.31441E-02  1.51330E-02  1.19331E-03  1.46483E-02
3.98108E+00  1.58524E+00  2.27476E+00  1.55792E+00  2.77097E-02  9.17552E-03  5.17733E-04  9.04790E-03
4.46684E+00  1.00642E+00  1.54658E+00  9.89022E-01  1.76069E-02  5.60128E-03  2.22631E-04  5.59217E-03
5.01187E+00  6.24158E-01  1.02787E+00  6.13219E-01  1.10556E-02  3.43816E-03  9.52555E-05  3.45950E-03
5.62341E+00  3.77560E-01  6.66930E-01  3.70771E-01  6.85333E-03  2.11921E-03  4.06738E-05  2.14220E-03
6.30958E+00  2.22455E-01  4.21949E-01  2.18299E-01  4.19115E-03  1.31028E-03  1.73734E-05  1.32771E-03
7.07946E+00  1.27493E-01  2.59996E-01  1.24984E-01  2.52756E-03  8.11967E-04  7.42125E-06  8.23592E-04
7.94329E+00  7.09859E-02  1.55853E-01  6.94932E-02  1.50313E-03  5.04013E-04  3.17658E-06  5.11275E-04
8.91251E+00  3.83530E-02  9.07928E-02  3.74769E-02  8.81869E-04  3.13251E-04  1.36150E-06  3.17618E-04
1.00000E+01  2.00855E-02  5.13524E-02  1.95777E-02  5.10881E-04  1.94874E-04  5.84235E-07  1.97438E-04
1.12202E+01  1.01857E-02  2.81769E-02  9.89471E-03  2.92692E-04  1.21322E-04  2.50981E-07  1.22803E-04
1.25893E+01  4.99741E-03  1.49902E-02  4.83216E-03  1.66199E-04  7.55770E-05  1.07929E-07  7.64230E-05
1.41254E+01  2.37060E-03  7.73097E-03  2.27733E-03  9.38024E-05  4.71037E-05  4.64562E-08  4.75832E-05
1.58489E+01  1.08692E-03  3.86729E-03  1.03441E-03  5.28073E-05  2.93703E-05  2.00141E-08  2.96405E-05
1.77828E+01  4.81814E-04  1.87963E-03  4.52205E-04  2.97692E-05  1.83197E-05  8.62916E-09  1.84714E-05
1.99526E+01  2.06781E-04  8.91020E-04  1.89997E-04  1.68729E-05  1.14306E-05  3.72327E-09  1.15155E-05
2.23872E+01  8.62100E-05  4.14964E-04  7.66085E-05  9.65054E-06  7.13423E-06  1.60760E-09  7.18166E-06
2.51189E+01  3.51552E-05  1.92273E-04  2.95968E-05  5.58553E-06  4.45392E-06  6.94560E-10  4.48038E-06
2.81838E+01  1.41996E-05  9.03825E-05  1.09382E-05  3.27639E-06  2.78132E-06  3.00265E-10  2.79606E-06
3.16228E+01  5.80000E-06  4.42063E-05  3.86029E-06  1.94805E-06  1.73723E-06  1.29876E-10  1.74544E-06
3.54814E+01  2.46687E-06  2.30435E-05  1.29868E-06  1.17282E-06  1.08532E-06  5.62053E-11  1.08989E-06
3.98108E+01  1.12680E-06  1.29441E-05  4.15717E-07  7.13656E-07  6.78184E-07  2.43349E-11  6.80730E-07
4.46684E+01  5.62916E-07  7.76814E-06  1.26384E-07  4.37960E-07  4.23861E-07  1.05409E-11  4.25278E-07
5.01187E+01  3.06119E-07  4.86688E-06  3.64232E-08  2.70489E-07  2.64963E-07  4.56780E-12  2.65751E-07
5.62341E+01  1.77307E-07  3.09664E-06  9.93129E-09  1.67817E-07  1.65660E-07  1.98016E-12  1.66100E-07
6.30958E+01  1.06752E-07  1.94618E-06  2.55724E-09  1.04441E-07  1.03592E-07  8.58714E-13  1.03837E-07
7.07946E+01  6.56159E-08  1.16899E-06  6.20701E-10  6.51319E-08  6.47896E-08  3.72515E-13  6.49259E-08
7.94329E+01  4.07374E-08  6.33005E-07  1.41774E-10  4.06717E-08  4.05276E-08  1.61651E-13  4.06035E-08
8.91251E+01  2.54073E-08  2.59638E-07  3.04292E-11  2.54193E-08  2.53551E-08  7.01694E-14  2.53974E-08
# I am pretty sure nobody will read this line, but maybe I am wrong;)
