# Counts predicted by the Béthermin et al. (2012) model
# 1: Snu [Jy]
# 2: dN/dSnu total [gal/Jy/sr]
# 3: N(>Snu) total [gal/sr]
# 4: dN/dSnu main sequence [gal/Jy/sr]
# 5: dN/dSnu starburst [gal/Jy/sr]
# 6: dN/dSnu lensed galaxies [gal/Jy/sr]
# 7: dN/dSnu lensed main sequence [gal/Jy/sr]
# 8: dN/dSnu lensed starburst [gal/Jy/sr]
1.00000E-08  1.67030E+16  1.14245E+09  1.61770E+16  5.26048E+14  3.07560E+13  2.97466E+13  1.00941E+12
1.12202E-08  1.46785E+16  1.12331E+09  1.42162E+16  4.62272E+14  2.70253E+13  2.61383E+13  8.86959E+11
1.25893E-08  1.28995E+16  1.10431E+09  1.24933E+16  4.06232E+14  2.37472E+13  2.29679E+13  7.79364E+11
1.41254E-08  1.13363E+16  1.08557E+09  1.09793E+16  3.56990E+14  2.08669E+13  2.01821E+13  6.84823E+11
1.58489E-08  9.96270E+15  1.06709E+09  9.64898E+15  3.13721E+14  1.83360E+13  1.77343E+13  6.01753E+11
1.77828E-08  8.75567E+15  1.04887E+09  8.47997E+15  2.75700E+14  1.61122E+13  1.55834E+13  5.28762E+11
1.99526E-08  7.69502E+15  1.03091E+09  7.45273E+15  2.42290E+14  1.41581E+13  1.36935E+13  4.64626E+11
2.23872E-08  6.76300E+15  1.01319E+09  6.55006E+15  2.12933E+14  1.24412E+13  1.20329E+13  4.08271E+11
2.51189E-08  5.94399E+15  9.95722E+08  5.75685E+15  1.87136E+14  1.09325E+13  1.05737E+13  3.58754E+11
2.81838E-08  5.22429E+15  9.78494E+08  5.05982E+15  1.64467E+14  9.60683E+12  9.29159E+12  3.15244E+11
3.16228E-08  4.59185E+15  9.61505E+08  4.44730E+15  1.44548E+14  8.44199E+12  8.16498E+12  2.77013E+11
3.54814E-08  4.03608E+15  9.44751E+08  3.90903E+15  1.27043E+14  7.41846E+12  7.17504E+12  2.43420E+11
3.98107E-08  3.54769E+15  9.28227E+08  3.43602E+15  1.11661E+14  6.51910E+12  6.30519E+12  2.13902E+11
4.46684E-08  3.11849E+15  9.11931E+08  3.02035E+15  9.81444E+13  5.72882E+12  5.54085E+12  1.87965E+11
5.01187E-08  2.74132E+15  8.95858E+08  2.65506E+15  8.62663E+13  5.03441E+12  4.86923E+12  1.65175E+11
5.62341E-08  2.40986E+15  8.80005E+08  2.33403E+15  7.58279E+13  4.42422E+12  4.27907E+12  1.45149E+11
6.30958E-08  2.11856E+15  8.64369E+08  2.05191E+15  6.66548E+13  3.88804E+12  3.76049E+12  1.27553E+11
7.07946E-08  1.86256E+15  8.48945E+08  1.80397E+15  5.85936E+13  3.41690E+12  3.30481E+12  1.12091E+11
7.94328E-08  1.63758E+15  8.33731E+08  1.58607E+15  5.15093E+13  3.00290E+12  2.90439E+12  9.85041E+10
8.91251E-08  1.43985E+15  8.18722E+08  1.39456E+15  4.52835E+13  2.63911E+12  2.55254E+12  8.65656E+10
1.00000E-07  1.26606E+15  8.03915E+08  1.22625E+15  3.98119E+13  2.31943E+12  2.24335E+12  7.60750E+10
1.12202E-07  1.11332E+15  7.89307E+08  1.07832E+15  3.50033E+13  2.03852E+12  1.97166E+12  6.68567E+10
1.25893E-07  9.79075E+14  7.74894E+08  9.48298E+14  3.07771E+13  1.79167E+12  1.73291E+12  5.87566E+10
1.41254E-07  8.61078E+14  7.60672E+08  8.34015E+14  2.70627E+13  1.57475E+12  1.52311E+12  5.16387E+10
1.58489E-07  7.57363E+14  7.46637E+08  7.33565E+14  2.37982E+13  1.38413E+12  1.33875E+12  4.53840E+10
1.77828E-07  6.66196E+14  7.32788E+08  6.45267E+14  2.09288E+13  1.21662E+12  1.17673E+12  3.98877E+10
1.99526E-07  5.86058E+14  7.19118E+08  5.67651E+14  1.84068E+13  1.06941E+12  1.03436E+12  3.50579E+10
2.23872E-07  5.15612E+14  7.05626E+08  4.99422E+14  1.61900E+13  9.40052E+11  9.09238E+11  3.08137E+10
2.51189E-07  4.53682E+14  6.92307E+08  4.39441E+14  1.42414E+13  8.26369E+11  7.99285E+11  2.70840E+10
2.81838E-07  3.99238E+14  6.79158E+08  3.86710E+14  1.25285E+13  7.26463E+11  7.02657E+11  2.38065E+10
3.16228E-07  3.51372E+14  6.66175E+08  3.40349E+14  1.10228E+13  6.38663E+11  6.17736E+11  2.09263E+10
3.54814E-07  3.09287E+14  6.53354E+08  2.99588E+14  9.69908E+12  5.61500E+11  5.43105E+11  1.83952E+10
3.98107E-07  2.72283E+14  6.40692E+08  2.63748E+14  8.53537E+12  4.93686E+11  4.77515E+11  1.61708E+10
4.46684E-07  2.39745E+14  6.28185E+08  2.32233E+14  7.51223E+12  4.34085E+11  4.19869E+11  1.42160E+10
5.01187E-07  2.11132E+14  6.15828E+08  2.04520E+14  6.61268E+12  3.81703E+11  3.69205E+11  1.24981E+10
5.62341E-07  1.85969E+14  6.03619E+08  1.80147E+14  5.82171E+12  3.35663E+11  3.24674E+11  1.09883E+10
6.30958E-07  1.63838E+14  5.91552E+08  1.58711E+14  5.12619E+12  2.95197E+11  2.85535E+11  9.66135E+09
7.07946E-07  1.44372E+14  5.79624E+08  1.39857E+14  4.51457E+12  2.59629E+11  2.51134E+11  8.49515E+09
7.94328E-07  1.27249E+14  5.67831E+08  1.23272E+14  3.97667E+12  2.28365E+11  2.20895E+11  7.47017E+09
8.91251E-07  1.12186E+14  5.56169E+08  1.08682E+14  3.50359E+12  2.00884E+11  1.94314E+11  6.56931E+09
1.00000E-06  9.89324E+13  5.44632E+08  9.58449E+13  3.08748E+12  1.76726E+11  1.70949E+11  5.77749E+09
1.12202E-06  8.72708E+13  5.33217E+08  8.45494E+13  2.72144E+12  1.55490E+11  1.50409E+11  5.08150E+09
1.25893E-06  7.70084E+13  5.21918E+08  7.46090E+13  2.39942E+12  1.36821E+11  1.32351E+11  4.46974E+09
1.41254E-06  6.79763E+13  5.10732E+08  6.58602E+13  2.11609E+12  1.20408E+11  1.16476E+11  3.93199E+09
1.58489E-06  6.00258E+13  4.99653E+08  5.81590E+13  1.86679E+12  1.05978E+11  1.02519E+11  3.45927E+09
1.77828E-06  5.30262E+13  4.88676E+08  5.13788E+13  1.64738E+12  9.32910E+10  9.02473E+10  3.04371E+09
1.99526E-06  4.68629E+13  4.77796E+08  4.54086E+13  1.45427E+12  8.21350E+10  7.94566E+10  2.67838E+09
2.23872E-06  4.14349E+13  4.67007E+08  4.01506E+13  1.28428E+12  7.23251E+10  6.99679E+10  2.35719E+09
2.51189E-06  3.66535E+13  4.56304E+08  3.55189E+13  1.13462E+12  6.36984E+10  6.16236E+10  2.07480E+09
2.81838E-06  3.24409E+13  4.45681E+08  3.14381E+13  1.00283E+12  5.61115E+10  5.42850E+10  1.82651E+09
3.16228E-06  2.87284E+13  4.35131E+08  2.78416E+13  8.86748E+11  4.94386E+10  4.78304E+10  1.60819E+09
3.54814E-06  2.54557E+13  4.24649E+08  2.46712E+13  7.84489E+11  4.35691E+10  4.21529E+10  1.41620E+09
3.98108E-06  2.25699E+13  4.14227E+08  2.18755E+13  6.94383E+11  3.84058E+10  3.71584E+10  1.24736E+09
4.46684E-06  2.00244E+13  4.03860E+08  1.94095E+13  6.14963E+11  3.38634E+10  3.27645E+10  1.09888E+09
5.01187E-06  1.77782E+13  3.93539E+08  1.72333E+13  5.44941E+11  2.98667E+10  2.88984E+10  9.68272E+08
5.62341E-06  1.57952E+13  3.83258E+08  1.53120E+13  4.83183E+11  2.63497E+10  2.54963E+10  8.53389E+08
6.30958E-06  1.40436E+13  3.73010E+08  1.36149E+13  4.28692E+11  2.32546E+10  2.25023E+10  7.52325E+08
7.07946E-06  1.24956E+13  3.62785E+08  1.21150E+13  3.80592E+11  2.05303E+10  1.98669E+10  6.63408E+08
7.94328E-06  1.11265E+13  3.52578E+08  1.07884E+13  3.38112E+11  1.81320E+10  1.75469E+10  5.85172E+08
8.91251E-06  9.91477E+12  3.42381E+08  9.61420E+12  3.00572E+11  1.60205E+10  1.55042E+10  5.16323E+08
1.00000E-05  8.84130E+12  3.32185E+08  8.57393E+12  2.67376E+11  1.41610E+10  1.37053E+10  4.55728E+08
1.12202E-05  7.88936E+12  3.21983E+08  7.65136E+12  2.37998E+11  1.25232E+10  1.21208E+10  4.02388E+08
1.25893E-05  7.04417E+12  3.11770E+08  6.83220E+12  2.11978E+11  1.10802E+10  1.07248E+10  3.55429E+08
1.41254E-05  6.29280E+12  3.01537E+08  6.10389E+12  1.88909E+11  9.80876E+09  9.49468E+09  3.14079E+08
1.58489E-05  5.62384E+12  2.91281E+08  5.45540E+12  1.68434E+11  8.68801E+09  8.41035E+09  2.77661E+08
1.77828E-05  5.02728E+12  2.80997E+08  4.87704E+12  1.50240E+11  7.69982E+09  7.45424E+09  2.45579E+08
1.99526E-05  4.49440E+12  2.70681E+08  4.36035E+12  1.34053E+11  6.82821E+09  6.61090E+09  2.17311E+08
2.23872E-05  4.01755E+12  2.60334E+08  3.89792E+12  1.19631E+11  6.05913E+09  5.86673E+09  1.92397E+08
2.51189E-05  3.59007E+12  2.49956E+08  3.48331E+12  1.06764E+11  5.38021E+09  5.20978E+09  1.70430E+08
2.81838E-05  3.20618E+12  2.39551E+08  3.11091E+12  9.52689E+10  4.78058E+09  4.62952E+09  1.51057E+08
3.16228E-05  2.86087E+12  2.29125E+08  2.77589E+12  8.49840E+10  4.25065E+09  4.11668E+09  1.33964E+08
3.54814E-05  2.54982E+12  2.18686E+08  2.47405E+12  7.57699E+10  3.78202E+09  3.66314E+09  1.18875E+08
3.98108E-05  2.26930E+12  2.08248E+08  2.20179E+12  6.75052E+10  3.36729E+09  3.26174E+09  1.05550E+08
4.46684E-05  2.01611E+12  1.97823E+08  1.95602E+12  6.00844E+10  2.99995E+09  2.90617E+09  9.37754E+07
5.01187E-05  1.78748E+12  1.87433E+08  1.73407E+12  5.34157E+10  2.67427E+09  2.59090E+09  8.33641E+07
5.62341E-05  1.58105E+12  1.77096E+08  1.53363E+12  4.74195E+10  2.38522E+09  2.31107E+09  7.41517E+07
6.30958E-05  1.39474E+12  1.66837E+08  1.35271E+12  4.20264E+10  2.12839E+09  2.06239E+09  6.59940E+07
7.07946E-05  1.22676E+12  1.56683E+08  1.18959E+12  3.71762E+10  1.89990E+09  1.84113E+09  5.87641E+07
7.94328E-05  1.07553E+12  1.46662E+08  1.04272E+12  3.28157E+10  1.69636E+09  1.64401E+09  5.23504E+07
8.91251E-05  9.39647E+11  1.36805E+08  9.10748E+11  2.88985E+10  1.51478E+09  1.46813E+09  4.66552E+07
1.00000E-04  8.17833E+11  1.27142E+08  7.92450E+11  2.53833E+10  1.35257E+09  1.31098E+09  4.15925E+07
1.12202E-04  7.08942E+11  1.17705E+08  6.86708E+11  2.22334E+10  1.20745E+09  1.17037E+09  3.70871E+07
1.25893E-04  6.11915E+11  1.08527E+08  5.92499E+11  1.94159E+10  1.07745E+09  1.04437E+09  3.30730E+07
1.41254E-04  5.25768E+11  9.96384E+07  5.08867E+11  1.69008E+10  9.60815E+08  9.31323E+08  2.94925E+07
1.58489E-04  4.49581E+11  9.10692E+07  4.34920E+11  1.46613E+10  8.56058E+08  8.29763E+08  2.62949E+07
1.77828E-04  3.82494E+11  8.28477E+07  3.69821E+11  1.26725E+10  7.61865E+08  7.38429E+08  2.34360E+07
1.99526E-04  3.23691E+11  7.49995E+07  3.12779E+11  1.09117E+10  6.77096E+08  6.56219E+08  2.08772E+07
2.23872E-04  2.72406E+11  6.75474E+07  2.63048E+11  9.35788E+09  6.00762E+08  5.82178E+08  1.85847E+07
2.51189E-04  2.27915E+11  6.05109E+07  2.19923E+11  7.99158E+09  5.32001E+08  5.15472E+08  1.65288E+07
2.81838E-04  1.89534E+11  5.39052E+07  1.82739E+11  6.79480E+09  4.70061E+08  4.55377E+08  1.46840E+07
3.16228E-04  1.56623E+11  4.77416E+07  1.50872E+11  5.75082E+09  4.14290E+08  4.01263E+08  1.30275E+07
3.54814E-04  1.28578E+11  4.20268E+07  1.23734E+11  4.84408E+09  3.64113E+08  3.52573E+08  1.15396E+07
3.98107E-04  1.04837E+11  3.67629E+07  1.00777E+11  4.06018E+09  3.19024E+08  3.08821E+08  1.02032E+07
4.46684E-04  8.48783E+10  3.19472E+07  8.14926E+10  3.38575E+09  2.78577E+08  2.69574E+08  9.00306E+06
5.01188E-04  6.82190E+10  2.75726E+07  6.54105E+10  2.80845E+09  2.42371E+08  2.34446E+08  7.92583E+06
5.62341E-04  5.44170E+10  2.36275E+07  5.21001E+10  2.31690E+09  2.10048E+08  2.03088E+08  6.95978E+06
6.30958E-04  4.30697E+10  2.00967E+07  4.11690E+10  1.90066E+09  1.81278E+08  1.75183E+08  6.09448E+06
7.07946E-04  3.38144E+10  1.69611E+07  3.22642E+10  1.55019E+09  1.55760E+08  1.50439E+08  5.32065E+06
7.94328E-04  2.63266E+10  1.41990E+07  2.50698E+10  1.25681E+09  1.33213E+08  1.28583E+08  4.62996E+06
8.91252E-04  2.03196E+10  1.17861E+07  1.93069E+10  1.01270E+09  1.13377E+08  1.09362E+08  4.01491E+06
1.00000E-03  1.55419E+10  9.69649E+06  1.47310E+10  8.10830E+08  9.60056E+07  9.25369E+07  3.46868E+06
1.12202E-03  1.17756E+10  7.90321E+06  1.11306E+10  6.44947E+08  8.08658E+07  7.78807E+07  2.98502E+06
1.25893E-03  8.83394E+09  6.37871E+06  8.32442E+09  5.09519E+08  6.77392E+07  6.51810E+07  2.55821E+06
1.41254E-03  6.55829E+09  5.09550E+06  6.15860E+09  3.99688E+08  5.64195E+07  5.42365E+07  2.18294E+06
1.58489E-03  4.81548E+09  4.02660E+06  4.50425E+09  3.11226E+08  4.67131E+07  4.48588E+07  1.85430E+06
1.77828E-03  3.49483E+09  3.14599E+06  3.25435E+09  2.40482E+08  3.84390E+07  3.68713E+07  1.56771E+06
1.99526E-03  2.50525E+09  2.42890E+06  2.32092E+09  1.84323E+08  3.14290E+07  3.01100E+07  1.31892E+06
2.23872E-03  1.77257E+09  1.85214E+06  1.63248E+09  1.40086E+08  2.55277E+07  2.44238E+07  1.10397E+06
2.51189E-03  1.23698E+09  1.39427E+06  1.13146E+09  1.05519E+08  2.05927E+07  1.96736E+07  9.19170E+05
2.81838E-03  8.50781E+08  1.03575E+06  7.72042E+08  7.87392E+07  1.64943E+07  1.57332E+07  7.61132E+05
3.16228E-03  5.76347E+08  7.59080E+05  5.18170E+08  5.81775E+07  1.31152E+07  1.24885E+07  6.26710E+05
3.54814E-03  3.84336E+08  5.48785E+05  3.41796E+08  4.25396E+07  1.03499E+07  9.83690E+06  5.13020E+05
3.98107E-03  2.52184E+08  3.91440E+05  2.21418E+08  3.07663E+07  8.10477E+06  7.68734E+06  4.17431E+05
4.46684E-03  1.62784E+08  2.75599E+05  1.40787E+08  2.19966E+07  6.29671E+06  5.95916E+06  3.37548E+05
5.01188E-03  1.03379E+08  1.91700E+05  8.78407E+07  1.55380E+07  4.85296E+06  4.58174E+06  2.71213E+05
5.62341E-03  6.46223E+07  1.31917E+05  5.37840E+07  1.08382E+07  3.71017E+06  3.49368E+06  2.16489E+05
6.30958E-03  3.97996E+07  8.99869E+04  3.23384E+07  7.46118E+06  2.81368E+06  2.64203E+06  1.71650E+05
7.07946E-03  2.41884E+07  6.10120E+04  1.91217E+07  5.06669E+06  2.11683E+06  1.98166E+06  1.35166E+05
7.94328E-03  1.45399E+07  4.12536E+04  1.11476E+07  3.39235E+06  1.58013E+06  1.47443E+06  1.05696E+05
8.91252E-03  8.67170E+06  2.79273E+04  6.43319E+06  2.23851E+06  1.17057E+06  1.08850E+06  8.20668E+04
1.00000E-02  5.15170E+06  1.90097E+04  3.69640E+06  1.45530E+06  8.60867E+05  7.97601E+05  6.32657E+04
1.12202E-02  3.06285E+06  1.30655E+04  2.13094E+06  9.31916E+05  6.28735E+05  5.80313E+05  4.84219E+04
1.25893E-02  1.83164E+06  9.10022E+03  1.24388E+06  5.87759E+05  4.56222E+05  4.19427E+05  3.67951E+04
1.41254E-02  1.10723E+06  6.43960E+03  7.42082E+05  3.65146E+05  3.29042E+05  3.01282E+05  2.77606E+04
1.58489E-02  6.79424E+05  4.63499E+03  4.55886E+05  2.23538E+05  2.35988E+05  2.15191E+05  2.07966E+04
1.77828E-02  4.24413E+05  3.39252E+03  2.89456E+05  1.34957E+05  1.68373E+05  1.52901E+05  1.54718E+04
1.99526E-02  2.70206E+05  2.52169E+03  1.89751E+05  8.04551E+04  1.19553E+05  1.08120E+05  1.14325E+04
2.23872E-02  1.75268E+05  1.89962E+03  1.27812E+05  4.74559E+04  8.45056E+04  7.61132E+04  8.39234E+03
2.51189E-02  1.15648E+05  1.44688E+03  8.78745E+04  2.77737E+04  5.94753E+04  5.33536E+04  6.12167E+03
2.81838E-02  7.74540E+04  1.11169E+03  6.12636E+04  1.61904E+04  4.16832E+04  3.72449E+04  4.43828E+03
3.16228E-02  5.25247E+04  8.59816E+02  4.30776E+04  9.44712E+03  2.90909E+04  2.58917E+04  3.19918E+03
3.54814E-02  3.59800E+04  6.68167E+02  3.04303E+04  5.54969E+03  2.02147E+04  1.79214E+04  2.29329E+03
3.98107E-02  2.48423E+04  5.20866E+02  2.15400E+04  3.30236E+03  1.39827E+04  1.23474E+04  1.63529E+03
4.46684E-02  1.72547E+04  4.06753E+02  1.52531E+04  2.00152E+03  9.62420E+03  8.46396E+03  1.16025E+03
5.01188E-02  1.20354E+04  3.17822E+02  1.07951E+04  1.24033E+03  6.58849E+03  5.76925E+03  8.19241E+02
5.62341E-02  8.41799E+03  2.48222E+02  7.63109E+03  7.86897E+02  4.48334E+03  3.90758E+03  5.75762E+02
6.30958E-02  5.89642E+03  1.93602E+02  5.38605E+03  5.10366E+02  3.03051E+03  2.62773E+03  4.02787E+02
7.07946E-02  4.13149E+03  1.50675E+02  3.79431E+03  3.37199E+02  2.03309E+03  1.75262E+03  2.80486E+02
7.94328E-02  2.89284E+03  1.16927E+02  2.66701E+03  2.25890E+02  1.35231E+03  1.15796E+03  1.94406E+02
8.91252E-02  2.02269E+03  9.04129E+01  1.87011E+03  1.52692E+02  8.91158E+02  7.57179E+02  1.34090E+02
1.00000E-01  1.41140E+03  6.96124E+01  1.30785E+03  1.03696E+02  5.81401E+02  4.89531E+02  9.20143E+01
1.12202E-01  9.81999E+02  5.33271E+01  9.11691E+02  7.04990E+01  3.75027E+02  3.12422E+02  6.27965E+01
1.25893E-01  6.81044E+02  4.06139E+01  6.33370E+02  4.78505E+01  2.39237E+02  1.96808E+02  4.26051E+01
1.41254E-01  4.70173E+02  3.07210E+01  4.38003E+02  3.23562E+01  1.50606E+02  1.22069E+02  2.87233E+01
1.58489E-01  3.22698E+02  2.30579E+01  3.01171E+02  2.17625E+01  9.33825E+01  7.43850E+01  1.92331E+01
1.77828E-01  2.20284E+02  1.71567E+01  2.05917E+02  1.45427E+01  5.73167E+01  4.47066E+01  1.27859E+01
1.99526E-01  1.49270E+02  1.26368E+01  1.39729E+02  9.64630E+00  3.47723E+01  2.64423E+01  8.43541E+00
2.23872E-01  1.00195E+02  9.20034E+00  9.39098E+01  6.34790E+00  2.08087E+01  1.53486E+01  5.52235E+00
2.51189E-01  6.65096E+01  6.61218E+00  6.24036E+01  4.14224E+00  1.22865E+01  8.73603E+00  3.58680E+00
2.81838E-01  4.35844E+01  4.68452E+00  4.09249E+01  2.68039E+00  7.16324E+00  4.87191E+00  2.31223E+00
3.16228E-01  2.81457E+01  3.26717E+00  2.64377E+01  1.71983E+00  4.12812E+00  2.66026E+00  1.47976E+00
3.54814E-01  1.78797E+01  2.24021E+00  1.67917E+01  1.09465E+00  2.35551E+00  1.42138E+00  9.40827E-01
3.98107E-01  1.11541E+01  1.50822E+00  1.04664E+01  6.91411E-01  1.33367E+00  7.42733E-01  5.94673E-01
4.46684E-01  6.82244E+00  9.95856E-01  6.39077E+00  4.33743E-01  7.51428E-01  3.79410E-01  3.74087E-01
5.01188E-01  4.08543E+00  6.44226E-01  3.81610E+00  2.70477E-01  4.22723E-01  1.89427E-01  2.34438E-01
5.62341E-01  2.39205E+00  4.07970E-01  2.22483E+00  1.67848E-01  2.38341E-01  9.24315E-02  1.46539E-01
6.30958E-01  1.36791E+00  2.52762E-01  1.26448E+00  1.03776E-01  1.35203E-01  4.40961E-02  9.14541E-02
7.07946E-01  7.63405E-01  1.53176E-01  6.99588E-01  6.40085E-02  7.74418E-02  2.05871E-02  5.70462E-02
7.94328E-01  4.15564E-01  9.08165E-02  3.76245E-01  3.94248E-02  4.48969E-02  9.41904E-03  3.55836E-02
8.91252E-01  2.20635E-01  5.27289E-02  1.96426E-01  2.42671E-02  2.63685E-02  4.22766E-03  2.21993E-02
1.00000E+00  1.14322E-01  3.00397E-02  9.94171E-02  1.49368E-02  1.56875E-02  1.86841E-03  1.38514E-02
1.12202E+00  5.78980E-02  1.68489E-02  4.87170E-02  9.19897E-03  9.44295E-03  8.17067E-04  8.64378E-03
1.25893E+00  2.87426E-02  9.35319E-03  2.30813E-02  5.67130E-03  5.73925E-03  3.54429E-04  5.39473E-03
1.41254E+00  1.40545E-02  5.17802E-03  1.05585E-02  3.50146E-03  3.51505E-03  1.53189E-04  3.36735E-03
1.58489E+00  6.81925E-03  2.88739E-03  4.65689E-03  2.16540E-03  2.16528E-03  6.61859E-05  2.10214E-03
1.77828E+00  3.31711E-03  1.64035E-03  1.97734E-03  1.34146E-03  1.33934E-03  2.86008E-05  1.31243E-03
1.99526E+00  1.63854E-03  9.59727E-04  8.07053E-04  8.32428E-04  8.30901E-04  1.23614E-05  8.19479E-04
2.23872E+00  8.32976E-04  5.82499E-04  3.16152E-04  5.17346E-04  5.16552E-04  5.34357E-06  5.11731E-04
2.51189E+00  4.40351E-04  3.67330E-04  1.18690E-04  3.21952E-04  3.21605E-04  2.31029E-06  3.19585E-04
2.81838E+00  2.43059E-04  2.39704E-04  4.26444E-05  2.00576E-04  2.00443E-04  9.99024E-07  1.99606E-04
3.16228E+00  1.39622E-04  1.60663E-04  1.46462E-05  1.25066E-04  1.25021E-04  4.32060E-07  1.24679E-04
3.54814E+00  8.27896E-05  1.09718E-04  4.80543E-06  7.80342E-05  7.80213E-05  1.86885E-07  7.78845E-05
3.98108E+00  5.01918E-05  7.58237E-05  1.50664E-06  4.87131E-05  4.87096E-05  8.08477E-08  4.86567E-05
4.46684E+00  3.08570E-05  5.27679E-05  4.52338E-07  3.04202E-05  3.04190E-05  3.49799E-08  3.03995E-05
5.01187E+00  1.91239E-05  3.68643E-05  1.30749E-07  1.90019E-05  1.90010E-05  1.51368E-08  1.89945E-05
5.62341E+00  1.19035E-05  2.58052E-05  3.67958E-08  1.18716E-05  1.18708E-05  6.55087E-09  1.18690E-05
6.30958E+00  7.42553E-06  1.80815E-05  1.02934E-08  7.41793E-06  7.41723E-06  2.83542E-09  7.41709E-06
7.07946E+00  4.63704E-06  1.26756E-05  2.95753E-09  4.63559E-06  4.63505E-06  1.22740E-09  4.63533E-06
7.94329E+00  2.89719E-06  8.88776E-06  9.08274E-10  2.89712E-06  2.89674E-06  5.31384E-10  2.89705E-06
8.91251E+00  1.81062E-06  6.23243E-06  3.07043E-10  1.81078E-06  1.81053E-06  2.30084E-10  1.81077E-06
1.00000E+01  1.13171E-06  4.37048E-06  1.14338E-10  1.13185E-06  1.13169E-06  9.96336E-11  1.13186E-06
1.12202E+01  7.07426E-07  3.06467E-06  4.57737E-11  7.07527E-07  7.07428E-07  4.31492E-11  7.07532E-07
1.25893E+01  4.42242E-07  2.14881E-06  1.91259E-11  4.42305E-07  4.42246E-07  1.86890E-11  4.42309E-07
1.41254E+01  2.76482E-07  1.50641E-06  8.16325E-12  2.76520E-07  2.76485E-07  8.09551E-12  2.76523E-07
1.58489E+01  1.72863E-07  1.05579E-06  3.51691E-12  1.72885E-07  1.72865E-07  3.50715E-12  1.72887E-07
1.77828E+01  1.08083E-07  7.39672E-07  1.52080E-12  1.08096E-07  1.08084E-07  1.51950E-12  1.08097E-07
1.99526E+01  6.75829E-08  5.17901E-07  6.58560E-13  6.75902E-08  6.75837E-08  6.58398E-13  6.75911E-08
2.23872E+01  4.22608E-08  3.62311E-07  2.85311E-13  4.22650E-08  4.22613E-08  2.85311E-13  4.22656E-08
2.51189E+01  2.64277E-08  2.53146E-07  1.23649E-13  2.64301E-08  2.64281E-08  1.23649E-13  2.64305E-08
2.81838E+01  1.65275E-08  1.76550E-07  5.35929E-14  1.65289E-08  1.65278E-08  5.35929E-14  1.65291E-08
3.16228E+01  1.03365E-08  1.22804E-07  2.32305E-14  1.03372E-08  1.03366E-08  2.32305E-14  1.03374E-08
3.54814E+01  6.46482E-09  8.50885E-08  1.00704E-14  6.46526E-09  6.46492E-09  1.00704E-14  6.46535E-09
3.98108E+01  4.04353E-09  5.86216E-08  4.36590E-15  4.04378E-09  4.04360E-09  4.36590E-15  4.04384E-09
4.46684E+01  2.52921E-09  4.00475E-08  1.89295E-15  2.52935E-09  2.52925E-09  1.89295E-15  2.52939E-09
5.01187E+01  1.58209E-09  2.70120E-08  8.20817E-16  1.58217E-09  1.58212E-09  8.20817E-16  1.58220E-09
5.62341E+01  9.89678E-10  1.78630E-08  3.55946E-16  9.89722E-10  9.89695E-10  3.55946E-16  9.89738E-10
6.30958E+01  6.19120E-10  1.14415E-08  1.54368E-16  6.19144E-10  6.19130E-10  1.54368E-16  6.19155E-10
7.07946E+01  3.87323E-10  6.93411E-09  6.69521E-17  3.87337E-10  3.87330E-10  6.69521E-17  3.87343E-10
7.94329E+01  2.42320E-10  3.77023E-09  2.90407E-17  2.42328E-10  2.42325E-10  2.90407E-17  2.42332E-10
8.91251E+01  1.51610E-10  1.54931E-09  1.25977E-17  1.51615E-10  1.51613E-10  1.25977E-17  1.51617E-10
# I am pretty sure nobody will read this line, but maybe I am wrong;)
