# Counts predicted by the Béthermin et al. (2012) model
# 1: Snu [Jy]
# 2: dN/dSnu total [gal/Jy/sr]
# 3: N(>Snu) total [gal/sr]
# 4: dN/dSnu main sequence [gal/Jy/sr]
# 5: dN/dSnu starburst [gal/Jy/sr]
# 6: dN/dSnu lensed galaxies [gal/Jy/sr]
# 7: dN/dSnu lensed main sequence [gal/Jy/sr]
# 8: dN/dSnu lensed starburst [gal/Jy/sr]
1.00000E-08  1.77646E+16  1.22943E+09  1.70943E+16  6.70380E+14  2.75795E+13  2.65111E+13  1.06839E+12
1.12202E-08  1.56110E+16  1.20908E+09  1.50220E+16  5.89056E+14  2.42355E+13  2.32967E+13  9.38782E+11
1.25893E-08  1.37187E+16  1.18887E+09  1.32011E+16  5.17599E+14  2.12972E+13  2.04723E+13  8.24899E+11
1.41254E-08  1.20558E+16  1.16894E+09  1.16010E+16  4.54812E+14  1.87153E+13  1.79905E+13  7.24832E+11
1.58489E-08  1.05947E+16  1.14929E+09  1.01951E+16  3.99643E+14  1.64466E+13  1.58097E+13  6.36907E+11
1.77828E-08  9.31079E+15  1.12992E+09  8.95962E+15  3.51167E+14  1.44531E+13  1.38934E+13  5.59649E+11
1.99526E-08  8.18259E+15  1.11081E+09  7.87401E+15  3.08573E+14  1.27014E+13  1.22096E+13  4.91765E+11
2.23872E-08  7.19122E+15  1.09197E+09  6.92007E+15  2.71146E+14  1.11621E+13  1.07300E+13  4.32117E+11
2.51189E-08  6.32007E+15  1.07340E+09  6.08181E+15  2.38260E+14  9.80958E+12  9.42987E+12  3.79706E+11
2.81838E-08  5.55457E+15  1.05508E+09  5.34520E+15  2.09364E+14  8.62107E+12  8.28741E+12  3.33653E+11
3.16228E-08  4.88189E+15  1.03702E+09  4.69791E+15  1.83974E+14  7.57668E+12  7.28349E+12  2.93188E+11
3.54814E-08  4.29077E+15  1.01920E+09  4.12911E+15  1.61664E+14  6.65894E+12  6.40131E+12  2.57631E+11
3.98107E-08  3.77133E+15  1.00164E+09  3.62927E+15  1.42060E+14  5.85250E+12  5.62611E+12  2.26389E+11
4.46684E-08  3.31486E+15  9.84314E+08  3.19002E+15  1.24834E+14  5.14383E+12  4.94490E+12  1.98936E+11
5.01187E-08  2.91372E+15  9.67229E+08  2.80403E+15  1.09699E+14  4.52110E+12  4.34628E+12  1.74814E+11
5.62341E-08  2.56121E+15  9.50380E+08  2.46482E+15  9.63989E+13  3.97386E+12  3.82024E+12  1.53618E+11
6.30958E-08  2.25143E+15  9.33761E+08  2.16672E+15  8.47124E+13  3.49296E+12  3.35796E+12  1.34994E+11
7.07946E-08  1.97919E+15  9.17370E+08  1.90475E+15  7.44436E+13  3.07036E+12  2.95173E+12  1.18629E+11
7.94328E-08  1.73994E+15  9.01203E+08  1.67452E+15  6.54203E+13  2.69897E+12  2.59473E+12  1.04248E+11
8.91251E-08  1.52969E+15  8.85256E+08  1.47219E+15  5.74916E+13  2.37261E+12  2.28099E+12  9.16123E+10
1.00000E-07  1.34490E+15  8.69525E+08  1.29438E+15  5.05244E+13  2.08578E+12  2.00527E+12  8.05090E+10
1.12202E-07  1.18250E+15  8.54007E+08  1.13810E+15  4.44022E+13  1.83372E+12  1.76296E+12  7.07523E+10
1.25893E-07  1.03977E+15  8.38698E+08  1.00074E+15  3.90226E+13  1.61219E+12  1.55001E+12  6.21791E+10
1.41254E-07  9.14318E+14  8.23595E+08  8.80023E+14  3.42954E+13  1.41750E+12  1.36285E+12  5.46456E+10
1.58489E-07  8.04060E+14  8.08693E+08  7.73918E+14  3.01414E+13  1.24639E+12  1.19836E+12  4.80257E+10
1.77828E-07  7.07148E+14  7.93989E+08  6.80657E+14  2.64911E+13  1.09600E+12  1.05379E+12  4.22086E+10
1.99526E-07  6.21965E+14  7.79479E+08  5.98682E+14  2.32835E+13  9.63820E+11  9.26723E+11  3.70968E+10
2.23872E-07  5.47091E+14  7.65160E+08  5.26626E+14  2.04647E+13  8.47643E+11  8.15038E+11  3.26049E+10
2.51189E-07  4.81274E+14  7.51028E+08  4.63286E+14  1.79877E+13  7.45526E+11  7.16868E+11  2.86576E+10
2.81838E-07  4.23417E+14  7.37080E+08  4.07606E+14  1.58110E+13  6.55767E+11  6.30578E+11  2.51889E+10
3.16228E-07  3.72555E+14  7.23310E+08  3.58657E+14  1.38981E+13  5.76866E+11  5.54725E+11  2.21407E+10
3.54814E-07  3.27841E+14  7.09717E+08  3.15624E+14  1.22171E+13  5.07508E+11  4.88046E+11  1.94620E+10
3.98107E-07  2.88531E+14  6.96295E+08  2.77791E+14  1.07398E+13  4.46537E+11  4.29429E+11  1.71080E+10
4.46684E-07  2.53968E+14  6.83041E+08  2.44526E+14  9.44154E+12  3.92935E+11  3.77896E+11  1.50392E+10
5.01187E-07  2.23578E+14  6.69952E+08  2.15278E+14  8.30059E+12  3.45811E+11  3.32590E+11  1.32212E+10
5.62341E-07  1.96856E+14  6.57023E+08  1.89558E+14  7.29785E+12  3.04379E+11  2.92756E+11  1.16234E+10
6.30958E-07  1.73358E+14  6.44249E+08  1.66941E+14  6.41659E+12  2.67950E+11  2.57731E+11  1.02192E+10
7.07946E-07  1.52693E+14  6.31629E+08  1.47051E+14  5.64207E+12  2.35918E+11  2.26933E+11  8.98517E+09
7.94328E-07  1.34518E+14  6.19156E+08  1.29557E+14  4.96134E+12  2.07751E+11  1.99850E+11  7.90056E+09
8.91251E-07  1.18532E+14  6.06827E+08  1.14169E+14  4.36304E+12  1.82980E+11  1.76033E+11  6.94730E+09
1.00000E-06  1.04470E+14  5.94638E+08  1.00633E+14  3.83716E+12  1.61195E+11  1.55085E+11  6.10946E+09
1.12202E-06  9.20993E+13  5.82583E+08  8.87244E+13  3.37492E+12  1.42033E+11  1.36660E+11  5.37305E+09
1.25893E-06  8.12151E+13  5.70660E+08  7.82465E+13  2.96862E+12  1.25179E+11  1.20453E+11  4.72577E+09
1.41254E-06  7.16379E+13  5.58863E+08  6.90264E+13  2.61148E+12  1.10352E+11  1.06195E+11  4.15682E+09
1.58489E-06  6.32094E+13  5.47187E+08  6.09119E+13  2.29752E+12  9.73066E+10  9.36499E+10  3.65669E+09
1.77828E-06  5.57907E+13  5.35628E+08  5.37692E+13  2.02153E+12  8.58283E+10  8.26113E+10  3.21706E+09
1.99526E-06  4.92599E+13  5.24180E+08  4.74810E+13  1.77889E+12  7.57273E+10  7.28968E+10  2.83058E+09
2.23872E-06  4.35097E+13  5.12840E+08  4.19441E+13  1.56557E+12  6.68372E+10  6.43463E+10  2.49081E+09
2.51189E-06  3.84457E+13  5.01601E+08  3.70677E+13  1.37801E+12  5.90115E+10  5.68194E+10  2.19211E+09
2.81838E-06  3.39850E+13  4.90458E+08  3.27719E+13  1.21310E+12  5.21217E+10  5.01922E+10  1.92948E+09
3.16228E-06  3.00548E+13  4.79406E+08  2.89867E+13  1.06809E+12  4.60546E+10  4.43561E+10  1.69856E+09
3.54814E-06  2.65910E+13  4.68440E+08  2.56505E+13  9.40566E+11  4.07110E+10  3.92154E+10  1.49551E+09
3.98108E-06  2.35374E+13  4.57553E+08  2.27089E+13  8.28416E+11  3.60033E+10  3.46863E+10  1.31696E+09
4.46684E-06  2.08444E+13  4.46742E+08  2.01146E+13  7.29777E+11  3.18549E+10  3.06949E+10  1.15993E+09
5.01187E-06  1.84685E+13  4.35998E+08  1.78255E+13  6.43013E+11  2.81981E+10  2.71763E+10  1.02183E+09
5.62341E-06  1.63715E+13  4.25318E+08  1.58048E+13  5.66685E+11  2.49737E+10  2.40733E+10  9.00349E+08
6.30958E-06  1.45199E+13  4.14696E+08  1.40203E+13  4.99532E+11  2.21294E+10  2.13359E+10  7.93490E+08
7.07946E-06  1.28840E+13  4.04125E+08  1.24435E+13  4.40443E+11  1.96193E+10  1.89198E+10  6.99479E+08
7.94328E-06  1.14380E+13  3.93600E+08  1.10495E+13  3.88444E+11  1.74031E+10  1.67864E+10  6.16762E+08
8.91251E-06  1.01590E+13  3.83117E+08  9.81632E+12  3.42675E+11  1.54455E+10  1.49015E+10  5.43972E+08
1.00000E-05  9.02701E+12  3.72670E+08  8.72462E+12  3.02385E+11  1.37151E+10  1.32352E+10  4.79908E+08
1.12202E-05  8.02443E+12  3.62254E+08  7.75752E+12  2.66910E+11  1.21846E+10  1.17611E+10  4.23514E+08
1.25893E-05  7.13581E+12  3.51866E+08  6.90014E+12  2.35669E+11  1.08301E+10  1.04562E+10  3.73863E+08
1.41254E-05  6.34758E+12  3.41500E+08  6.13943E+12  2.08151E+11  9.63032E+09  9.30018E+09  3.30140E+08
1.58489E-05  5.64782E+12  3.31155E+08  5.46392E+12  1.83907E+11  8.56680E+09  8.27517E+09  2.91629E+08
1.77828E-05  5.02608E+12  3.20827E+08  4.86354E+12  1.62541E+11  7.62322E+09  7.36552E+09  2.57700E+08
1.99526E-05  4.47319E+12  3.10514E+08  4.32948E+12  1.43706E+11  6.78531E+09  6.55752E+09  2.27799E+08
2.23872E-05  3.98109E+12  3.00216E+08  3.85399E+12  1.27099E+11  6.04056E+09  5.83912E+09  2.01440E+08
2.51189E-05  3.54272E+12  2.89932E+08  3.43027E+12  1.12450E+11  5.37797E+09  5.19977E+09  1.78197E+08
2.81838E-05  3.15189E+12  2.79664E+08  3.05236E+12  9.95252E+10  4.78791E+09  4.63022E+09  1.57693E+08
3.16228E-05  2.80313E+12  2.69414E+08  2.71501E+12  8.81166E+10  4.26195E+09  4.12235E+09  1.39598E+08
3.54814E-05  2.49167E+12  2.59186E+08  2.41363E+12  7.80429E+10  3.79269E+09  3.66907E+09  1.23624E+08
3.98108E-05  2.21333E+12  2.48985E+08  2.14419E+12  6.91443E+10  3.37368E+09  3.26416E+09  1.09515E+08
4.46684E-05  1.96442E+12  2.38819E+08  1.90314E+12  6.12805E+10  2.99924E+09  2.90220E+09  9.70481E+07
5.01187E-05  1.74172E+12  2.28694E+08  1.68739E+12  5.43281E+10  2.66443E+09  2.57840E+09  8.60264E+07
5.62341E-05  1.54239E+12  2.18622E+08  1.49421E+12  4.81787E+10  2.36488E+09  2.28860E+09  7.62774E+07
6.30958E-05  1.36394E+12  2.08614E+08  1.32121E+12  4.27370E+10  2.09678E+09  2.02913E+09  6.76497E+07
7.07946E-05  1.20421E+12  1.98684E+08  1.16629E+12  3.79194E+10  1.85678E+09  1.79677E+09  6.00103E+07
7.94328E-05  1.06127E+12  1.88847E+08  1.02762E+12  3.36522E+10  1.64194E+09  1.58869E+09  5.32423E+07
8.91251E-05  9.33439E+11  1.79121E+08  9.03568E+11  2.98706E+10  1.44964E+09  1.40239E+09  4.72430E+07
1.00000E-04  8.19212E+11  1.69522E+08  7.92694E+11  2.65178E+10  1.27758E+09  1.23566E+09  4.19222E+07
1.12202E-04  7.17265E+11  1.60069E+08  6.93721E+11  2.35435E+10  1.12373E+09  1.08653E+09  3.72008E+07
1.25893E-04  6.26413E+11  1.50783E+08  6.05509E+11  2.09039E+10  9.86281E+08  9.53272E+08  3.30091E+07
1.41254E-04  5.45589E+11  1.41684E+08  5.27029E+11  1.85600E+10  8.63611E+08  8.34325E+08  2.92861E+07
1.58489E-04  4.73833E+11  1.32792E+08  4.57355E+11  1.64777E+10  7.54285E+08  7.28307E+08  2.59778E+07
1.77828E-04  4.10272E+11  1.24127E+08  3.95645E+11  1.46269E+10  6.57010E+08  6.33973E+08  2.30371E+07
1.99526E-04  3.54111E+11  1.15709E+08  3.41130E+11  1.29810E+10  5.70623E+08  5.50201E+08  2.04221E+07
2.23872E-04  3.04624E+11  1.07556E+08  2.93107E+11  1.15168E+10  4.94077E+08  4.75981E+08  1.80963E+07
2.51189E-04  2.61147E+11  9.96875E+07  2.50933E+11  1.02136E+10  4.26417E+08  4.10390E+08  1.60272E+07
2.81838E-04  2.23070E+11  9.21186E+07  2.14016E+11  9.05325E+09  3.66778E+08  3.52592E+08  1.41863E+07
3.16228E-04  1.89834E+11  8.48645E+07  1.81814E+11  8.01970E+09  3.14368E+08  3.01820E+08  1.25483E+07
3.54814E-04  1.60927E+11  7.79379E+07  1.53828E+11  7.09882E+09  2.68459E+08  2.57368E+08  1.10909E+07
3.98107E-04  1.35880E+11  7.13496E+07  1.29602E+11  6.27814E+09  2.28385E+08  2.18591E+08  9.79444E+06
4.46684E-04  1.14263E+11  6.51080E+07  1.08717E+11  5.54665E+09  1.93533E+08  1.84891E+08  8.64125E+06
5.01188E-04  9.56845E+10  5.92188E+07  9.07898E+10  4.89462E+09  1.63339E+08  1.55723E+08  7.61583E+06
5.62341E-04  7.97863E+10  5.36855E+07  7.54728E+10  4.31349E+09  1.37285E+08  1.30581E+08  6.70436E+06
6.30958E-04  6.62431E+10  4.85085E+07  6.24474E+10  3.79566E+09  1.14898E+08  1.09003E+08  5.89454E+06
7.07946E-04  5.47601E+10  4.36859E+07  5.14257E+10  3.33441E+09  9.57439E+07  9.05684E+07  5.17545E+06
7.94328E-04  4.50703E+10  3.92128E+07  4.21465E+10  2.92379E+09  7.94285E+07  7.48912E+07  4.53733E+06
8.91252E-04  3.69335E+10  3.50820E+07  3.43750E+10  2.55853E+09  6.55948E+07  6.16233E+07  3.97150E+06
1.00000E-03  3.01344E+10  3.12839E+07  2.79005E+10  2.23393E+09  5.39206E+07  5.04503E+07  3.47022E+06
1.12202E-03  2.44810E+10  2.78069E+07  2.25352E+10  1.94582E+09  4.41163E+07  4.10897E+07  3.02658E+06
1.25893E-03  1.98034E+10  2.46375E+07  1.81130E+10  1.69045E+09  3.59236E+07  3.32892E+07  2.63440E+06
1.41254E-03  1.59519E+10  2.17609E+07  1.44874E+10  1.46449E+09  2.91126E+07  2.68245E+07  2.28815E+06
1.58489E-03  1.27958E+10  1.91609E+07  1.15309E+10  1.26493E+09  2.34802E+07  2.14973E+07  1.98289E+06
1.77828E-03  1.02220E+10  1.68210E+07  9.13288E+09  1.08907E+09  1.88473E+07  1.71331E+07  1.71422E+06
1.99526E-03  8.13273E+09  1.47236E+07  7.19825E+09  9.34485E+08  1.50573E+07  1.35792E+07  1.47817E+06
2.23872E-03  6.44483E+09  1.28513E+07  5.64587E+09  7.98961E+08  1.19740E+07  1.07028E+07  1.27117E+06
2.51189E-03  5.08744E+09  1.11865E+07  4.40693E+09  6.80502E+08  9.47910E+06  8.38906E+06  1.09004E+06
2.81838E-03  4.00085E+09  9.71198E+06  3.42356E+09  5.77297E+08  7.47139E+06  6.53947E+06  9.31921E+05
3.16228E-03  3.13501E+09  8.41092E+06  2.64731E+09  4.87697E+08  5.86427E+06  5.07005E+06  7.94227E+05
3.54814E-03  2.44813E+09  7.26703E+06  2.03793E+09  4.10202E+08  4.58440E+06  3.90976E+06  6.74643E+05
3.98107E-03  1.90560E+09  6.26478E+06  1.56215E+09  3.43448E+08  3.57020E+06  2.99911E+06  5.71087E+05
4.46684E-03  1.47887E+09  5.38944E+06  1.19268E+09  2.86192E+08  2.77029E+06  2.28861E+06  4.81683E+05
5.01188E-03  1.14456E+09  4.62722E+06  9.07259E+08  2.37305E+08  2.14222E+06  1.73748E+06  4.04749E+05
5.62341E-03  8.83622E+08  3.96534E+06  6.87859E+08  1.95764E+08  1.65118E+06  1.31241E+06  3.38773E+05
6.30958E-03  6.80631E+08  3.39200E+06  5.19991E+08  1.60639E+08  1.26878E+06  9.86385E+05  2.82399E+05
7.07946E-03  5.23200E+08  2.89648E+06  3.92103E+08  1.31097E+08  9.72123E+05  7.37710E+05  2.34414E+05
7.94328E-03  4.01427E+08  2.46911E+06  2.95045E+08  1.06383E+08  7.42785E+05  5.49054E+05  1.93732E+05
8.91252E-03  3.07457E+08  2.10119E+06  2.21632E+08  8.58246E+07  5.66081E+05  4.06695E+05  1.59387E+05
1.00000E-02  2.35088E+08  1.78501E+06  1.66264E+08  6.88238E+07  4.30356E+05  2.99837E+05  1.30519E+05
1.12202E-02  1.79452E+08  1.51376E+06  1.24603E+08  5.48492E+07  3.26407E+05  2.20040E+05  1.06367E+05
1.25893E-02  1.36750E+08  1.28143E+06  9.33157E+07  4.34343E+07  2.47010E+05  1.60755E+05  8.62551E+04
1.41254E-02  1.04023E+08  1.08279E+06  6.98524E+07  3.41702E+07  1.86519E+05  1.16928E+05  6.95913E+04
1.58489E-02  7.89772E+07  9.13250E+05  5.22752E+07  2.67020E+07  1.40541E+05  8.46855E+04  5.58552E+04
1.77828E-02  5.98403E+07  7.68824E+05  3.91170E+07  2.07233E+07  1.05670E+05  6.10776E+04  4.45924E+04
1.99526E-02  4.52420E+07  6.46041E+05  2.92710E+07  1.59711E+07  7.92785E+04  4.38708E+04  3.54078E+04
2.23872E-02  3.41267E+07  5.41885E+05  2.19050E+07  1.22217E+07  5.93455E+04  3.13855E+04  2.79600E+04
2.51189E-02  2.56806E+07  4.53731E+05  1.63947E+07  9.28592E+06  4.43203E+04  2.23651E+04  2.19552E+04
2.81838E-02  1.92775E+07  3.79301E+05  1.22723E+07  7.00520E+06  3.30177E+04  1.58754E+04  1.71423E+04
3.16228E-02  1.44355E+07  3.16611E+05  9.18798E+06  5.24751E+06  2.45333E+04  1.12256E+04  1.33076E+04
3.54814E-02  1.07838E+07  2.63940E+05  6.87992E+06  3.90384E+06  1.81784E+04  7.90738E+03  1.02710E+04
3.98107E-02  8.03753E+06  2.19791E+05  5.15248E+06  2.88505E+06  1.34298E+04  5.54872E+03  7.88111E+03
4.46684E-02  5.97818E+06  1.82871E+05  3.85935E+06  2.11883E+06  9.89055E+03  3.87864E+03  6.01191E+03
5.01188E-02  4.43834E+06  1.52059E+05  2.89117E+06  1.54717E+06  7.25984E+03  2.70067E+03  4.55917E+03
5.62341E-02  3.29009E+06  1.26393E+05  2.16615E+06  1.12394E+06  5.31028E+03  1.87301E+03  3.43727E+03
6.30958E-02  2.43599E+06  1.05045E+05  1.62311E+06  8.12875E+05  3.87007E+03  1.29371E+03  2.57635E+03
7.07946E-02  1.80210E+06  8.73106E+04  1.21632E+06  5.85782E+05  2.80978E+03  8.89839E+02  1.91994E+03
7.94328E-02  1.33251E+06  7.25901E+04  9.11529E+05  4.20980E+05  2.03202E+03  6.09383E+02  1.42264E+03
8.91252E-02  9.85136E+05  6.03772E+04  6.83139E+05  3.01996E+05  1.46369E+03  4.15432E+02  1.04826E+03
1.00000E-01  7.28429E+05  5.02465E+04  5.11982E+05  2.16447E+05  1.05007E+03  2.81876E+02  7.68194E+02
1.12202E-01  5.38828E+05  4.18416E+04  3.83704E+05  1.55124E+05  7.50288E+02  1.90317E+02  5.59972E+02
1.25893E-01  3.98815E+05  3.48658E+04  2.87561E+05  1.11254E+05  5.33943E+02  1.27844E+02  4.06099E+02
1.41254E-01  2.95399E+05  2.90727E+04  2.15502E+05  7.98970E+04  3.78482E+02  8.54259E+01  2.93056E+02
1.58489E-01  2.18976E+05  2.42581E+04  1.61495E+05  5.74814E+04  2.67253E+02  5.67744E+01  2.10479E+02
1.77828E-01  1.62462E+05  2.02537E+04  1.21020E+05  4.14425E+04  1.88011E+02  3.75261E+01  1.50485E+02
1.99526E-01  1.20634E+05  1.69202E+04  9.06871E+04  2.99471E+04  1.31790E+02  2.46669E+01  1.07123E+02
2.23872E-01  8.96472E+04  1.41430E+04  6.79565E+04  2.16907E+04  9.20626E+01  1.61256E+01  7.59370E+01
2.51189E-01  6.66694E+04  1.18273E+04  5.09231E+04  1.57463E+04  6.40966E+01  1.04852E+01  5.36114E+01
2.81838E-01  4.96147E+04  9.89498E+03  3.81594E+04  1.14557E+04  4.41424E+01  6.77550E+00  3.76996E+01
3.16228E-01  3.69450E+04  8.28153E+03  2.85953E+04  8.35083E+03  2.96806E+01  4.34664E+00  2.64065E+01
3.54814E-01  2.75256E+04  6.93350E+03  2.14286E+04  6.09862E+03  1.95740E+01  2.77224E+00  1.84233E+01
3.98107E-01  2.05181E+04  5.80661E+03  1.60585E+04  4.46125E+03  1.28955E+01  1.76012E+00  1.28021E+01
4.46684E-01  1.53009E+04  4.86411E+03  1.20345E+04  3.26839E+03  8.09494E+00  1.10442E+00  8.85901E+00
5.01188E-01  1.14152E+04  4.07550E+03  9.01913E+03  2.39776E+03  5.16707E+00  6.93381E-01  6.10369E+00
5.62341E-01  8.51929E+03  3.41537E+03  6.75966E+03  1.76126E+03  3.05916E+00  4.29387E-01  4.18590E+00
6.30958E-01  6.36052E+03  2.86260E+03  5.06657E+03  1.29520E+03  1.94540E+00  2.67401E-01  2.85645E+00
7.07946E-01  4.75030E+03  2.39954E+03  3.79790E+03  9.53483E+02  1.09353E+00  1.62536E-01  1.93884E+00
7.94328E-01  3.54905E+03  2.01151E+03  2.84726E+03  7.02615E+02  6.46094E-01  9.97745E-02  1.30842E+00
8.91252E-01  2.65252E+03  1.68623E+03  2.13490E+03  5.18231E+02  3.83170E-01  6.11308E-02  8.77493E-01
1.00000E+00  1.98315E+03  1.41345E+03  1.60106E+03  3.82568E+02  2.12338E-01  3.64803E-02  5.84553E-01
1.12202E+00  1.48326E+03  1.18463E+03  1.20095E+03  2.82649E+02  1.24258E-01  2.21141E-02  3.86608E-01
1.25893E+00  1.10979E+03  9.92602E+02  9.01025E+02  2.08989E+02  7.49422E-02  1.35298E-02  2.53735E-01
1.41254E+00  8.30620E+02  8.31394E+02  6.76136E+02  1.54639E+02  4.31264E-02  8.18190E-03  1.65179E-01
1.58489E+00  6.21862E+02  6.96017E+02  5.07464E+02  1.14504E+02  2.60204E-02  4.97974E-03  1.06616E-01
1.77828E+00  4.65675E+02  5.82297E+02  3.80908E+02  8.48419E+01  1.53722E-02  2.99979E-03  6.82054E-02
1.99526E+00  3.48773E+02  4.86747E+02  2.85921E+02  6.29034E+01  9.23293E-03  1.81646E-03  4.32348E-02
2.23872E+00  2.61238E+02  4.06452E+02  2.14604E+02  4.66661E+01  5.77544E-03  1.11360E-03  2.71511E-02
2.51189E+00  1.95665E+02  3.38971E+02  1.61045E+02  3.46404E+01  3.57809E-03  6.80227E-04  1.68910E-02
2.81838E+00  1.46529E+02  2.82262E+02  1.20814E+02  2.57284E+01  2.00808E-03  4.03787E-04  1.04103E-02
3.16228E+00  1.09704E+02  2.34611E+02  9.05933E+01  1.91195E+01  1.17857E-03  2.43012E-04  6.35762E-03
3.54814E+00  8.21034E+01  1.94583E+02  6.78924E+01  1.42160E+01  7.79666E-04  1.51075E-04  3.84859E-03
3.98108E+00  6.14154E+01  1.60970E+02  5.08427E+01  1.05756E+01  4.87429E-04  9.23865E-05  2.31049E-03
4.46684E+00  4.59085E+01  1.32758E+02  3.80396E+01  7.87156E+00  2.77780E-04  5.38373E-05  1.37654E-03
5.01187E+00  3.42865E+01  1.09097E+02  2.84263E+01  5.86196E+00  1.66249E-04  3.19447E-05  8.14547E-04
5.62341E+00  2.55740E+01  8.92699E+01  2.12075E+01  4.36759E+00  1.02967E-04  1.91574E-05  4.79166E-04
6.30958E+00  1.90402E+01  7.26762E+01  1.57854E+01  3.25577E+00  5.77034E-05  1.10152E-05  2.80519E-04
7.07946E+00  1.41384E+01  5.88145E+01  1.17108E+01  2.42809E+00  3.78005E-05  6.69822E-06  1.63617E-04
7.94329E+00  1.04588E+01  4.72654E+01  8.64756E+00  1.81159E+00  2.21704E-05  3.88753E-06  9.51871E-05
8.91251E+00  7.69664E+00  3.76797E+01  6.34477E+00  1.35213E+00  1.26189E-05  2.22184E-06  5.52954E-05
1.00000E+01  5.62495E+00  2.97648E+01  4.61558E+00  1.00951E+00  8.22458E-06  1.33039E-06  3.21060E-05
1.12202E+01  4.07480E+00  2.32745E+01  3.32103E+00  7.53863E-01  4.85504E-06  7.63525E-07  1.86486E-05
1.25893E+01  2.92026E+00  1.79991E+01  2.35729E+00  5.63025E-01  2.77023E-06  4.30523E-07  1.08431E-05
1.41254E+01  2.06659E+00  1.37571E+01  1.64613E+00  4.20496E-01  1.69346E-06  2.48600E-07  6.31413E-06
1.58489E+01  1.44181E+00  1.03890E+01  1.12783E+00  3.14003E-01  1.09683E-06  1.46804E-07  3.68335E-06
1.77828E+01  9.90507E-01  7.75232E+00  7.56115E-01  2.34404E-01  6.56316E-07  8.39092E-08  2.15264E-06
1.99526E+01  6.69639E-01  5.71994E+00  4.94770E-01  1.74889E-01  3.77692E-07  4.50228E-08  1.26027E-06
2.23872E+01  4.45626E-01  4.17828E+00  3.15257E-01  1.30379E-01  2.43239E-07  2.66239E-08  7.38963E-07
2.51189E+01  2.92254E-01  3.02717E+00  1.95182E-01  9.70834E-02  1.31984E-07  1.34063E-08  4.33808E-07
2.81838E+01  1.89360E-01  2.18014E+00  1.17199E-01  7.21721E-02  6.39681E-08  5.93572E-09  2.54866E-07
3.16228E+01  1.21675E-01  1.56435E+00  6.81498E-02  5.35315E-02  4.09839E-08  3.48313E-09  1.49779E-07
3.54814E+01  7.79210E-02  1.12039E+00  3.83419E-02  3.95848E-02  2.36845E-08  1.82967E-09  8.80054E-08
3.98108E+01  5.00232E-02  8.01378E-01  2.08715E-02  2.91546E-02  1.51069E-08  1.10549E-09  5.16742E-08
4.46684E+01  3.23697E-02  5.71594E-01  1.10092E-02  2.13619E-02  9.59198E-09  6.82368E-10  3.03074E-08
5.01187E+01  2.11984E-02  4.04762E-01  5.64910E-03  1.55507E-02  5.16087E-09  3.36100E-10  1.77480E-08
5.62341E+01  1.40702E-02  2.82175E-01  2.84155E-03  1.12301E-02  2.36807E-09  1.28685E-10  1.03726E-08
6.30958E+01  9.45124E-03  1.90880E-01  1.41971E-03  8.03225E-03  1.48708E-09  8.18889E-11  6.04804E-09
7.07946E+01  6.39851E-03  1.22073E-01  7.18467E-04  5.68040E-03  9.27960E-10  5.26430E-11  3.51734E-09
7.94329E+01  4.34189E-03  6.98058E-02  3.77157E-04  3.96515E-03  2.18719E-10  2.59885E-19  2.03993E-09
8.91251E+01  2.93681E-03  3.00114E-02  2.09694E-04  2.72732E-03  1.35464E-10  1.07324E-19  1.17980E-09
# I am pretty sure nobody will read this line, but maybe I am wrong;)
