<svg xmlns="http://www.w3.org/2000/svg" width="48.88" height="49.598" viewBox="0 0 48.88 49.598">
  <g id="Group_33" data-name="Group 33" transform="translate(-1057.896 -514)">
    <g id="Group_32" data-name="Group 32" transform="translate(-56)">
      <ellipse id="Ellipse_68" data-name="Ellipse 68" cx="22.542" cy="22.542" rx="22.542" ry="22.542" transform="translate(1113.896 518.515)" fill="#f2f2f2"/>
      <path id="Path_126" data-name="Path 126" d="M22.888,45.777A22.888,22.888,0,1,1,45.777,22.888,22.888,22.888,0,0,1,22.888,45.777Zm0-45.083A22.195,22.195,0,1,0,45.083,22.888,22.195,22.195,0,0,0,22.888.694Z" transform="translate(1117 514)" fill="#3f3d56"/>
      <text id="Prep" transform="translate(1140 541)" fill="blue" font-size="14" font-family="Kade-Medium, Kade" font-weight="500"><tspan x="-15.162" y="0">Prep</tspan></text>
    </g>
  </g>
</svg>
