﻿fio;fullname;login
Бел;2018-3-01-bel;AUTUMN
Бур;2018-3-02-Bur;master
Вор;2018-3-04-vor;Yaroslav_Vlasov
Гуд;2018-3-06-gma;otg6
Гул;2018-3-07-gul;teamtimp
Доц;2018-3-09-doc;docik
Кош;2018-3-13-kos;Renaissance
Куд;2018-3-15-kud;SadOvnik
Леп;2018-3-16-lep;rinl01
Мир;2018-3-18-mir;banger
Поз;2018-3-22-poz;nick
Сыр;2018-3-25-syr;sky56x
Тиш;2018-3-26-tia;tis

