{
	"service_name": "grouper",
	"service_fullname": "Gitlab Grouper App",
	"default_urn": "/grouper/",
	"developer": "2018-3-27 Ura",
	"curators": ["anetto"],
	"static": "/static/",
	"app_port": 5000,
	"allowed_services": "grouper",
	"update_token": "0adeaf40-1196-49b4-8b13-7d9cc68b005c"
}
