{
	"service_name": "diplomer",
	"app_port": "8000",
	"default_urn": "/diplomer/api/v1/issues",
	"static": "/static/",
	"allowed_services": ["docxer"],
	"update_token": "311a1f57-8ca6-4e57-94e6-cd6e11046fe5",
	"curators": ["barabass"],
	"developer": ["zomk", "apbfor"]
}

