{
    "application": "MagiCALC",
    "applicationProcess": "Deploy",
    "environment": "PRODUCTION",
    "versions": [
        {
            "version": "latest",
            "component": "MagiCALC-API"
        },
        {
            "version": "latest",
            "component": "MagiCALC-UI"
        }
    ]
}
