{
  "openapi": "3.0.0",
  "info": {
    "title": "MagiCALC API",
    "description": "Handles mathematical functions for MagiCALC UI",
    "version": "0.0.1"
  },
  "paths": {
    "/calc/add/{int1}/{int2}": {
      "get": {
        "summary": "returns the sum of the two parameters int1 and int2",
        "parameters": [
          {
            "name": "int1",
            "in": "path",
            "required": true,
            "description": "An integer value",
            "schema": {
              "type": "integer",
              "format": "int64",
              "minimum": 1
            }
          },
          {
            "name": "int2",
            "in": "path",
            "required": true,
            "description": "An integer value",
            "schema": {
              "type": "integer",
              "format": "int64",
              "minimum": 1
            }
          }
        ],
        "responses": {
          "200": {
            "description": "OK"
          },
          "500": {
            "description": "Invalid parameters"
          }
        }
      }
    },
    "/calc/subtract/{int1}/{int2}": {
      "get": {
        "summary": "returns the difference of the two parameters int1 and int2",
        "parameters": [
          {
            "name": "int1",
            "in": "path",
            "required": true,
            "description": "An integer value",
            "schema": {
              "type": "integer",
              "format": "int64",
              "minimum": 1
            }
          },
          {
            "name": "int2",
            "in": "path",
            "required": true,
            "description": "An integer value",
            "schema": {
              "type": "integer",
              "format": "int64",
              "minimum": 1
            }
          }
        ],
        "responses": {
          "200": {
            "description": "OK"
          },
          "500": {
            "description": "Invalid parameters"
          }
        }
      }
    }  

  }
}
