module gitlab.com/gitlab-org/vulnerability-research/foss/micro-language-framework

go 1.19

require (
	github.com/olekukonko/tablewriter v0.0.5
	github.com/stretchr/testify v1.7.1
)

require (
	github.com/davecgh/go-spew v1.1.0 // indirect
	github.com/mattn/go-runewidth v0.0.15 // indirect
	github.com/pmezard/go-difflib v1.0.0 // indirect
	github.com/rivo/uniseg v0.4.7 // indirect
	gopkg.in/yaml.v3 v3.0.0-20200313102051-9f266ea9e77c // indirect
)
