2025-03-07: 1259, 1608
2025-03-06: 1259, 1607
2025-03-06: 1259, 1606
2025-03-06: 1258, 1606
2025-03-05: 1258, 1604
2025-03-05: 1258, 1603
2025-03-05: 1257, 1603
2025-03-05: 1256, 1602
2025-03-04: 1255, 1602
2025-03-04: 1255, 1601
2025-03-04: 1254, 1601
2025-03-04: 1254, 1602
2025-03-04: 1253, 1602
2025-03-04: 1253, 1603
2025-03-04: 1254, 1603
2025-03-03: 1253, 1603
2025-03-03: 1253, 1602
2025-03-03: 1252, 1602
2025-03-03: 1252, 1601
2025-03-03: 1252, 1600
2025-03-03: 1252, 1599
2025-02-28: 1248, 1598
2025-02-28: 1247, 1598
2025-02-28: 1246, 1598
2025-02-27: 1244, 1598
2025-02-26: 1242, 1598
2025-02-26: 1242, 1597
2025-02-26: 1241, 1597
2025-02-26: 1241, 1596
2025-02-25: 1240, 1596
2025-02-25: 1238, 1596
2025-02-25: 1237, 1595
2025-02-25: 1236, 1595
2025-02-25: 1235, 1595
2025-02-25: 1233, 1595
2025-02-24: 1232, 1595
2025-02-24: 1231, 1595
2025-02-24: 1230, 1595
2025-02-24: 1228, 1595
2025-02-24: 1227, 1595
2025-02-21: 1227, 1594
2025-02-21: 1227, 1593
2025-02-20: 1226, 1592
2025-02-19: 1226, 1591
2025-02-19: 1225, 1591
2025-02-19: 1223, 1591
2025-02-19: 1223, 1590
2025-02-19: 1222, 1589
2025-02-18: 1221, 1587
2025-02-18: 1220, 1587
2025-02-18: 1220, 1586
2025-02-18: 1219, 1586
2025-02-18: 1218, 1586
2025-02-17: 1216, 1586
2025-02-17: 1214, 1579
2025-02-17: 1213, 1579
2025-02-14: 1212, 1578
2025-02-13: 1211, 1578
2025-02-13: 1210, 1578
2025-02-13: 1209, 1578
2025-02-13: 1208, 1578
2025-02-12: 1208, 1577
2025-02-12: 1208, 1576
2025-02-12: 1208, 1575
2025-02-12: 1206, 1575
2025-02-11: 1204, 1572
2025-02-11: 1204, 1571
2025-02-11: 1203, 1571
2025-02-11: 1203, 1570
2025-02-11: 1203, 1571
2025-02-10: 1203, 1568
2025-02-10: 1202, 1568
2025-02-10: 1202, 1567
2025-02-10: 1202, 1566
2025-02-10: 1201, 1566
2025-02-09: 1200, 1565
2025-02-09: 1200, 1563
2025-02-07: 1200, 1562
2025-02-07: 1200, 1561
2025-02-07: 1200, 1555
2025-02-07: 1199, 1555
2025-02-06: 1199, 1554
2025-02-06: 1198, 1554
2025-02-06: 1197, 1554
2025-02-06: 1196, 1554
2025-02-06: 1195, 1553
2025-02-06: 1196, 1553
2025-02-06: 1195, 1553
2025-02-05: 1194, 1553
2025-02-04: 1191, 1545
2025-01-30: 1198, 1559
2025-01-30: 1197, 1559
2025-01-30: 1197, 1558
2025-01-30: 1196, 1558
2025-01-30: 1196, 1557
2025-01-30: 1193, 1557
2025-01-30: 1192, 1557
2025-01-30: 1192, 1556
2025-01-29: 1192, 1554
2025-01-29: 1190, 1554
2025-01-28: 1189, 1554
2025-01-28: 1188, 1554
2025-01-28: 1189, 1554
2025-01-27: 1188, 1554
2025-01-27: 1188, 1553
2025-01-24: 1188, 1552
2025-01-24: 1188, 1551
2025-01-24: 1188, 1550
2025-01-23: 1187, 1550
2025-01-23: 1186, 1550
2025-01-23: 1185, 1550
2025-01-23: 1185, 1549
2025-01-23: 1185, 1548
2025-01-22: 1184, 1548
2025-01-22: 1184, 1547
2025-01-21: 1183, 1547
2025-01-17: 1181, 1547
2025-01-17: 1178, 1547
2025-01-17: 1175, 1547
2025-01-17: 1174, 1547
2025-01-16: 1173, 1547
2025-01-16: 1172, 1547
2025-01-16: 1171, 1547
2025-01-16: 1171, 1544
2025-01-16: 1171, 1543
2025-01-16: 1170, 1541
2025-01-16: 1169, 1541
2025-01-16: 1168, 1541
2025-01-15: 1167, 1541
2025-01-15: 1167, 1540
2025-01-14: 1166, 1540
2025-01-14: 1167, 1540
2025-01-14: 1165, 1540
2025-01-14: 1162, 1540
2025-01-14: 1162, 1539
2025-01-13: 1162, 1538
2025-01-13: 1162, 1534
2025-01-13: 1162, 1533
2025-01-13: 1161, 1533
2025-01-13: 1160, 1533
2025-01-13: 1158, 1533
2025-01-13: 1157, 1531
2025-01-11: 1156, 1531
2025-01-10: 1155, 1530
2025-01-10: 1154, 1530
2025-01-10: 1154, 1529
2025-01-10: 1153, 1528
2025-01-10: 1152, 1529
2025-01-10: 1152, 1528
2025-01-09: 1151, 1528
2025-01-09: 1151, 1527
2025-01-09: 1151, 1526
2025-01-09: 1151, 1525
2025-01-09: 1152, 1523
2025-01-09: 1150, 1523
2025-01-09: 1149, 1523
2025-01-09: 1148, 1523
2025-01-08: 1147, 1523
2025-01-08: 1146, 1523
2025-01-08: 1145, 1523
2025-01-08: 1144, 1523
2025-01-08: 1143, 1523
2025-01-08: 1142, 1523
2025-01-08: 1142, 1522
2025-01-08: 1142, 1521
2025-01-08: 1141, 1521
2025-01-07: 1141, 1520
2025-01-07: 1140, 1520
2025-01-07: 1139, 1520
2025-01-07: 1139, 1517
2025-01-07: 1138, 1516
2025-01-07: 1138, 1515
2025-01-07: 1137, 1515
2025-01-07: 1136, 1514
2025-01-07: 1136, 1513
2025-01-06: 1135, 1504
2025-01-06: 1131, 1504
2025-01-06: 1130, 1504
2025-01-06: 1129, 1504
2025-01-06: 1128, 1504
2025-01-03: 1127, 1503
2025-01-03: 1126, 1503
2025-01-03: 1125, 1503
2025-01-03: 1125, 1502
2025-01-03: 1125, 1501
2025-01-03: 1124, 1500
2025-01-03: 1123, 1500
2025-01-02: 1120, 1499
2025-01-02: 1119, 1499
2024-12-31: 1119, 1500
2024-12-31: 1118, 1500
2024-12-31: 1117, 1500
2024-12-30: 1118, 1500
2024-12-30: 1117, 1500
2024-12-30: 1117, 1499
2024-12-29: 1117, 1498
2024-12-27: 1116, 1498
2024-12-24: 1115, 1498
2024-12-24: 1114, 1497
2024-12-24: 1113, 1497
2024-12-24: 1112, 1497
2024-12-23: 1111, 1497
2024-12-20: 1111, 1496
2024-12-20: 1104, 1496
2024-12-20: 1104, 1495
2024-12-20: 1103, 1495
2024-12-20: 1102, 1495
2024-12-19: 1102, 1494
2024-12-19: 1101, 1494
2024-12-19: 1101, 1493
2024-12-19: 1098, 1492
2024-12-19: 1098, 1491
2024-12-19: 1098, 1493
2024-12-18: 1098, 1492
2024-12-18: 1098, 1491
2024-12-18: 1096, 1491
2024-12-18: 1096, 1490
2024-12-18: 1096, 1489
2024-12-18: 1095, 1489
2024-12-18: 1094, 1489
2024-12-18: 1096, 1490
2024-12-17: 1096, 1488
2024-12-17: 1096, 1486
2024-12-17: 1095, 1486
2024-12-17: 1099, 1507
2024-12-17: 1098, 1507
2024-12-17: 1097, 1506
2024-12-16: 1096, 1506
2024-12-16: 1096, 1505
2024-12-15: 1094, 1503
2024-12-13: 1094, 1502
2024-12-13: 1094, 1500
2024-12-13: 1093, 1500
2024-12-13: 1093, 1499
2024-12-12: 1092, 1499
2024-12-12: 1091, 1499
2024-12-11: 1090, 1499
2024-12-11: 1089, 1499
2024-12-11: 1090, 1499
2024-12-11: 1089, 1498
2024-12-11: 1088, 1498
2024-12-11: 1088, 1495
2024-12-11: 1088, 1494
2024-12-11: 1087, 1491
2024-12-11: 1087, 1494
2024-12-10: 1087, 1493
2024-12-10: 1087, 1492
2024-12-10: 1087, 1493
2024-12-10: 1087, 1492
2024-12-09: 1086, 1492
2024-12-09: 1085, 1492
2024-12-09: 1086, 1490
2024-12-09: 1086, 1489
2024-12-09: 1084, 1489
2024-12-09: 1084, 1488
2024-12-06: 1084, 1485
2024-12-06: 1084, 1486
2024-12-06: 1083, 1486
2024-12-06: 1082, 1486
2024-12-06: 1083, 1486
2024-12-05: 1082, 1486
2024-12-05: 1082, 1485
2024-12-05: 1083, 1485
2024-12-05: 1082, 1485
2024-12-05: 1081, 1485
2024-12-05: 1082, 1485
2024-12-04: 1081, 1485
2024-12-04: 1080, 1485
2024-12-04: 1079, 1485
2024-12-03: 1078, 1485
2024-12-03: 1078, 1484
2024-12-03: 1076, 1484
2024-12-03: 1075, 1484
2024-12-03: 1073, 1484
2024-12-02: 1072, 1483
2024-12-02: 1072, 1482
2024-12-02: 1072, 1481
2024-12-02: 1072, 1480
2024-12-02: 1071, 1480
2024-12-02: 1072, 1480
2024-12-01: 1071, 1480
2024-11-29: 1070, 1480
2024-11-29: 1070, 1478
2024-11-29: 1069, 1478
2024-11-28: 1069, 1477
2024-11-28: 1068, 1477
2024-11-28: 1068, 1476
2024-11-28: 1068, 1475
2024-11-28: 1068, 1474
2024-11-28: 1067, 1474
2024-11-27: 1066, 1474
2024-11-27: 1066, 1473
2024-11-27: 1066, 1472
2024-11-27: 1065, 1472
2024-11-27: 1064, 1472
2024-11-27: 1063, 1472
2024-11-27: 1062, 1472
2024-11-27: 1061, 1472
2024-11-26: 1061, 1473
2024-11-26: 1060, 1473
2024-11-26: 1058, 1473
2024-11-26: 1058, 1472
2024-11-26: 1054, 1472
2024-11-25: 1052, 1473
2024-11-25: 1052, 1472
2024-11-25: 1051, 1472
2024-11-25: 1051, 1471
2024-11-24: 1051, 1470
2024-11-24: 1050, 1470
2024-11-22: 1049, 1470
2024-11-22: 1048, 1470
2024-11-22: 1048, 1469
2024-11-22: 1048, 1468
2024-11-22: 1046, 1468
2024-11-22: 1046, 1466
2024-11-22: 1045, 1466
2024-11-22: 1045, 1465
2024-11-22: 1043, 1465
2024-11-22: 1041, 1465
2024-11-21: 1041, 1464
2024-11-21: 1040, 1465
2024-11-21: 1040, 1464
2024-11-21: 1039, 1464
2024-11-21: 1038, 1464
2024-11-21: 1068, 1509
2024-11-21: 1067, 1509
2024-11-21: 1066, 1510
2024-11-20: 1065, 1510
2024-11-20: 1065, 1511
2024-11-20: 1064, 1513
2024-11-20: 1063, 1513
2024-11-20: 1062, 1511
2024-11-20: 1061, 1510
2024-11-19: 1060, 1510
2024-11-19: 1060, 1513
2024-11-19: 1060, 1512
2024-11-19: 1059, 1512
2024-11-19: 1059, 1513
2024-11-19: 1058, 1513
2024-11-19: 1058, 1512
2024-11-19: 1058, 1513
2024-11-19: 1057, 1513
2024-11-18: 1056, 1514
2024-11-18: 1056, 1510
2024-11-18: 1055, 1510
2024-11-18: 1054, 1507
2024-11-18: 1054, 1506
2024-11-18: 1054, 1505
2024-11-18: 1053, 1502
2024-11-17: 1052, 1502
2024-11-17: 1053, 1502
2024-11-15: 1052, 1502
2024-11-15: 1051, 1502
2024-11-15: 1051, 1501
2024-11-15: 1051, 1500
2024-11-15: 1050, 1500
2024-11-15: 1048, 1500
2024-11-14: 1046, 1499
2024-11-14: 1045, 1499
2024-11-14: 1044, 1497
2024-11-14: 1044, 1496
2024-11-14: 1044, 1495
2024-11-14: 1044, 1488
2024-11-14: 1042, 1487
2024-11-14: 1042, 1481
2024-11-14: 1042, 1480
2024-11-14: 1049, 1480
2024-11-14: 1051, 1479
2024-11-13: 1036, 1479
2024-11-13: 1035, 1479
2024-11-13: 1034, 1479
2024-11-13: 1033, 1478
2024-11-13: 1033, 1477
2024-11-13: 1033, 1476
2024-11-12: 1032, 1476
2024-11-12: 1031, 1469
2024-11-12: 1031, 1471
2024-11-12: 1029, 1468
2024-11-12: 1027, 1473
2024-11-12: 1027, 1472
2024-11-12: 1026, 1472
2024-11-12: 1026, 1471
2024-11-12: 1026, 1469
2024-11-12: 1023, 1469
2024-11-12: 1022, 1469
2024-11-11: 1022, 1468
2024-11-11: 1021, 1468
2024-11-11: 1021, 1467
2024-11-11: 1021, 1464
2024-11-11: 1020, 1464
2024-11-11: 1019, 1464
2024-11-11: 1019, 1463
2024-11-11: 1018, 1463
2024-11-11: 1017, 1463
2024-11-11: 1017, 1462
2024-11-08: 1017, 1461
2024-11-08: 1016, 1461
2024-11-08: 1016, 1460
2024-11-08: 1014, 1462
2024-11-08: 1014, 1461
2024-11-08: 1013, 1461
2024-11-08: 1013, 1459
2024-11-08: 1012, 1458
2024-11-08: 1012, 1457
2024-11-08: 1011, 1457
2024-11-07: 1011, 1458
2024-11-07: 1011, 1457
2024-11-07: 1008, 1456
2024-11-07: 1007, 1457
2024-11-07: 1005, 1457
2024-11-07: 1004, 1456
2024-11-06: 1002, 1456
2024-11-06: 1002, 1455
2024-11-06: 1001, 1455
2024-11-06: 1000, 1455
2024-11-06: 997, 1457
2024-11-06: 996, 1457
2024-11-06: 995, 1457
2024-11-06: 994, 1457
2024-11-06: 993, 1456
2024-11-05: 993, 1455
2024-11-05: 992, 1455
2024-11-05: 991, 1455
2024-11-05: 990, 1454
2024-11-05: 989, 1454
2024-11-05: 989, 1453
2024-11-05: 988, 1453
2024-11-04: 987, 1453
2024-11-04: 987, 1454
2024-11-04: 987, 1453
2024-11-04: 986, 1453
2024-11-04: 986, 1452
2024-11-04: 984, 1451
2024-11-04: 983, 1451
2024-11-04: 982, 1450
2024-11-04: 981, 1450
2024-11-04: 980, 1450
2024-11-03: 980, 1449
2024-11-02: 979, 1449
2024-11-01: 978, 1449
2024-11-01: 977, 1449
2024-11-01: 976, 1450
2024-11-01: 976, 1449
2024-11-01: 975, 1449
2024-10-31: 975, 1448
2024-10-31: 974, 1448
2024-10-31: 974, 1445
2024-10-31: 973, 1443
2024-10-31: 973, 1441
2024-10-31: 972, 1441
2024-10-31: 972, 1439
2024-10-31: 971, 1439
2024-10-30: 971, 1438
2024-10-30: 971, 1437
2024-10-30: 971, 1438
2024-10-30: 970, 1437
2024-10-30: 969, 1437
2024-10-30: 969, 1436
2024-10-30: 968, 1436
2024-10-30: 967, 1432
2024-10-30: 962, 1432
2024-10-30: 960, 1432
2024-10-29: 958, 1432
2024-10-29: 956, 1433
2024-10-29: 956, 1432
2024-10-29: 954, 1431
2024-10-29: 953, 1431
2024-10-29: 952, 1431
2024-10-29: 951, 1431
2024-10-29: 951, 1432
2024-10-29: 951, 1433
2024-10-29: 951, 1432
2024-10-28: 951, 1431
2024-10-28: 951, 1428
2024-10-28: 951, 1427
2024-10-28: 950, 1427
2024-10-28: 949, 1424
2024-10-28: 948, 1424
2024-10-28: 948, 1423
2024-10-28: 945, 1422
2024-10-25: 944, 1422
2024-10-25: 944, 1421
2024-10-25: 944, 1420
2024-10-25: 943, 1420
2024-10-25: 942, 1420
2024-10-25: 940, 1420
2024-10-25: 939, 1420
2024-10-24: 939, 1419
2024-10-24: 939, 1421
2024-10-24: 939, 1427
2024-10-24: 937, 1428
2024-10-24: 935, 1427
2024-10-24: 934, 1425
2024-10-24: 935, 1425
2024-10-24: 933, 1425
2024-10-24: 931, 1425
2024-10-24: 931, 1424
2024-10-23: 930, 1424
2024-10-23: 929, 1423
2024-10-23: 929, 1422
2024-10-23: 929, 1421
2024-10-23: 929, 1420
2024-10-23: 930, 1420
2024-10-23: 929, 1420
2024-10-23: 928, 1418
2024-10-23: 928, 1417
2024-10-23: 927, 1417
2024-10-22: 926, 1417
2024-10-22: 924, 1417
2024-10-22: 924, 1416
2024-10-22: 924, 1415
2024-10-22: 923, 1414
2024-10-22: 922, 1414
2024-10-22: 922, 1416
2024-10-22: 921, 1413
2024-10-21: 921, 1409
2024-10-21: 917, 1409
2024-10-21: 917, 1408
2024-10-21: 916, 1407
2024-10-21: 915, 1407
2024-10-21: 915, 1406
2024-10-21: 915, 1405
2024-10-18: 914, 1405
2024-10-18: 914, 1404
2024-10-18: 913, 1404
2024-10-18: 911, 1398
2024-10-18: 910, 1396
2024-10-18: 910, 1395
2024-10-18: 909, 1395
2024-10-18: 907, 1394
2024-10-18: 907, 1393
2024-10-18: 906, 1393
2024-10-17: 903, 1393
2024-10-17: 903, 1391
2024-10-17: 901, 1391
2024-10-17: 899, 1391
2024-10-17: 896, 1388
2024-10-17: 894, 1388
2024-10-16: 894, 1387
2024-10-16: 894, 1386
2024-10-16: 894, 1385
2024-10-16: 894, 1384
2024-10-16: 893, 1384
2024-10-16: 892, 1380
2024-10-16: 892, 1374
2024-10-16: 892, 1373
2024-10-16: 892, 1372
2024-10-15: 891, 1372
2024-10-15: 890, 1372
2024-10-15: 890, 1371
2024-10-15: 890, 1370
2024-10-15: 888, 1370
2024-10-15: 887, 1370
2024-10-15: 886, 1370
2024-10-15: 886, 1364
2024-10-15: 885, 1363
2024-10-14: 883, 1355
2024-10-14: 883, 1354
2024-10-14: 883, 1349
2024-10-14: 883, 1347
2024-10-14: 881, 1346
2024-10-14: 881, 1345
2024-10-14: 880, 1345
2024-10-14: 878, 1345
2024-10-13: 880, 1345
2024-10-13: 881, 1345
2024-10-12: 881, 1344
2024-10-11: 881, 1343
2024-10-11: 881, 1335
2024-10-11: 880, 1333
2024-10-11: 878, 1333
2024-10-11: 877, 1333
2024-10-11: 877, 1331
2024-10-11: 876, 1331
2024-10-10: 874, 1331
2024-10-10: 875, 1331
2024-10-10: 875, 1330
2024-10-10: 874, 1330
2024-10-10: 873, 1330
2024-10-10: 873, 1329
2024-10-10: 874, 1329
2024-10-09: 873, 1329
2024-10-09: 873, 1328
2024-10-09: 873, 1327
2024-10-08: 873, 1320
2024-10-08: 872, 1320
2024-10-08: 871, 1320
2024-10-08: 870, 1320
2024-10-08: 868, 1319
2024-10-08: 867, 1319
2024-10-07: 867, 1320
2024-10-07: 867, 1319
2024-10-07: 867, 1316
2024-10-07: 866, 1316
2024-10-07: 866, 1315
2024-10-07: 866, 1314
2024-10-07: 866, 1313
2024-10-05: 865, 1312
2024-10-04: 864, 1312
2024-10-04: 863, 1312
2024-10-04: 862, 1311
2024-10-04: 862, 1310
2024-10-04: 861, 1310
2024-10-04: 861, 1312
2024-10-03: 861, 1311
2024-10-03: 860, 1311
2024-10-03: 857, 1309
2024-10-03: 857, 1308
2024-10-03: 856, 1308
2024-10-02: 855, 1308
2024-10-02: 855, 1307
2024-10-02: 854, 1307
2024-10-01: 854, 1306
2024-10-01: 853, 1306
2024-10-01: 853, 1305
2024-10-01: 851, 1305
2024-10-01: 851, 1304
2024-10-01: 851, 1303
2024-09-30: 850, 1303
2024-09-30: 851, 1303
2024-09-30: 850, 1303
2024-09-27: 849, 1303
2024-09-27: 849, 1302
2024-09-27: 848, 1302
2024-09-27: 847, 1301
2024-09-27: 846, 1301
2024-09-27: 844, 1299
2024-09-27: 844, 1294
2024-09-27: 843, 1294
2024-09-27: 842, 1294
2024-09-26: 842, 1295
2024-09-26: 842, 1294
2024-09-26: 841, 1294
2024-09-26: 840, 1294
2024-09-26: 838, 1293
2024-09-26: 836, 1293
2024-09-26: 835, 1293
2024-09-26: 834, 1293
2024-09-26: 834, 1292
2024-09-26: 834, 1291
2024-09-26: 833, 1291
2024-09-25: 833, 1290
2024-09-25: 831, 1290
2024-09-25: 831, 1289
2024-09-25: 828, 1289
2024-09-25: 826, 1287
2024-09-25: 825, 1286
2024-09-24: 825, 1285
2024-09-24: 823, 1280
2024-09-24: 822, 1280
2024-09-24: 822, 1279
2024-09-24: 821, 1279
2024-09-24: 821, 1278
2024-09-24: 820, 1278
2024-09-24: 819, 1278
2024-09-24: 818, 1283
2024-09-24: 817, 1283
2024-09-24: 816, 1283
2024-09-24: 815, 1283
2024-09-24: 814, 1283
2024-09-24: 814, 1282
2024-09-23: 814, 1281
2024-09-23: 813, 1281
2024-09-23: 813, 1280
2024-09-23: 812, 1280
2024-09-23: 812, 1279
2024-09-23: 812, 1277
2024-09-20: 811, 1277
2024-09-20: 811, 1276
2024-09-20: 810, 1276
2024-09-20: 809, 1276
2024-09-20: 808, 1276
2024-09-20: 808, 1274
2024-09-19: 808, 1273
2024-09-19: 807, 1273
2024-09-19: 806, 1273
2024-09-18: 805, 1273
2024-09-18: 804, 1267
2024-09-18: 803, 1267
2024-09-18: 803, 1264
2024-09-18: 801, 1264
2024-09-18: 800, 1264
2024-09-18: 799, 1264
2024-09-18: 803, 1281
2024-09-18: 803, 1280
2024-09-17: 801, 1280
2024-09-17: 800, 1280
2024-09-17: 800, 1278
2024-09-17: 800, 1276
2024-09-17: 800, 1274
2024-09-17: 799, 1268
2024-09-17: 798, 1265
2024-09-17: 795, 1249
2024-09-17: 794, 1248
2024-09-17: 793, 1247
2024-09-17: 793, 1243
2024-09-16: 791, 1242
2024-09-16: 791, 1241
2024-09-16: 791, 1237
2024-09-16: 791, 1234
2024-09-16: 791, 1233
2024-09-16: 791, 1232
2024-09-16: 790, 1232
2024-09-13: 791, 1232
2024-09-13: 790, 1231
2024-09-12: 788, 1231
2024-09-12: 788, 1230
2024-09-12: 787, 1230
2024-09-12: 787, 1229
2024-09-12: 786, 1228
2024-09-12: 785, 1228
2024-09-11: 784, 1227
2024-09-11: 784, 1228
2024-09-11: 783, 1228
2024-09-11: 783, 1226
2024-09-11: 782, 1226
2024-09-11: 782, 1225
2024-09-11: 782, 1226
2024-09-11: 781, 1226
2024-09-11: 780, 1226
2024-09-11: 772, 1226
2024-09-10: 771, 1226
2024-09-10: 771, 1225
2024-09-10: 770, 1225
2024-09-10: 769, 1219
2024-09-10: 769, 1214
2024-09-10: 768, 1213
2024-09-09: 767, 1213
2024-09-09: 767, 1212
2024-09-09: 766, 1212
2024-09-06: 766, 1211
2024-09-06: 765, 1211
2024-09-05: 765, 1210
2024-09-05: 763, 1210
2024-09-05: 762, 1210
2024-09-05: 762, 1209
2024-09-05: 761, 1209
2024-09-04: 761, 1207
2024-09-04: 761, 1206
2024-09-04: 758, 1205
2024-09-04: 757, 1204
2024-09-03: 756, 1204
2024-09-03: 755, 1204
2024-09-03: 754, 1204
2024-09-03: 754, 1203
2024-09-03: 753, 1203
2024-09-03: 753, 1202
2024-09-03: 753, 1201
2024-09-03: 753, 1200
2024-09-03: 753, 1199
2024-09-03: 753, 1198
2024-09-02: 752, 1197
2024-09-02: 752, 1196
2024-09-02: 751, 1196
2024-09-02: 750, 1195
2024-09-02: 749, 1194
2024-09-02: 749, 1193
2024-09-02: 748, 1193
2024-08-30: 748, 1192
2024-08-30: 747, 1192
2024-08-30: 747, 1191
2024-08-30: 746, 1191
2024-08-30: 745, 1192
2024-08-30: 745, 1191
2024-08-30: 745, 1189
2024-08-29: 746, 1189
2024-08-29: 746, 1187
2024-08-29: 745, 1187
2024-08-29: 745, 1186
2024-08-29: 745, 1185
2024-08-29: 743, 1184
2024-08-28: 741, 1184
2024-08-28: 741, 1183
2024-08-28: 747, 1191
2024-08-28: 747, 1189
2024-08-28: 746, 1188
2024-08-27: 745, 1188
2024-08-27: 744, 1188
2024-08-27: 742, 1188
2024-08-27: 742, 1187
2024-08-27: 741, 1187
2024-08-27: 740, 1185
2024-08-26: 740, 1184
2024-08-26: 739, 1184
2024-08-26: 739, 1183
2024-08-26: 739, 1182
2024-08-26: 738, 1181
2024-08-23: 736, 1181
2024-08-23: 735, 1180
2024-08-23: 735, 1178
2024-08-23: 735, 1177
2024-08-23: 734, 1176
2024-08-23: 733, 1176
2024-08-23: 733, 1175
2024-08-23: 730, 1174
2024-08-23: 730, 1173
2024-08-23: 729, 1173
2024-08-23: 728, 1173
2024-08-22: 727, 1173
2024-08-22: 727, 1172
2024-08-22: 727, 1171
2024-08-22: 727, 1172
2024-08-22: 726, 1170
2024-08-22: 725, 1170
2024-08-22: 724, 1170
2024-08-22: 724, 1171
2024-08-21: 723, 1171
2024-08-21: 722, 1171
2024-08-21: 721, 1171
2024-08-21: 721, 1170
2024-08-21: 720, 1170
2024-08-21: 719, 1170
2024-08-21: 718, 1170
2024-08-21: 717, 1170
2024-08-20: 717, 1169
2024-08-20: 717, 1168
2024-08-20: 717, 1166
2024-08-20: 717, 1165
2024-08-19: 716, 1165
2024-08-19: 716, 1163
2024-08-19: 716, 1162
2024-08-18: 716, 1161
2024-08-16: 715, 1161
2024-08-16: 715, 1160
2024-08-16: 715, 1158
2024-08-16: 714, 1157
2024-08-15: 713, 1156
2024-08-14: 713, 1154
2024-08-14: 713, 1153
2024-08-14: 711, 1153
2024-08-14: 711, 1152
2024-08-14: 711, 1150
2024-08-13: 710, 1150
2024-08-13: 709, 1150
2024-08-13: 709, 1151
2024-08-13: 707, 1151
2024-08-13: 707, 1150
2024-08-13: 709, 1151
2024-08-13: 709, 1150
2024-08-13: 709, 1149
2024-08-13: 708, 1149
2024-08-12: 708, 1145
2024-08-12: 707, 1144
2024-08-12: 707, 1143
2024-08-12: 705, 1141
2024-08-10: 704, 1141
2024-08-09: 703, 1141
2024-08-09: 703, 1140
2024-08-09: 703, 1139
2024-08-09: 702, 1139
2024-08-09: 700, 1139
2024-08-09: 699, 1139
2024-08-09: 698, 1139
2024-08-09: 697, 1139
2024-08-09: 696, 1139
2024-08-08: 695, 1139
2024-08-08: 694, 1139
2024-08-08: 694, 1138
2024-08-08: 693, 1136
2024-08-08: 693, 1134
2024-08-07: 692, 1134
2024-08-07: 691, 1134
2024-08-07: 690, 1134
2024-08-07: 689, 1134
2024-08-07: 688, 1134
2024-08-07: 688, 1133
2024-08-07: 687, 1132
2024-08-07: 686, 1132
2024-08-07: 686, 1131
2024-08-06: 685, 1130
2024-08-06: 685, 1129
2024-08-06: 685, 1128
2024-08-06: 685, 1127
2024-08-06: 685, 1126
2024-08-06: 685, 1125
2024-08-06: 684, 1125
2024-08-05: 683, 1125
2024-08-05: 683, 1123
2024-08-05: 679, 1123
2024-08-05: 679, 1120
2024-08-05: 678, 1120
2024-08-03: 678, 1118
2024-08-02: 677, 1118
2024-08-02: 676, 1117
2024-08-02: 676, 1116
2024-08-02: 675, 1117
2024-08-02: 674, 1117
2024-08-02: 674, 1118
2024-08-02: 674, 1117
2024-08-02: 674, 1116
2024-08-01: 673, 1115
2024-08-01: 672, 1115
2024-08-01: 671, 1115
2024-08-01: 671, 1114
2024-08-01: 671, 1113
2024-08-01: 671, 1112
2024-08-01: 671, 1111
2024-08-01: 670, 1097
2024-07-31: 670, 1096
2024-07-31: 670, 1095
2024-07-31: 670, 1092
2024-07-30: 668, 1092
2024-07-30: 668, 1095
2024-07-30: 667, 1095
2024-07-30: 667, 1094
2024-07-30: 666, 1094
2024-07-29: 665, 1094
2024-07-29: 664, 1094
2024-07-29: 663, 1094
2024-07-29: 663, 1093
2024-07-29: 663, 1089
2024-07-29: 662, 1075
2024-07-26: 660, 1075
2024-07-26: 659, 1075
2024-07-26: 659, 1074
2024-07-26: 658, 1074
2024-07-26: 658, 1073
2024-07-26: 658, 1072
2024-07-26: 657, 1072
2024-07-26: 656, 1072
2024-07-26: 657, 1072
2024-07-25: 656, 1072
2024-07-25: 655, 1072
2024-07-25: 655, 1070
2024-07-25: 653, 1069
2024-07-25: 650, 1067
2024-07-25: 649, 1067
2024-07-25: 647, 1067
2024-07-25: 646, 1067
2024-07-25: 645, 1066
2024-07-24: 644, 1066
2024-07-24: 643, 1066
2024-07-24: 643, 1064
2024-07-24: 642, 1065
2024-07-24: 642, 1063
2024-07-24: 642, 1062
2024-07-24: 642, 1057
2024-07-23: 643, 1057
2024-07-23: 642, 1057
2024-07-23: 641, 1057
2024-07-23: 634, 1056
2024-07-23: 634, 1055
2024-07-23: 634, 1054
2024-07-23: 633, 1053
2024-07-22: 631, 1052
2024-07-22: 631, 1051
2024-07-22: 633, 1057
2024-07-22: 631, 1053
2024-07-22: 631, 1052
2024-07-22: 629, 1050
2024-07-21: 627, 1049
2024-07-20: 626, 1049
2024-07-19: 625, 1049
2024-07-19: 625, 1048
2024-07-19: 624, 1048
2024-07-19: 622, 1048
2024-07-19: 622, 1051
2024-07-19: 620, 1050
2024-07-19: 619, 1050
2024-07-18: 618, 1050
2024-07-18: 617, 1050
2024-07-18: 617, 1047
2024-07-18: 617, 1046
2024-07-18: 617, 1045
2024-07-18: 617, 1043
2024-07-18: 617, 1042
2024-07-18: 617, 1040
2024-07-17: 617, 1038
2024-07-17: 617, 1037
2024-07-17: 616, 1037
2024-07-17: 614, 1035
2024-07-17: 614, 1034
2024-07-17: 614, 1035
2024-07-17: 613, 1032
2024-07-17: 612, 1029
2024-07-17: 611, 1029
2024-07-17: 610, 1029
2024-07-17: 609, 1029
2024-07-16: 609, 1028
2024-07-16: 608, 1026
2024-07-16: 606, 1026
2024-07-16: 606, 1025
2024-07-16: 606, 1015
2024-07-16: 606, 1014
2024-07-16: 604, 1014
2024-07-15: 604, 1013
2024-07-15: 604, 1012
2024-07-15: 604, 1011
2024-07-15: 604, 1010
2024-07-15: 604, 1009
2024-07-15: 603, 1009
2024-07-15: 603, 1008
2024-07-15: 603, 1007
2024-07-15: 602, 1007
2024-07-12: 601, 1007
2024-07-12: 601, 1006
2024-07-12: 600, 1006
2024-07-12: 600, 1005
2024-07-12: 599, 1005
2024-07-12: 598, 1005
2024-07-12: 597, 1005
2024-07-12: 597, 1004
2024-07-11: 596, 1004
2024-07-11: 595, 998
2024-07-11: 594, 995
2024-07-11: 589, 995
2024-07-11: 588, 995
2024-07-11: 588, 994
2024-07-11: 587, 994
2024-07-11: 586, 994
2024-07-11: 585, 994
2024-07-10: 585, 989
2024-07-10: 585, 990
2024-07-10: 584, 990
2024-07-09: 584, 989
2024-07-09: 583, 989
2024-07-09: 582, 989
2024-07-09: 581, 989
2024-07-09: 581, 988
2024-07-09: 580, 988
2024-07-08: 580, 989
2024-07-08: 579, 989
2024-07-08: 579, 987
2024-07-08: 577, 978
2024-07-08: 577, 974
2024-07-08: 577, 973
2024-07-08: 576, 971
2024-07-08: 576, 970
2024-07-07: 575, 970
2024-07-05: 575, 969
2024-07-05: 575, 968
2024-07-05: 575, 967
2024-07-05: 574, 967
2024-07-04: 572, 967
2024-07-04: 571, 967
2024-07-04: 571, 966
2024-07-04: 571, 964
2024-07-04: 570, 964
2024-07-04: 568, 964
2024-07-04: 567, 963
2024-07-04: 566, 963
2024-07-04: 565, 963
2024-07-04: 565, 962
2024-07-04: 565, 961
2024-07-03: 564, 961
2024-07-03: 563, 959
2024-07-03: 562, 959
2024-07-03: 561, 959
2024-07-03: 559, 959
2024-07-02: 559, 958
2024-07-02: 558, 958
2024-07-02: 558, 957
2024-07-02: 557, 955
2024-07-02: 556, 955
2024-07-02: 556, 954
2024-07-02: 556, 953
2024-07-02: 555, 953
2024-07-02: 555, 952
2024-07-02: 554, 951
2024-07-01: 554, 950
2024-07-01: 554, 949
2024-07-01: 553, 949
2024-07-01: 552, 949
2024-07-01: 551, 948
2024-07-01: 550, 948
2024-07-01: 549, 948
2024-07-01: 549, 947
2024-07-01: 548, 947
2024-06-30: 548, 946
2024-06-28: 548, 945
2024-06-28: 547, 945
2024-06-28: 547, 944
2024-06-28: 546, 944
2024-06-28: 546, 945
2024-06-28: 545, 945
2024-06-28: 542, 946
2024-06-27: 541, 946
2024-06-27: 541, 944
2024-06-27: 540, 944
2024-06-27: 539, 944
2024-06-27: 539, 943
2024-06-26: 537, 941
2024-06-26: 536, 941
2024-06-26: 535, 941
2024-06-26: 535, 940
2024-06-26: 534, 938
2024-06-26: 533, 935
2024-06-25: 532, 934
2024-06-25: 531, 934
2024-06-25: 530, 934
2024-06-25: 530, 933
2024-06-25: 527, 933
2024-06-25: 527, 932
2024-06-25: 527, 931
2024-06-24: 527, 937
2024-06-24: 527, 936
2024-06-24: 526, 936
2024-06-24: 525, 936
2024-06-24: 525, 935
2024-06-24: 524, 935
2024-06-24: 524, 934
2024-06-24: 524, 931
2024-06-24: 524, 927
2024-06-24: 523, 927
2024-06-24: 523, 926
2024-06-23: 523, 925
2024-06-21: 522, 925
2024-06-21: 521, 925
2024-06-21: 520, 925
2024-06-21: 519, 925
2024-06-21: 518, 925
2024-06-19: 518, 926
2024-06-19: 517, 926
2024-06-19: 517, 925
2024-06-19: 514, 925
2024-06-19: 514, 924
2024-06-19: 514, 925
2024-06-19: 514, 924
2024-06-19: 513, 922
2024-06-19: 513, 921
2024-06-18: 511, 921
2024-06-18: 510, 923
2024-06-18: 511, 923
2024-06-18: 511, 922
2024-06-18: 509, 921
2024-06-18: 510, 921
2024-06-18: 510, 920
2024-06-18: 509, 920
2024-06-17: 508, 919
2024-06-17: 507, 918
2024-06-17: 507, 917
2024-06-17: 507, 916
2024-06-13: 506, 916
2024-06-13: 503, 913
2024-06-13: 503, 914
2024-06-13: 502, 914
2024-06-12: 501, 914
2024-06-12: 500, 912
2024-06-12: 500, 913
2024-06-12: 500, 904
2024-06-12: 499, 904
2024-06-12: 499, 903
2024-06-12: 498, 904
2024-06-12: 497, 904
2024-06-11: 497, 903
2024-06-11: 497, 902
2024-06-11: 497, 901
2024-06-11: 496, 900
2024-06-11: 495, 900
2024-06-10: 494, 900
2024-06-10: 494, 899
2024-06-10: 494, 898
2024-06-10: 493, 898
2024-06-10: 493, 897
2024-06-10: 492, 897
2024-06-10: 491, 897
2024-06-10: 491, 898
2024-06-10: 491, 894
2024-06-07: 491, 893
2024-06-07: 491, 892
2024-06-07: 491, 890
2024-06-07: 490, 890
2024-06-07: 490, 888
2024-06-07: 490, 885
2024-06-07: 489, 885
2024-06-06: 489, 887
2024-06-06: 488, 886
2024-06-06: 489, 892
2024-06-06: 489, 891
2024-06-06: 488, 891
2024-06-05: 487, 891
2024-06-05: 487, 890
2024-06-05: 487, 888
2024-06-05: 484, 879
2024-06-05: 484, 878
2024-06-04: 483, 878
2024-06-04: 483, 879
2024-06-04: 483, 878
2024-06-04: 482, 878
2024-06-03: 482, 876
2024-06-03: 481, 876
2024-06-03: 481, 875
2024-06-03: 481, 874
2024-06-03: 481, 872
2024-06-03: 480, 872
2024-06-03: 480, 871
2024-06-03: 480, 870
2024-05-31: 479, 869
2024-05-31: 479, 870
2024-05-30: 479, 869
2024-05-30: 479, 866
2024-05-30: 479, 863
2024-05-30: 480, 869
2024-05-30: 480, 868
2024-05-30: 480, 866
2024-05-29: 479, 866
2024-05-29: 478, 865
2024-05-29: 477, 865
2024-05-29: 476, 865
2024-05-29: 474, 865
2024-05-29: 473, 865
2024-05-29: 473, 864
2024-05-28: 472, 864
2024-05-28: 472, 862
2024-05-28: 466, 846
2024-05-28: 283, 614
2024-05-28: 283, 613
2024-05-28: 283, 614
2024-05-28: 284, 614
2024-05-28: 284, 613
2024-05-28: 283, 613
2024-05-28: 282, 613
2024-05-27: 282, 612
2024-05-27: 282, 610
2024-05-27: 281, 610
2024-05-27: 280, 610
2024-05-27: 280, 609
2024-05-24: 279, 609
2024-05-24: 276, 609
2024-05-24: 275, 609
2024-05-24: 274, 609
2024-05-23: 273, 608
2024-05-23: 273, 607
2024-05-23: 273, 603
2024-05-23: 271, 599
2024-05-22: 271, 598
2024-05-22: 270, 598
2024-05-22: 270, 597
2024-05-22: 270, 596
2024-05-21: 270, 595
2024-05-21: 270, 594
2024-05-21: 270, 592
2024-05-21: 270, 590
2024-05-21: 270, 588
2024-05-21: 270, 587
2024-05-21: 270, 586
2024-05-20: 270, 584
2024-05-20: 268, 583
2024-05-20: 266, 583
2024-05-20: 266, 581
2024-05-20: 266, 580
2024-05-20: 265, 580
2024-05-17: 265, 579
2024-05-17: 264, 578
2024-05-16: 262, 576
2024-05-16: 261, 576
2024-05-16: 261, 575
2024-05-16: 260, 575
2024-05-16: 259, 575
2024-05-16: 259, 574
2024-05-15: 259, 572
2024-05-15: 258, 572
2024-05-15: 258, 571
2024-05-15: 258, 569
2024-05-15: 257, 569
2024-05-14: 256, 569
2024-05-14: 255, 569
2024-05-14: 255, 570
2024-05-14: 255, 569
2024-05-14: 255, 568
2024-05-14: 255, 567
2024-05-14: 253, 565
2024-05-14: 252, 565
2024-05-14: 251, 565
2024-05-13: 251, 564
2024-05-13: 251, 559
2024-05-13: 250, 559
2024-05-13: 250, 558
2024-05-13: 250, 555
2024-05-13: 249, 554
2024-05-13: 247, 552
2024-05-13: 247, 551
2024-05-13: 247, 550
2024-05-13: 247, 548
2024-05-13: 247, 547
2024-05-13: 246, 547
2024-05-10: 246, 546
2024-05-10: 245, 546
2024-05-09: 244, 546
2024-05-09: 244, 547
2024-05-09: 244, 546
2024-05-09: 243, 546
2024-05-09: 243, 545
2024-05-08: 243, 544
2024-05-08: 243, 543
2024-05-08: 243, 542
2024-05-08: 242, 542
2024-05-08: 242, 541
2024-05-07: 242, 537
2024-05-07: 238, 537
2024-05-06: 237, 537
2024-05-06: 237, 536
2024-05-06: 236, 536
2024-05-06: 236, 535
2024-05-03: 236, 534
2024-05-03: 236, 538
2024-05-03: 235, 538
2024-05-03: 235, 537
2024-05-02: 235, 536
2024-05-02: 235, 534
2024-05-02: 234, 534
2024-05-02: 234, 533
2024-05-02: 234, 532
2024-05-02: 234, 530
2024-05-02: 234, 526
2024-05-02: 234, 524
2024-05-02: 234, 520
2024-05-01: 234, 514
2024-05-01: 234, 513
2024-05-01: 234, 514
2024-05-01: 233, 513
2024-05-01: 233, 511
2024-05-01: 233, 510
2024-05-01: 233, 509
2024-05-01: 233, 508
2024-05-01: 232, 507
2024-04-30: 230, 507
2024-04-30: 230, 506
2024-04-30: 226, 507
2024-04-29: 225, 507
2024-04-29: 225, 503
2024-04-29: 225, 502
2024-04-29: 225, 501
2024-04-27: 224, 500
2024-04-26: 224, 499
2024-04-26: 221, 497
2024-04-26: 220, 491
2024-04-26: 219, 491
2024-04-26: 219, 490
2024-04-26: 219, 489
2024-04-26: 219, 488
2024-04-26: 219, 487
2024-04-26: 218, 487
2024-04-25: 217, 487
2024-04-25: 217, 486
2024-04-25: 217, 485
2024-04-25: 217, 481
2024-04-25: 217, 480
2024-04-25: 216, 480
2024-04-24: 215, 479
2024-04-24: 216, 479
2024-04-24: 216, 480
2024-04-24: 216, 477
2024-04-24: 216, 476
2024-04-24: 216, 474
2024-04-23: 216, 478
2024-04-23: 215, 478
2024-04-23: 214, 478
2024-04-23: 215, 478
2024-04-22: 214, 477
2024-04-22: 214, 476
2024-04-21: 214, 474
2024-04-19: 214, 473
2024-04-18: 213, 473
2024-04-18: 213, 471
2024-04-18: 213, 470
2024-04-18: 212, 470
2024-04-17: 198, 425
2024-04-17: 198, 424
2024-04-17: 199, 423
2024-04-17: 198, 423
2024-04-17: 198, 422
2024-04-17: 198, 423
2024-04-17: 197, 423
2024-04-17: 198, 436
2024-04-16: 198, 435
2024-04-16: 198, 436
2024-04-16: 197, 432
2024-04-16: 197, 431
2024-04-15: 197, 429
2024-04-15: 196, 428
2024-04-15: 196, 427
2024-04-15: 196, 423
2024-04-15: 195, 417
2024-04-15: 194, 415
2024-04-12: 193, 415
2024-04-12: 193, 412
2024-04-12: 193, 411
2024-04-12: 193, 410
2024-04-12: 192, 409
2024-04-11: 191, 409
2024-04-11: 191, 407
2024-04-11: 191, 406
2024-04-11: 191, 405
2024-04-10: 191, 404
2024-04-10: 190, 403
2024-04-10: 190, 401
2024-04-10: 189, 401
2024-04-10: 188, 400
2024-04-10: 188, 401
2024-04-09: 191, 401
2024-04-09: 188, 401
2024-04-09: 188, 400
2024-04-09: 188, 399
2024-04-08: 188, 396
2024-04-08: 187, 397
2024-04-08: 187, 396
2024-04-08: 187, 395
2024-04-07: 187, 394
2024-04-05: 187, 393
2024-04-04: 187, 392
2024-04-03: 186, 391
2024-04-03: 185, 391
2024-04-03: 184, 391
2024-04-03: 184, 395
2024-04-03: 184, 393
2024-04-02: 185, 393
2024-04-02: 184, 387
2024-04-02: 184, 386
2024-04-02: 184, 384
2024-03-28: 183, 384
2024-03-28: 183, 383
2024-03-28: 182, 383
2024-03-27: 182, 382
2024-03-26: 181, 382
2024-03-26: 180, 382
2024-03-25: 180, 381
2024-03-25: 179, 381
2024-03-25: 179, 379
2024-03-25: 178, 379
2024-03-24: 177, 379
2024-03-23: 176, 379
2024-03-22: 176, 378
2024-03-22: 175, 378
2024-03-22: 177, 380
2024-03-22: 176, 379
2024-03-21: 175, 379
2024-03-21: 174, 379
2024-03-21: 173, 379
2024-03-21: 172, 374
2024-03-20: 168, 372
2024-03-20: 167, 371
2024-03-20: 167, 368
2024-03-20: 166, 368
2024-03-20: 166, 361
2024-03-20: 166, 349
2024-03-20: 167, 351
2024-03-19: 167, 350
2024-03-19: 163, 338
2024-03-19: 161, 338
2024-03-19: 160, 338
2024-03-18: 160, 337
2024-03-18: 160, 336
2024-03-18: 159, 334
2024-03-18: 158, 331
2024-03-17: 157, 331
2024-03-11: 157, 333
2024-03-11: 156, 333
2024-03-11: 155, 324
2024-03-09: 155, 323
2024-03-08: 154, 323
2024-03-08: 153, 323
2024-03-08: 152, 323
2024-03-08: 152, 320
2024-03-07: 151, 317
2024-03-07: 150, 314
2024-03-07: 151, 314
2024-03-07: 150, 314
2024-03-07: 148, 314
2024-03-07: 146, 314
2024-03-07: 145, 314
2024-03-07: 144, 314
2024-03-06: 143, 314
2024-03-06: 142, 314
2024-03-06: 140, 314
2024-03-06: 137, 314
2024-03-06: 133, 314
2024-03-06: 131, 314
2024-03-06: 128, 313
2024-03-06: 127, 313
2024-03-05: 126, 312
2024-03-05: 126, 310
2024-03-05: 125, 310
2024-03-05: 125, 309
2024-03-04: 124, 309
2024-03-04: 124, 308
2024-03-04: 123, 308
2024-03-04: 122, 308
2024-03-04: 121, 308
2024-03-04: 121, 304
2024-03-04: 120, 303
2024-03-04: 120, 298
2024-03-02: 119, 298
2024-03-01: 116, 298
2024-03-01: 114, 290
2024-03-01: 114, 291
2024-03-01: 114, 290
2024-03-01: 114, 288
2024-02-29: 115, 288
2024-02-29: 114, 287
2024-02-21: 139, 264
2024-02-19: 135, 261
2024-02-17: 133, 258
2024-02-15: 131, 254
2024-02-14: 130, 246
2024-02-13: 129, 245
2024-02-12: 127, 245
2024-02-11: 119, 237
2024-02-10: 119, 237
2024-02-09: 119, 237
2024-02-08: 116, 232
2024-02-07: 111, 226
