module gitlab.com/gitlab-org/technical-writing/docs-gitlab-com

go 1.22.0

toolchain go1.23.3

require (
	github.com/hashicorp/go-version v1.7.0
	github.com/spf13/cobra v1.8.1
	github.com/stretchr/testify v1.10.0
	gopkg.in/yaml.v3 v3.0.1
)

require (
	github.com/davecgh/go-spew v1.1.1 // indirect
	github.com/inconshreveable/mousetrap v1.1.0 // indirect
	github.com/pmezard/go-difflib v1.0.0 // indirect
	github.com/spf13/pflag v1.0.6 // indirect
)
