{
  "version": "2.1",
  "licenses": [
    {
      "id": "BSD-2-Clause",
      "name": "BSD 2-Clause \"Simplified\" License",
      "url": "https://opensource.org/licenses/BSD-2-Clause"
    },
    {
      "id": "BSD-3-Clause",
      "name": "BSD 3-Clause \"New\" or \"Revised\" License",
      "url": "https://opensource.org/licenses/BSD-3-Clause"
    },
    {
      "id": "LGPL-3.0-only",
      "name": "GNU Lesser General Public License v3.0 only",
      "url": "https://opensource.org/licenses/LGPL-3.0"
    },
    {
      "id": "MIT",
      "name": "MIT License",
      "url": "https://opensource.org/licenses/MIT"
    }
  ],
  "dependencies": [
    {
      "name": "bundler",
      "version": "2.1.4",
      "package_manager": "bundler",
      "path": "Gemfile.lock",
      "licenses": [
        "MIT"
      ]
    },
    {
      "name": "concurrent-ruby",
      "version": "1.0.5",
      "package_manager": "bundler",
      "path": "Gemfile.lock",
      "licenses": [
        "MIT"
      ]
    },
    {
      "name": "connection_pool",
      "version": "2.2.1",
      "package_manager": "bundler",
      "path": "Gemfile.lock",
      "licenses": [
        "MIT"
      ]
    },
    {
      "name": "mini_portile2",
      "version": "2.0.0",
      "package_manager": "bundler",
      "path": "Gemfile.lock",
      "licenses": [
        "MIT"
      ]
    },
    {
      "name": "mustermann",
      "version": "1.0.1",
      "package_manager": "bundler",
      "path": "Gemfile.lock",
      "licenses": [
        "MIT"
      ]
    },
    {
      "name": "nokogiri",
      "version": "1.6.7.2",
      "package_manager": "bundler",
      "path": "Gemfile.lock",
      "licenses": [
        "MIT"
      ]
    },
    {
      "name": "pg",
      "version": "1.0.0",
      "package_manager": "bundler",
      "path": "Gemfile.lock",
      "licenses": [
        "BSD-3-Clause"
      ]
    },
    {
      "name": "puma",
      "version": "3.12.0",
      "package_manager": "bundler",
      "path": "Gemfile.lock",
      "licenses": [
        "BSD-3-Clause"
      ]
    },
    {
      "name": "rack",
      "version": "2.0.4",
      "package_manager": "bundler",
      "path": "Gemfile.lock",
      "licenses": [
        "MIT"
      ]
    },
    {
      "name": "rack-protection",
      "version": "2.0.0",
      "package_manager": "bundler",
      "path": "Gemfile.lock",
      "licenses": [
        "MIT"
      ]
    },
    {
      "name": "redis",
      "version": "3.3.5",
      "package_manager": "bundler",
      "path": "Gemfile.lock",
      "licenses": [
        "MIT"
      ]
    },
    {
      "name": "rubyzip",
      "version": "1.2.0",
      "package_manager": "bundler",
      "path": "Gemfile.lock",
      "licenses": [
        "BSD-2-Clause"
      ]
    },
    {
      "name": "sidekiq",
      "version": "4.2.10",
      "package_manager": "bundler",
      "path": "Gemfile.lock",
      "licenses": [
        "LGPL-3.0-only"
      ]
    },
    {
      "name": "sinatra",
      "version": "2.0.0",
      "package_manager": "bundler",
      "path": "Gemfile.lock",
      "licenses": [
        "MIT"
      ]
    },
    {
      "name": "slim",
      "version": "3.0.9",
      "package_manager": "bundler",
      "path": "Gemfile.lock",
      "licenses": [
        "MIT"
      ]
    },
    {
      "name": "temple",
      "version": "0.8.0",
      "package_manager": "bundler",
      "path": "Gemfile.lock",
      "licenses": [
        "MIT"
      ]
    },
    {
      "name": "tilt",
      "version": "2.0.8",
      "package_manager": "bundler",
      "path": "Gemfile.lock",
      "licenses": [
        "MIT"
      ]
    }
  ]
}