{
  "version": "2.4",
  "vulnerabilities": [
    {
      "id": "266e808a9135923109436bea520d4a81ea81ee4293eb793057fe7d9d47cc49d5",
      "category": "sast",
      "name": "XSS - Reflected Cross Site Scripting",
      "message": "XSS - Reflected Cross Site Scripting",
      "description": "Untrusted User Input in Response will result in Reflected Cross Site Scripting Vulnerability",
      "cve": "XSS - Reflected Cross Site Scripting:  //res.send('requested ' + req.params.sub);",
      "scanner": {
        "id": "nodejs_scan",
        "name": "NodeJsScan"
      },
      "location": {
        "file": "index.js",
        "start_line": 33
      },
      "identifiers": [
        {
          "type": "node_js_scan_id",
          "name": "NodeJsScan ID: 23",
          "value": "23"
        }
      ]
    },
    {
      "id": "073e5b84c232d5c5cad53a0dea040ea4aba7cda52dc46242a2762efdcb9f8843",
      "category": "sast",
      "name": "XSS - Reflected Cross Site Scripting",
      "message": "XSS - Reflected Cross Site Scripting",
      "description": "Untrusted User Input in Response will result in Reflected Cross Site Scripting Vulnerability",
      "cve": "XSS - Reflected Cross Site Scripting:  res.send('requested ' + req.params.sub);",
      "scanner": {
        "id": "nodejs_scan",
        "name": "NodeJsScan"
      },
      "location": {
        "file": "index.js",
        "start_line": 28
      },
      "identifiers": [
        {
          "type": "node_js_scan_id",
          "name": "NodeJsScan ID: 23",
          "value": "23"
        }
      ]
    }
  ],
  "remediations": []
}
