
{
  "version": "3.0.0",
  "vulnerabilities": [
    {
      "id": "ce810bb1e96f6e1a8a96a7916f4b9f0a1083a076bcb84e917fe7208746fef356",
      "category": "sast",
      "name": "Potential Path Traversal (file read)",
      "message": "Potential Path Traversal (file read)",
      "description": "This API (kotlin/io/FilesKt.createTempDir(Ljava/lang/String;Ljava/lang/String;Ljava/io/File;)Ljava/io/File;) reads a file whose location might be specified by user input",
      "cve": "21f1b51e621e21e4d44b2ec8e41677b9:PATH_TRAVERSAL_IN:src/main/kotlin/security/sample/helper/FileHelper.kt:13",
      "severity": "Medium",
      "confidence": "Medium",
      "scanner": {
        "id": "find_sec_bugs",
        "name": "Find Security Bugs"
      },
      "location": {
        "file": "src/main/kotlin/security/sample/helper/FileHelper.kt",
        "start_line": 13,
        "end_line": 13,
        "class": "security.sample.helper.FileHelper",
        "method": "createDirectory"
      },
      "identifiers": [
        {
          "type": "find_sec_bugs_type",
          "name": "Find Security Bugs-PATH_TRAVERSAL_IN",
          "value": "PATH_TRAVERSAL_IN",
          "url": "https://find-sec-bugs.github.io/bugs.htm#PATH_TRAVERSAL_IN"
        },
        {
          "type": "cwe",
          "name": "CWE-22",
          "value": "22",
          "url": "https://cwe.mitre.org/data/definitions/22.html"
        }
      ]
    },
    {
      "id": "78381dfa2fd41f98f4b87433c72cb86515434d1550045f3944162c1d8fc169d6",
      "category": "sast",
      "name": "Hard coded password",
      "message": "Hard coded password",
      "description": "Hard coded password found",
      "cve": "6c76509de3b4b0a615fc55e1385e346c:HARD_CODE_PASSWORD:src/main/kotlin/security/sample/controller/Login.kt:16",
      "severity": "Medium",
      "confidence": "Medium",
      "scanner": {
        "id": "find_sec_bugs",
        "name": "Find Security Bugs"
      },
      "location": {
        "file": "src/main/kotlin/security/sample/controller/Login.kt",
        "start_line": 16,
        "end_line": 16,
        "class": "security.sample.controller.Login",
        "method": "login"
      },
      "identifiers": [
        {
          "type": "find_sec_bugs_type",
          "name": "Find Security Bugs-HARD_CODE_PASSWORD",
          "value": "HARD_CODE_PASSWORD",
          "url": "https://find-sec-bugs.github.io/bugs.htm#HARD_CODE_PASSWORD"
        },
        {
          "type": "cwe",
          "name": "CWE-259",
          "value": "259",
          "url": "https://cwe.mitre.org/data/definitions/259.html"
        }
      ]
    },
    {
      "id": "81e2c1e6edbbe48efed9ef3bf4305b42c6ad5bf1e8c835d5f09e955cfc03e9db",
      "category": "sast",
      "name": "Potential Command Injection",
      "message": "Potential Command Injection",
      "description": "This usage of java/lang/Runtime.exec(Ljava/lang/String;)Ljava/lang/Process; can be vulnerable to Command Injection",
      "cve": "8b86ce71294ea88570a3e27407dd8c87:COMMAND_INJECTION:src/main/kotlin/security/sample/helper/SystemHelper.kt:7",
      "severity": "Medium",
      "confidence": "Medium",
      "scanner": {
        "id": "find_sec_bugs",
        "name": "Find Security Bugs"
      },
      "location": {
        "file": "src/main/kotlin/security/sample/helper/SystemHelper.kt",
        "start_line": 7,
        "end_line": 7,
        "class": "security.sample.helper.SystemHelper",
        "method": "executeCommand"
      },
      "identifiers": [
        {
          "type": "find_sec_bugs_type",
          "name": "Find Security Bugs-COMMAND_INJECTION",
          "value": "COMMAND_INJECTION",
          "url": "https://find-sec-bugs.github.io/bugs.htm#COMMAND_INJECTION"
        },
        {
          "type": "cwe",
          "name": "CWE-78",
          "value": "78",
          "url": "https://cwe.mitre.org/data/definitions/78.html"
        }
      ]
    }
  ],
  "remediations": [],
  "scan": {
    "scanner": {
      "id": "find_sec_bugs",
      "name": "Find Security Bugs",
      "url": "https://spotbugs.github.io",
      "vendor": {
        "name": "GitLab"
      },
      "version": "4.2.0"
    },
    "type": "sast",
    "start_time": "2021-04-02T17:50:13",
    "end_time": "2021-04-02T17:50:44",
    "status": "success"
  }
}
