{
	"info": {
		"_postman_id": "cf8347d3-4802-4b90-9fe7-9ffa835966e2",
		"name": "Flask Requests",
		"schema": "https://schema.getpostman.com/json/collection/v2.1.0/collection.json"
	},
	"item": [
		{
			"name": "Get User 1",
			"request": {
				"method": "GET",
				"header": [
					{
						"key": "Authorization",
						"value": "Token {{auth_token}}"
					},
					{
						"key": "Accept",
						"value": "application/json"
					}
				],
				"url": {
					"raw": "http://127.0.0.1:7777/api/users/1",
					"protocol": "http",
					"host": [
						"127",
						"0",
						"0",
						"1"
					],
					"port": "7777",
					"path": [
						"api",
						"users",
						"1"
					]
				}
			},
			"response": []
		},
		{
			"name": "Get Users",
			"request": {
				"method": "GET",
				"header": [
					{
						"key": "Authorization",
						"value": "Token {{auth_token}}"
					},
					{
						"key": "Accept",
						"value": "application/json"
					}
				],
				"url": {
					"raw": "http://127.0.0.1:7777/api/users",
					"protocol": "http",
					"host": [
						"127",
						"0",
						"0",
						"1"
					],
					"port": "7777",
					"path": [
						"api",
						"users"
					]
				}
			},
			"response": []
		},
		{
			"name": "Get Users by Name",
			"request": {
				"method": "GET",
				"header": [
					{
						"key": "Authorization",
						"value": "Token {{auth_token}}"
					},
					{
						"key": "Accept",
						"value": "application/json"
					}
				],
				"url": {
					"raw": "http://127.0.0.1:7777/api/users?user=dd",
					"protocol": "http",
					"host": [
						"127",
						"0",
						"0",
						"1"
					],
					"port": "7777",
					"path": [
						"api",
						"users"
					],
					"query": [
						{
							"key": "user",
							"value": "dd"
						}
					]
				}
			},
			"response": []
		},
		{
			"name": "Create User",
			"request": {
				"method": "POST",
				"header": [
					{
						"key": "Authorization",
						"value": "Token {{auth_token}}"
					},
					{
						"key": "Accept",
						"value": "application/json"
					},
					{
						"key": "Content-Type",
						"value": "application/json"
					}
				],
				"body": {
					"mode": "raw",
					"raw": "{\"user\":\"dd\", \"first\":\"mike\", \"last\":\"smith\", \"password\":\"{{user_password}}\"}\n"
				},
				"url": {
					"raw": "http://127.0.0.1:7777/api/users",
					"protocol": "http",
					"host": [
						"127",
						"0",
						"0",
						"1"
					],
					"port": "7777",
					"path": [
						"api",
						"users"
					]
				}
			},
			"response": []
		},
		{
			"name": "Update User",
			"request": {
				"method": "PUT",
				"header": [
					{
						"key": "Authorization",
						"value": "Token {{auth_token}}"
					},
					{
						"key": "Accept",
						"value": "application/json"
					},
					{
						"key": "Content-Type",
						"value": "application/json"
					}
				],
				"body": {
					"mode": "raw",
					"raw": "{\"user\":\"admin\", \"first\":\"john\", \"last\":\"smith\", \"password\":\"{{user_password}}\"}\n"
				},
				"url": {
					"raw": "http://127.0.0.1:7777/api/users/1",
					"protocol": "http",
					"host": [
						"127",
						"0",
						"0",
						"1"
					],
					"port": "7777",
					"path": [
						"api",
						"users",
						"1"
					]
				}
			},
			"response": []
		},
		{
			"name": "Delete User 2",
			"request": {
				"method": "DELETE",
				"header": [
					{
						"key": "Authorization",
						"value": "Token {{auth_token}}"
					},
					{
						"key": "Accept",
						"value": "application/json"
					}
				],
				"body": {
					"mode": "raw",
					"raw": ""
				},
				"url": {
					"raw": "http://127.0.0.1:7777/api/users/2",
					"protocol": "http",
					"host": [
						"127",
						"0",
						"0",
						"1"
					],
					"port": "7777",
					"path": [
						"api",
						"users",
						"2"
					]
				}
			},
			"response": []
		}
	],
	"variable": [
		{
			"key": "auth_token",
			"value": ""
		},
		{
			"key": "user_password",
			"value": ""
		}
	]
}