{
  "swagger": "2.0",
  "info": {
    "version": "1.0",
    "title": "Flask Requests",
    "description": "TODO: Add Description"
  },
  "host": "127.0.0.1:7777",
  "basePath": "/api",
  "schemes": [
    "http"
  ],
  "consumes": [
    "application/json"
  ],
  "produces": [
    "application/json"
  ],
  "paths": {
    "/users": {
      "post": {
        "description": "TODO: Add Description",
        "summary": "Create User",
        "tags": [
          "Misc"
        ],
        "operationId": "UsersPost",
        "produces": [
          "application/json"
        ],
        "parameters": [
          {
            "name": "Accept",
            "in": "header",
            "required": true,
            "type": "string",
            "description": ""
          },
          {
            "name": "Content-Type",
            "in": "header",
            "required": true,
            "type": "string",
            "description": ""
          },
          {
            "name": "Body",
            "in": "body",
            "required": true,
            "description": "",
            "schema": {
              "$ref": "#/definitions/CreateUserrequest"
            }
          }
        ],
        "responses": {
          "200": {
            "description": ""
          }
        },
        "x-unitTests": [
          {
            "request": {
              "method": "POST",
              "uri": "/users",
              "headers": {
                "Accept": "application/json",
                "Content-Type": "application/json"
              },
              "body": "{\"user\":\"dd\",\"first\":\"mike\",\"last\":\"smith\",\"password\":\"hello\"}"
            },
            "expectedResponse": {
              "x-allowExtraHeaders": true,
              "x-bodyMatchMode": "NONE",
              "x-arrayOrderedMatching": false,
              "x-arrayCheckCount": false,
              "x-matchResponseSchema": true,
              "headers": {}
            },
            "x-testShouldPass": true,
            "x-testEnabled": true,
            "x-testName": "Create User",
            "x-testDescription": "TODO: Add Description"
          }
        ],
        "x-operation-settings": {
          "CollectParameters": false,
          "AllowDynamicQueryParameters": false,
          "AllowDynamicFormParameters": false,
          "IsMultiContentStreaming": false
        }
      }
    }
  },
  "definitions": {
    "CreateUserrequest": {
      "title": "Create UserRequest",
      "example": {
        "user": "dd",
        "first": "mike",
        "last": "smith",
        "password": "hello"
      },
      "type": "object",
      "properties": {
        "user": {
          "description": "",
          "example": "dd",
          "type": "string"
        },
        "first": {
          "description": "",
          "example": "mike",
          "type": "string"
        },
        "last": {
          "description": "",
          "example": "smith",
          "type": "string"
        },
        "password": {
          "description": "",
          "example": "hello",
          "type": "string"
        }
      },
      "required": [
        "user",
        "first",
        "last",
        "password"
      ]
    },
    "UpdateUserrequest": {
      "title": "Update UserRequest",
      "example": {
        "user": "admin",
        "first": "john",
        "last": "smith",
        "password": "hello"
      },
      "type": "object",
      "properties": {
        "user": {
          "description": "",
          "example": "admin",
          "type": "string"
        },
        "first": {
          "description": "",
          "example": "john",
          "type": "string"
        },
        "last": {
          "description": "",
          "example": "smith",
          "type": "string"
        },
        "password": {
          "description": "",
          "example": "hello",
          "type": "string"
        }
      },
      "required": [
        "user",
        "first",
        "last",
        "password"
      ]
    }
  }
}