{
  "log": {
    "version": "1.2",
    "creator": {
      "name": "WebInspector",
      "version": "537.36"
    },
    "pages": [
      {
        "startedDateTime": "2017-10-26T10:15:29.289Z",
        "id": "page_2",
        "title": "http://127.0.0.1:7777/",
        "pageTimings": {
          "onContentLoad": 99.09399994648993,
          "onLoad": 95.20400001201779
        }
      },
      {
        "startedDateTime": "2017-10-26T10:03:31.423Z",
        "id": "page_1",
        "title": "http://127.0.0.1:7777/api/users?user=dd",
        "pageTimings": {
          "onContentLoad": 108.098000055179,
          "onLoad": 101.1620000936091
        }
      }
    ],
    "entries": [
      {
        "startedDateTime": "2017-10-26T10:03:31.431Z",
        "time": 3.575000006705523,
        "request": {
          "method": "GET",
          "url": "http://127.0.0.1:7777/api/users?user=dd",
          "httpVersion": "HTTP/1.1",
          "headers": [
            {
              "name": "Authorization",
              "value": "Token b5638ae7-6e77-4585-b035-7d9de2e3f6b3"
            },
            {
              "name": "Accept-Encoding",
              "value": "gzip, deflate, br"
            },
            {
              "name": "Host",
              "value": "127.0.0.1:7777"
            },
            {
              "name": "Accept-Language",
              "value": "en-US,en;q=0.8"
            },
            {
              "name": "Upgrade-Insecure-Requests",
              "value": "1"
            },
            {
              "name": "User-Agent",
              "value": "Mozilla/5.0 (Windows NT 10.0; Win64; x64) AppleWebKit/537.36 (KHTML, like Gecko) Chrome/61.0.3163.100 Safari/537.36"
            },
            {
              "name": "Accept",
              "value": "text/html,application/xhtml+xml,application/xml;q=0.9,image/webp,image/apng,*/*;q=0.8"
            },
            {
              "name": "Cookie",
              "value": ".AspNetCore.Antiforgery.a6BorKCfoC4=CfDJ8DL4GupRCDNGl_0OiAd3qWP5O9gu_LiedsgcLWhaCgn88Ru8oWwXGQvL3PXNdZ0n5TjUPody5ZI01g6DQyaaphE4U6osQ8UW4ek9hlOQX0XFvIg9G3vGuvPt1XiJkxzxEtoPMlepzIig3KblZd5YsOs"
            },
            {
              "name": "Connection",
              "value": "keep-alive"
            }
          ],
          "queryString": [
            {
              "name": "user",
              "value": "dd"
            }
          ],
          "cookies": [
            {
              "name": ".AspNetCore.Antiforgery.a6BorKCfoC4",
              "value": "CfDJ8DL4GupRCDNGl_0OiAd3qWP5O9gu_LiedsgcLWhaCgn88Ru8oWwXGQvL3PXNdZ0n5TjUPody5ZI01g6DQyaaphE4U6osQ8UW4ek9hlOQX0XFvIg9G3vGuvPt1XiJkxzxEtoPMlepzIig3KblZd5YsOs",
              "expires": null,
              "httpOnly": false,
              "secure": false
            }
          ],
          "headersSize": 605,
          "bodySize": 0
        },
        "response": {
          "status": 200,
          "statusText": "OK",
          "httpVersion": "HTTP/1.1",
          "headers": [
            {
              "name": "Date",
              "value": "Thu, 26 Oct 2017 10:03:31 GMT"
            },
            {
              "name": "Server",
              "value": "TwistedWeb/17.9.0"
            },
            {
              "name": "X-Powered-By",
              "value": "PHP/7.0.11"
            },
            {
              "name": "Content-Length",
              "value": "92"
            },
            {
              "name": "Content-Type",
              "value": "application/json"
            }
          ],
          "cookies": [],
          "content": {
            "size": 92,
            "mimeType": "application/json",
            "compression": 0,
            "text": "[{\"last\": \"Smith\", \"password\": \"Password!\", \"user_id\": 1, \"user\": \"admin\", \"first\": \"Joe\"}]\n"
          },
          "redirectURL": "",
          "headersSize": 161,
          "bodySize": 92,
          "_transferSize": 253
        },
        "cache": {},
        "timings": {
          "blocked": 0.98900001123548,
          "dns": -1,
          "ssl": -1,
          "connect": -1,
          "send": 0.16200006939470013,
          "wait": 4.423999926075343,
          "receive": 0,
          "_blocked_queueing": -1
        },
        "serverIPAddress": "127.0.0.1",
        "connection": "507764",
        "pageref": "page_1"
      },
      {
        "startedDateTime": "2017-10-26T09:49:02.367Z",
        "time": 3.474363005021587,
        "request": {
          "method": "GET",
          "url": "http://127.0.0.1:7777/api/users",
          "httpVersion": "HTTP/1.1",
          "headers": [
            {
              "name": "Authorization",
              "value": "Token b5638ae7-6e77-4585-b035-7d9de2e3f6b3"
            },
            {
              "name": "Accept-Encoding",
              "value": "gzip, deflate, br"
            },
            {
              "name": "Host",
              "value": "127.0.0.1:7777"
            },
            {
              "name": "Accept-Language",
              "value": "en-US,en;q=0.8"
            },
            {
              "name": "User-Agent",
              "value": "Mozilla/5.0 (Windows NT 10.0; Win64; x64) AppleWebKit/537.36 (KHTML, like Gecko) Chrome/61.0.3163.100 Safari/537.36"
            },
            {
              "name": "Accept",
              "value": "*/*"
            },
            {
              "name": "Referer",
              "value": "http://127.0.0.1:7777/"
            },
            {
              "name": "Cookie",
              "value": ".AspNetCore.Antiforgery.a6BorKCfoC4=CfDJ8DL4GupRCDNGl_0OiAd3qWP5O9gu_LiedsgcLWhaCgn88Ru8oWwXGQvL3PXNdZ0n5TjUPody5ZI01g6DQyaaphE4U6osQ8UW4ek9hlOQX0XFvIg9G3vGuvPt1XiJkxzxEtoPMlepzIig3KblZd5YsOs"
            },
            {
              "name": "Connection",
              "value": "keep-alive"
            }
          ],
          "queryString": [],
          "cookies": [
            {
              "name": ".AspNetCore.Antiforgery.a6BorKCfoC4",
              "value": "CfDJ8DL4GupRCDNGl_0OiAd3qWP5O9gu_LiedsgcLWhaCgn88Ru8oWwXGQvL3PXNdZ0n5TjUPody5ZI01g6DQyaaphE4U6osQ8UW4ek9hlOQX0XFvIg9G3vGuvPt1XiJkxzxEtoPMlepzIig3KblZd5YsOs",
              "expires": null,
              "httpOnly": false,
              "secure": false
            }
          ],
          "headersSize": 577,
          "bodySize": 0
        },
        "response": {
          "status": 200,
          "statusText": "OK",
          "httpVersion": "HTTP/1.1",
          "headers": [
            {
              "name": "Date",
              "value": "Thu, 26 Oct 2017 09:49:02 GMT"
            },
            {
              "name": "Server",
              "value": "TwistedWeb/17.9.0"
            },
            {
              "name": "X-Powered-By",
              "value": "PHP/7.0.11"
            },
            {
              "name": "Content-Length",
              "value": "92"
            },
            {
              "name": "Content-Type",
              "value": "application/json"
            }
          ],
          "cookies": [],
          "content": {
            "size": 92,
            "mimeType": "application/json",
            "compression": 0,
            "text": "[{\"last\": \"Smith\", \"password\": \"Password!\", \"user_id\": 1, \"user\": \"admin\", \"first\": \"Joe\"}]\n"
          },
          "redirectURL": "",
          "headersSize": 161,
          "bodySize": 92,
          "_transferSize": 253
        },
        "cache": {},
        "timings": {
          "blocked": 1.5083629575092334,
          "dns": -1,
          "ssl": -1,
          "connect": -1,
          "send": 0.10800000745802985,
          "wait": 2.982000005431476,
          "receive": 0.876000034622848,
          "_blocked_queueing": 0.3629999700933695
        },
        "serverIPAddress": "",
        "connection": "488864"
      },
      {
        "startedDateTime": "2017-10-26T09:49:19.014Z",
        "time": 19.465558998053893,
        "request": {
          "method": "POST",
          "url": "http://127.0.0.1:7777/api/users",
          "httpVersion": "HTTP/1.1",
          "headers": [
            {
              "name": "Authorization",
              "value": "Token b5638ae7-6e77-4585-b035-7d9de2e3f6b3"
            },
            {
              "name": "Origin",
              "value": "http://127.0.0.1:7777"
            },
            {
              "name": "Accept-Encoding",
              "value": "gzip, deflate, br"
            },
            {
              "name": "Host",
              "value": "127.0.0.1:7777"
            },
            {
              "name": "Accept-Language",
              "value": "en-US,en;q=0.8"
            },
            {
              "name": "User-Agent",
              "value": "Mozilla/5.0 (Windows NT 10.0; Win64; x64) AppleWebKit/537.36 (KHTML, like Gecko) Chrome/61.0.3163.100 Safari/537.36"
            },
            {
              "name": "Content-Type",
              "value": "application/json; charset=UTF-8"
            },
            {
              "name": "Accept",
              "value": "*/*"
            },
            {
              "name": "Referer",
              "value": "http://127.0.0.1:7777/"
            },
            {
              "name": "Cookie",
              "value": ".AspNetCore.Antiforgery.a6BorKCfoC4=CfDJ8DL4GupRCDNGl_0OiAd3qWP5O9gu_LiedsgcLWhaCgn88Ru8oWwXGQvL3PXNdZ0n5TjUPody5ZI01g6DQyaaphE4U6osQ8UW4ek9hlOQX0XFvIg9G3vGuvPt1XiJkxzxEtoPMlepzIig3KblZd5YsOs"
            },
            {
              "name": "Connection",
              "value": "keep-alive"
            },
            {
              "name": "Content-Length",
              "value": "62"
            }
          ],
          "queryString": [],
          "cookies": [
            {
              "name": ".AspNetCore.Antiforgery.a6BorKCfoC4",
              "value": "CfDJ8DL4GupRCDNGl_0OiAd3qWP5O9gu_LiedsgcLWhaCgn88Ru8oWwXGQvL3PXNdZ0n5TjUPody5ZI01g6DQyaaphE4U6osQ8UW4ek9hlOQX0XFvIg9G3vGuvPt1XiJkxzxEtoPMlepzIig3KblZd5YsOs",
              "expires": null,
              "httpOnly": false,
              "secure": false
            }
          ],
          "headersSize": 676,
          "bodySize": 62,
          "postData": {
            "mimeType": "application/json; charset=UTF-8",
            "text": "{\"user\":\"dd\",\"first\":\"mike\",\"last\":\"smith\",\"password\":\"hello\"}"
          }
        },
        "response": {
          "status": 201,
          "statusText": "CREATED",
          "httpVersion": "HTTP/1.1",
          "headers": [
            {
              "name": "Date",
              "value": "Thu, 26 Oct 2017 09:49:19 GMT"
            },
            {
              "name": "Server",
              "value": "TwistedWeb/17.9.0"
            },
            {
              "name": "X-Powered-By",
              "value": "PHP/7.0.11"
            },
            {
              "name": "Content-Length",
              "value": "15"
            },
            {
              "name": "Content-Type",
              "value": "application/json"
            }
          ],
          "cookies": [],
          "content": {
            "size": 15,
            "mimeType": "application/json",
            "compression": 0,
            "text": "{\"user_id\": 2}\n"
          },
          "redirectURL": "",
          "headersSize": 166,
          "bodySize": 15,
          "_transferSize": 181
        },
        "cache": {},
        "timings": {
          "blocked": 1.1815590288024402,
          "dns": -1,
          "ssl": -1,
          "connect": -1,
          "send": 0.13099994976072993,
          "wait": 18.420999986119572,
          "receive": 1.7320000333711505,
          "_blocked_queueing": 0.5590000655502081
        },
        "serverIPAddress": "",
        "connection": "488864"
      },
      {
        "startedDateTime": "2017-10-26T09:49:19.037Z",
        "time": 2.625272059580311,
        "request": {
          "method": "GET",
          "url": "http://127.0.0.1:7777/api/users/2",
          "httpVersion": "HTTP/1.1",
          "headers": [
            {
              "name": "Authorization",
              "value": "Token b5638ae7-6e77-4585-b035-7d9de2e3f6b3"
            },
            {
              "name": "Accept-Encoding",
              "value": "gzip, deflate, br"
            },
            {
              "name": "Host",
              "value": "127.0.0.1:7777"
            },
            {
              "name": "Accept-Language",
              "value": "en-US,en;q=0.8"
            },
            {
              "name": "User-Agent",
              "value": "Mozilla/5.0 (Windows NT 10.0; Win64; x64) AppleWebKit/537.36 (KHTML, like Gecko) Chrome/61.0.3163.100 Safari/537.36"
            },
            {
              "name": "Accept",
              "value": "*/*"
            },
            {
              "name": "Referer",
              "value": "http://127.0.0.1:7777/"
            },
            {
              "name": "Cookie",
              "value": ".AspNetCore.Antiforgery.a6BorKCfoC4=CfDJ8DL4GupRCDNGl_0OiAd3qWP5O9gu_LiedsgcLWhaCgn88Ru8oWwXGQvL3PXNdZ0n5TjUPody5ZI01g6DQyaaphE4U6osQ8UW4ek9hlOQX0XFvIg9G3vGuvPt1XiJkxzxEtoPMlepzIig3KblZd5YsOs"
            },
            {
              "name": "Connection",
              "value": "keep-alive"
            }
          ],
          "queryString": [],
          "cookies": [
            {
              "name": ".AspNetCore.Antiforgery.a6BorKCfoC4",
              "value": "CfDJ8DL4GupRCDNGl_0OiAd3qWP5O9gu_LiedsgcLWhaCgn88Ru8oWwXGQvL3PXNdZ0n5TjUPody5ZI01g6DQyaaphE4U6osQ8UW4ek9hlOQX0XFvIg9G3vGuvPt1XiJkxzxEtoPMlepzIig3KblZd5YsOs",
              "expires": null,
              "httpOnly": false,
              "secure": false
            }
          ],
          "headersSize": 579,
          "bodySize": 0
        },
        "response": {
          "status": 200,
          "statusText": "OK",
          "httpVersion": "HTTP/1.1",
          "headers": [
            {
              "name": "Date",
              "value": "Thu, 26 Oct 2017 09:49:19 GMT"
            },
            {
              "name": "Server",
              "value": "TwistedWeb/17.9.0"
            },
            {
              "name": "X-Powered-By",
              "value": "PHP/7.0.11"
            },
            {
              "name": "Content-Length",
              "value": "108"
            },
            {
              "name": "Content-Type",
              "value": "application/json"
            }
          ],
          "cookies": [],
          "content": {
            "size": 108,
            "mimeType": "application/json",
            "compression": 0,
            "text": "{\"last\": \"smith\", \"html\": \"<b>smith</b>\", \"user\": \"dd\", \"user_id\": 2, \"password\": \"hello\", \"first\": \"mike\"}\n"
          },
          "redirectURL": "",
          "headersSize": 162,
          "bodySize": 108,
          "_transferSize": 270
        },
        "cache": {},
        "timings": {
          "blocked": 1.2162720623891765,
          "dns": -1,
          "ssl": -1,
          "connect": -1,
          "send": 0.07800001185387995,
          "wait": 2.509000012651083,
          "receive": 0.8219999726861715,
          "_blocked_queueing": 0.27199997566640377
        },
        "serverIPAddress": "",
        "connection": "488864"
      },
      {
        "startedDateTime": "2017-10-26T09:49:19.042Z",
        "time": 23.570388056221418,
        "request": {
          "method": "DELETE",
          "url": "http://127.0.0.1:7777/api/users/2",
          "httpVersion": "HTTP/1.1",
          "headers": [
            {
              "name": "Authorization",
              "value": "Token b5638ae7-6e77-4585-b035-7d9de2e3f6b3"
            },
            {
              "name": "Origin",
              "value": "http://127.0.0.1:7777"
            },
            {
              "name": "Accept-Encoding",
              "value": "gzip, deflate, br"
            },
            {
              "name": "Host",
              "value": "127.0.0.1:7777"
            },
            {
              "name": "Accept-Language",
              "value": "en-US,en;q=0.8"
            },
            {
              "name": "User-Agent",
              "value": "Mozilla/5.0 (Windows NT 10.0; Win64; x64) AppleWebKit/537.36 (KHTML, like Gecko) Chrome/61.0.3163.100 Safari/537.36"
            },
            {
              "name": "Accept",
              "value": "*/*"
            },
            {
              "name": "Referer",
              "value": "http://127.0.0.1:7777/"
            },
            {
              "name": "Cookie",
              "value": ".AspNetCore.Antiforgery.a6BorKCfoC4=CfDJ8DL4GupRCDNGl_0OiAd3qWP5O9gu_LiedsgcLWhaCgn88Ru8oWwXGQvL3PXNdZ0n5TjUPody5ZI01g6DQyaaphE4U6osQ8UW4ek9hlOQX0XFvIg9G3vGuvPt1XiJkxzxEtoPMlepzIig3KblZd5YsOs"
            },
            {
              "name": "Connection",
              "value": "keep-alive"
            }
          ],
          "queryString": [],
          "cookies": [
            {
              "name": ".AspNetCore.Antiforgery.a6BorKCfoC4",
              "value": "CfDJ8DL4GupRCDNGl_0OiAd3qWP5O9gu_LiedsgcLWhaCgn88Ru8oWwXGQvL3PXNdZ0n5TjUPody5ZI01g6DQyaaphE4U6osQ8UW4ek9hlOQX0XFvIg9G3vGuvPt1XiJkxzxEtoPMlepzIig3KblZd5YsOs",
              "expires": null,
              "httpOnly": false,
              "secure": false
            }
          ],
          "headersSize": 613,
          "bodySize": 0
        },
        "response": {
          "status": 204,
          "statusText": "NO CONTENT",
          "httpVersion": "HTTP/1.1",
          "headers": [
            {
              "name": "Date",
              "value": "Thu, 26 Oct 2017 09:49:19 GMT"
            },
            {
              "name": "Server",
              "value": "TwistedWeb/17.9.0"
            },
            {
              "name": "X-Powered-By",
              "value": "PHP/7.0.11"
            },
            {
              "name": "Content-Length",
              "value": "0"
            },
            {
              "name": "Content-Type",
              "value": "application/json"
            }
          ],
          "cookies": [],
          "content": {
            "size": 0,
            "mimeType": "application/json",
            "compression": 0,
            "text": ""
          },
          "redirectURL": "",
          "headersSize": 168,
          "bodySize": 0,
          "_transferSize": 168
        },
        "cache": {},
        "timings": {
          "blocked": 1.4183879707707103,
          "dns": -1,
          "ssl": -1,
          "connect": -1,
          "send": 0.08499994874000016,
          "wait": 22.999000037088994,
          "receive": 1.0680000996217132,
          "_blocked_queueing": 0.3880000440403819
        },
        "serverIPAddress": "",
        "connection": "488864"
      },
      {
        "startedDateTime": "2017-10-26T09:49:20.553Z",
        "time": 18.776425990392454,
        "request": {
          "method": "POST",
          "url": "http://127.0.0.1:7777/api/users",
          "httpVersion": "HTTP/1.1",
          "headers": [
            {
              "name": "Authorization",
              "value": "Token b5638ae7-6e77-4585-b035-7d9de2e3f6b3"
            },
            {
              "name": "Origin",
              "value": "http://127.0.0.1:7777"
            },
            {
              "name": "Accept-Encoding",
              "value": "gzip, deflate, br"
            },
            {
              "name": "Host",
              "value": "127.0.0.1:7777"
            },
            {
              "name": "Accept-Language",
              "value": "en-US,en;q=0.8"
            },
            {
              "name": "User-Agent",
              "value": "Mozilla/5.0 (Windows NT 10.0; Win64; x64) AppleWebKit/537.36 (KHTML, like Gecko) Chrome/61.0.3163.100 Safari/537.36"
            },
            {
              "name": "Content-Type",
              "value": "application/json; charset=UTF-8"
            },
            {
              "name": "Accept",
              "value": "*/*"
            },
            {
              "name": "Referer",
              "value": "http://127.0.0.1:7777/"
            },
            {
              "name": "Cookie",
              "value": ".AspNetCore.Antiforgery.a6BorKCfoC4=CfDJ8DL4GupRCDNGl_0OiAd3qWP5O9gu_LiedsgcLWhaCgn88Ru8oWwXGQvL3PXNdZ0n5TjUPody5ZI01g6DQyaaphE4U6osQ8UW4ek9hlOQX0XFvIg9G3vGuvPt1XiJkxzxEtoPMlepzIig3KblZd5YsOs"
            },
            {
              "name": "Connection",
              "value": "keep-alive"
            },
            {
              "name": "Content-Length",
              "value": "62"
            }
          ],
          "queryString": [],
          "cookies": [
            {
              "name": ".AspNetCore.Antiforgery.a6BorKCfoC4",
              "value": "CfDJ8DL4GupRCDNGl_0OiAd3qWP5O9gu_LiedsgcLWhaCgn88Ru8oWwXGQvL3PXNdZ0n5TjUPody5ZI01g6DQyaaphE4U6osQ8UW4ek9hlOQX0XFvIg9G3vGuvPt1XiJkxzxEtoPMlepzIig3KblZd5YsOs",
              "expires": null,
              "httpOnly": false,
              "secure": false
            }
          ],
          "headersSize": 676,
          "bodySize": 62,
          "postData": {
            "mimeType": "application/json; charset=UTF-8",
            "text": "{\"user\":\"dd\",\"first\":\"mike\",\"last\":\"smith\",\"password\":\"hello\"}"
          }
        },
        "response": {
          "status": 201,
          "statusText": "CREATED",
          "httpVersion": "HTTP/1.1",
          "headers": [
            {
              "name": "Date",
              "value": "Thu, 26 Oct 2017 09:49:20 GMT"
            },
            {
              "name": "Server",
              "value": "TwistedWeb/17.9.0"
            },
            {
              "name": "X-Powered-By",
              "value": "PHP/7.0.11"
            },
            {
              "name": "Content-Length",
              "value": "15"
            },
            {
              "name": "Content-Type",
              "value": "application/json"
            }
          ],
          "cookies": [],
          "content": {
            "size": 15,
            "mimeType": "application/json",
            "compression": 0,
            "text": "{\"user_id\": 2}\n"
          },
          "redirectURL": "",
          "headersSize": 166,
          "bodySize": 15,
          "_transferSize": 181
        },
        "cache": {},
        "timings": {
          "blocked": 0.9874259486095985,
          "dns": -1,
          "ssl": -1,
          "connect": -1,
          "send": 0.14899997040629198,
          "wait": 18.537000054493546,
          "receive": 1.1030000168830156,
          "_blocked_queueing": 0.4260001005604863
        },
        "serverIPAddress": "",
        "connection": "488864"
      },
      {
        "startedDateTime": "2017-10-26T09:49:20.576Z",
        "time": 17.544428038876504,
        "request": {
          "method": "PUT",
          "url": "http://127.0.0.1:7777/api/users/2",
          "httpVersion": "HTTP/1.1",
          "headers": [
            {
              "name": "Authorization",
              "value": "Token b5638ae7-6e77-4585-b035-7d9de2e3f6b3"
            },
            {
              "name": "Origin",
              "value": "http://127.0.0.1:7777"
            },
            {
              "name": "Accept-Encoding",
              "value": "gzip, deflate, br"
            },
            {
              "name": "Host",
              "value": "127.0.0.1:7777"
            },
            {
              "name": "Accept-Language",
              "value": "en-US,en;q=0.8"
            },
            {
              "name": "User-Agent",
              "value": "Mozilla/5.0 (Windows NT 10.0; Win64; x64) AppleWebKit/537.36 (KHTML, like Gecko) Chrome/61.0.3163.100 Safari/537.36"
            },
            {
              "name": "Content-Type",
              "value": "application/json; charset=UTF-8"
            },
            {
              "name": "Accept",
              "value": "*/*"
            },
            {
              "name": "Referer",
              "value": "http://127.0.0.1:7777/"
            },
            {
              "name": "Cookie",
              "value": ".AspNetCore.Antiforgery.a6BorKCfoC4=CfDJ8DL4GupRCDNGl_0OiAd3qWP5O9gu_LiedsgcLWhaCgn88Ru8oWwXGQvL3PXNdZ0n5TjUPody5ZI01g6DQyaaphE4U6osQ8UW4ek9hlOQX0XFvIg9G3vGuvPt1XiJkxzxEtoPMlepzIig3KblZd5YsOs"
            },
            {
              "name": "Connection",
              "value": "keep-alive"
            },
            {
              "name": "Content-Length",
              "value": "62"
            }
          ],
          "queryString": [],
          "cookies": [
            {
              "name": ".AspNetCore.Antiforgery.a6BorKCfoC4",
              "value": "CfDJ8DL4GupRCDNGl_0OiAd3qWP5O9gu_LiedsgcLWhaCgn88Ru8oWwXGQvL3PXNdZ0n5TjUPody5ZI01g6DQyaaphE4U6osQ8UW4ek9hlOQX0XFvIg9G3vGuvPt1XiJkxzxEtoPMlepzIig3KblZd5YsOs",
              "expires": null,
              "httpOnly": false,
              "secure": false
            }
          ],
          "headersSize": 677,
          "bodySize": 62,
          "postData": {
            "mimeType": "application/json; charset=UTF-8",
            "text": "{\"user\":\"dd\",\"first\":\"john\",\"last\":\"smith\",\"password\":\"hello\"}"
          }
        },
        "response": {
          "status": 204,
          "statusText": "NO CONTENT",
          "httpVersion": "HTTP/1.1",
          "headers": [
            {
              "name": "Date",
              "value": "Thu, 26 Oct 2017 09:49:20 GMT"
            },
            {
              "name": "Server",
              "value": "TwistedWeb/17.9.0"
            },
            {
              "name": "X-Powered-By",
              "value": "PHP/7.0.11"
            },
            {
              "name": "Content-Length",
              "value": "0"
            },
            {
              "name": "Content-Type",
              "value": "application/json"
            }
          ],
          "cookies": [],
          "content": {
            "size": 0,
            "mimeType": "application/json",
            "compression": 0,
            "text": ""
          },
          "redirectURL": "",
          "headersSize": 168,
          "bodySize": 0,
          "_transferSize": 168
        },
        "cache": {},
        "timings": {
          "blocked": 1.1384279341436943,
          "dns": -1,
          "ssl": -1,
          "connect": -1,
          "send": 0.1320000737905498,
          "wait": 17.1390000032261,
          "receive": 1.1350000277161598,
          "_blocked_queueing": 0.42799999937415123
        },
        "serverIPAddress": "",
        "connection": "488864"
      },
      {
        "startedDateTime": "2017-10-26T09:49:20.602Z",
        "time": 17.208289041533135,
        "request": {
          "method": "DELETE",
          "url": "http://127.0.0.1:7777/api/users/2",
          "httpVersion": "HTTP/1.1",
          "headers": [
            {
              "name": "Authorization",
              "value": "Token b5638ae7-6e77-4585-b035-7d9de2e3f6b3"
            },
            {
              "name": "Origin",
              "value": "http://127.0.0.1:7777"
            },
            {
              "name": "Accept-Encoding",
              "value": "gzip, deflate, br"
            },
            {
              "name": "Host",
              "value": "127.0.0.1:7777"
            },
            {
              "name": "Accept-Language",
              "value": "en-US,en;q=0.8"
            },
            {
              "name": "User-Agent",
              "value": "Mozilla/5.0 (Windows NT 10.0; Win64; x64) AppleWebKit/537.36 (KHTML, like Gecko) Chrome/61.0.3163.100 Safari/537.36"
            },
            {
              "name": "Accept",
              "value": "*/*"
            },
            {
              "name": "Referer",
              "value": "http://127.0.0.1:7777/"
            },
            {
              "name": "Cookie",
              "value": ".AspNetCore.Antiforgery.a6BorKCfoC4=CfDJ8DL4GupRCDNGl_0OiAd3qWP5O9gu_LiedsgcLWhaCgn88Ru8oWwXGQvL3PXNdZ0n5TjUPody5ZI01g6DQyaaphE4U6osQ8UW4ek9hlOQX0XFvIg9G3vGuvPt1XiJkxzxEtoPMlepzIig3KblZd5YsOs"
            },
            {
              "name": "Connection",
              "value": "keep-alive"
            }
          ],
          "queryString": [],
          "cookies": [
            {
              "name": ".AspNetCore.Antiforgery.a6BorKCfoC4",
              "value": "CfDJ8DL4GupRCDNGl_0OiAd3qWP5O9gu_LiedsgcLWhaCgn88Ru8oWwXGQvL3PXNdZ0n5TjUPody5ZI01g6DQyaaphE4U6osQ8UW4ek9hlOQX0XFvIg9G3vGuvPt1XiJkxzxEtoPMlepzIig3KblZd5YsOs",
              "expires": null,
              "httpOnly": false,
              "secure": false
            }
          ],
          "headersSize": 613,
          "bodySize": 0
        },
        "response": {
          "status": 204,
          "statusText": "NO CONTENT",
          "httpVersion": "HTTP/1.1",
          "headers": [
            {
              "name": "Date",
              "value": "Thu, 26 Oct 2017 09:49:20 GMT"
            },
            {
              "name": "Server",
              "value": "TwistedWeb/17.9.0"
            },
            {
              "name": "X-Powered-By",
              "value": "PHP/7.0.11"
            },
            {
              "name": "Content-Length",
              "value": "0"
            },
            {
              "name": "Content-Type",
              "value": "application/json"
            }
          ],
          "cookies": [],
          "content": {
            "size": 0,
            "mimeType": "application/json",
            "compression": 0,
            "text": ""
          },
          "redirectURL": "",
          "headersSize": 168,
          "bodySize": 0,
          "_transferSize": 168
        },
        "cache": {},
        "timings": {
          "blocked": 1.2502889720490176,
          "dns": -1,
          "ssl": -1,
          "connect": -1,
          "send": 0.08400005754083995,
          "wait": 17.01099995989352,
          "receive": 0.863000052049756,
          "_blocked_queueing": 0.28899998869746923
        },
        "serverIPAddress": "",
        "connection": "488864"
      },
      {
        "startedDateTime": "2017-10-26T10:15:30.743Z",
        "time": 4.485380019876175,
        "request": {
          "method": "DELETE",
          "url": "http://127.0.0.1:7777/api/users?user=dd",
          "httpVersion": "HTTP/1.1",
          "headers": [
            {
              "name": "Authorization",
              "value": "Token b5638ae7-6e77-4585-b035-7d9de2e3f6b3"
            },
            {
              "name": "Origin",
              "value": "http://127.0.0.1:7777"
            },
            {
              "name": "Accept-Encoding",
              "value": "gzip, deflate, br"
            },
            {
              "name": "Host",
              "value": "127.0.0.1:7777"
            },
            {
              "name": "Accept-Language",
              "value": "en-US,en;q=0.8"
            },
            {
              "name": "User-Agent",
              "value": "Mozilla/5.0 (Windows NT 10.0; Win64; x64) AppleWebKit/537.36 (KHTML, like Gecko) Chrome/61.0.3163.100 Safari/537.36"
            },
            {
              "name": "Accept",
              "value": "*/*"
            },
            {
              "name": "Referer",
              "value": "http://127.0.0.1:7777/"
            },
            {
              "name": "Cookie",
              "value": ".AspNetCore.Antiforgery.a6BorKCfoC4=CfDJ8DL4GupRCDNGl_0OiAd3qWP5O9gu_LiedsgcLWhaCgn88Ru8oWwXGQvL3PXNdZ0n5TjUPody5ZI01g6DQyaaphE4U6osQ8UW4ek9hlOQX0XFvIg9G3vGuvPt1XiJkxzxEtoPMlepzIig3KblZd5YsOs"
            },
            {
              "name": "Connection",
              "value": "keep-alive"
            }
          ],
          "queryString": [
            {
              "name": "user",
              "value": "dd"
            }
          ],
          "cookies": [
            {
              "name": ".AspNetCore.Antiforgery.a6BorKCfoC4",
              "value": "CfDJ8DL4GupRCDNGl_0OiAd3qWP5O9gu_LiedsgcLWhaCgn88Ru8oWwXGQvL3PXNdZ0n5TjUPody5ZI01g6DQyaaphE4U6osQ8UW4ek9hlOQX0XFvIg9G3vGuvPt1XiJkxzxEtoPMlepzIig3KblZd5YsOs",
              "expires": null,
              "httpOnly": false,
              "secure": false
            }
          ],
          "headersSize": 619,
          "bodySize": 0
        },
        "response": {
          "status": 404,
          "statusText": "NOT FOUND",
          "httpVersion": "HTTP/1.1",
          "headers": [
            {
              "name": "Date",
              "value": "Thu, 26 Oct 2017 10:15:30 GMT"
            },
            {
              "name": "Server",
              "value": "TwistedWeb/17.9.0"
            },
            {
              "name": "X-Powered-By",
              "value": "PHP/7.0.11"
            },
            {
              "name": "Content-Length",
              "value": "130"
            },
            {
              "name": "Content-Type",
              "value": "application/json"
            }
          ],
          "cookies": [],
          "content": {
            "size": 130,
            "mimeType": "application/json",
            "compression": 0,
            "text": "{\"message\": \"User not found. You have requested this URI [/api/users] but did you mean /api/users or /api/users/<int:user_id> ?\"}\n"
          },
          "redirectURL": "",
          "headersSize": 169,
          "bodySize": 130,
          "_transferSize": 299
        },
        "cache": {},
        "timings": {
          "blocked": 1.5213800565106845,
          "dns": -1,
          "ssl": -1,
          "connect": -1,
          "send": 0.18400000408290995,
          "wait": 3.5170000046491654,
          "receive": 1.2629999546334147,
          "_blocked_queueing": 0.37999998312443495
        },
        "serverIPAddress": "",
        "connection": "525763",
        "pageref": "page_2"
      }
    ]
  }
}
