{
  "log": {
    "version": "1.2",
    "creator": {
      "name": "WebInspector",
      "version": "537.36"
    },
    "pages": [
      {
        "startedDateTime": "2017-10-26T10:15:29.289Z",
        "id": "page_2",
        "title": "http://127.0.0.1:7777/",
        "pageTimings": {
          "onContentLoad": 99.09399994648993,
          "onLoad": 95.20400001201779
        }
      },
      {
        "startedDateTime": "2017-10-26T10:03:31.423Z",
        "id": "page_1",
        "title": "http://127.0.0.1:7777/api/users?user=dd",
        "pageTimings": {
          "onContentLoad": 108.098000055179,
          "onLoad": 101.1620000936091
        }
      }
    ],
    "entries": [
      {
        "startedDateTime": "2017-10-26T10:03:31.431Z",
        "time": 3.575000006705523,
        "request": {
          "method": "GET",
          "url": "http://127.0.0.1:7777/api/large_response_json",
          "httpVersion": "HTTP/1.1",
          "headers": [
            {
              "name": "Host",
              "value": "127.0.0.1:7777"
            }
          ],
          "queryString": [],
          "cookies": [],
          "headersSize": 605,
          "bodySize": 0
        },
        "response": {
          "status": 200,
          "statusText": "OK",
          "httpVersion": "HTTP/1.1",
          "headers": [],
          "cookies": [],
          "content": {
            "size": 92,
            "mimeType": "application/json",
            "compression": 0,
            "text": "[{\"last\": \"Smith\", \"password\": \"Password!\", \"user_id\": 1, \"user\": \"admin\", \"first\": \"Joe\"}]\n"
          },
          "redirectURL": "",
          "headersSize": 161,
          "bodySize": 92,
          "_transferSize": 253
        },
        "cache": {},
        "timings": {
          "blocked": 0.98900001123548,
          "dns": -1,
          "ssl": -1,
          "connect": -1,
          "send": 0.16200006939470013,
          "wait": 4.423999926075343,
          "receive": 0,
          "_blocked_queueing": -1
        },
        "serverIPAddress": "127.0.0.1",
        "connection": "507764",
        "pageref": "page_1"
      }
    ]
  }
}
