{
    "openapi": "3.1.0",
    "info": {
        "title": "Flask Requests",
        "description": "TODO: Add Description",
        "version": "1.0",
        "contact": {}
    },
    "servers": [
        {
            "url": "http://127.0.0.1:7777/api"
        }
    ],
    "paths": {
        "/users": {
            "get": {
                "summary": "",
                "operationId": "get-users",
                "responses": {
                    "200": {
                        "description": "OK"
                    }
                },
                "tags": [
                    "Misc"
                ],
                "description": "get users",
                "requestBody": {
                    "content": {
                        "text/plain": {
                            "schema": {
                                "type": [
                                    "boolean",
                                    "null"
                                ],
                                "properties": {}
                            },
                            "examples": {
                                "example-1": {
                                    "value": true
                                },
                                "example-2": {
                                    "value": null
                                }
                            }
                        },
                        "application/json": {
                            "schema": {
                                "type": [
                                    "number",
                                    "null"
                                ],
                                "properties": {}
                            },
                            "examples": {
                                "example-1": {
                                    "value": 3.14
                                }
                            }
                        }
                    }
                }
            },
            "post": {
                "tags": [
                    "Misc"
                ],
                "summary": "Create User",
                "description": "TODO: Add Description",
                "operationId": "UsersPost",
                "requestBody": {
                    "content": {
                        "application/json": {
                            "schema": {
                                "$ref": "#/components/schemas/CreateUserrequest"
                            },
                            "examples": {
                                "example-1": {
                                    "value": {
                                        "user": "dd-examples-2",
                                        "first": "mike-examples-2",
                                        "last": "smith-examples-2",
                                        "password": "hello-examples-2"
                                    }
                                }
                            }
                        }
                    },
                    "required": true,
                    "description": " "
                },
                "responses": {
                    "200": {
                        "description": "",
                        "content": {}
                    }
                }
            }
        }
    },
    "components": {
        "schemas": {
            "CreateUserrequest": {
                "title": "Create UserRequest",
                "required": [
                    "first",
                    "last",
                    "password",
                    "user"
                ],
                "type": "object",
                "properties": {
                    "user": {
                        "type": "string",
                        "description": "",
                        "example": "dd"
                    },
                    "first": {
                        "type": "string",
                        "description": "",
                        "example": "mike"
                    },
                    "last": {
                        "type": "string",
                        "description": "",
                        "example": "smith"
                    },
                    "password": {
                        "type": "string",
                        "description": "",
                        "example": "hello"
                    }
                },
                "example": {
                    "user": "dd",
                    "first": "mike",
                    "last": "smith",
                    "password": "hello"
                }
            }
        }
    },
    "tags": [
        {
            "name": "Misc"
        }
    ]
}