{
  "cve": {
    "id": "CVE-2022-30949",
    "sourceIdentifier": "jenkinsci-cert@googlegroups.com",
    "published": "2022-05-17T15:15:08.963",
    "lastModified": "2023-12-21T21:54:57.407",
    "vulnStatus": "Analyzed",
    "descriptions": [
      {
        "lang": "en",
        "value": "Jenkins REPO Plugin 1.14.0 and earlier allows attackers able to configure pipelines to check out some SCM repositories stored on the Jenkins controller's file system using local paths as SCM URLs, obtaining limited information about other projects' SCM contents."
      },
      {
        "lang": "es",
        "value": "El plugin REPO de Jenkins versiones 1.14.0 y anteriores permite a atacantes capaces de configurar pipelines para comprobar algunos repositorios SCM almacenados en el sistema de archivos del controlador de Jenkins usando rutas locales como URLs SCM, obteniendo información limitada sobre el contenido SCM de otros proyectos"
      }
    ],
    "metrics": {
      "cvssMetricV31": [
        {
          "source": "nvd@nist.gov",
          "type": "Primary",
          "cvssData": {
            "attackComplexity": "LOW",
            "attackVector": "NETWORK",
            "availabilityImpact": "NONE",
            "baseScore": 5.3,
            "baseSeverity": "MEDIUM",
            "confidentialityImpact": "LOW",
            "integrityImpact": "NONE",
            "privilegesRequired": "NONE",
            "scope": "UNCHANGED",
            "userInteraction": "NONE",
            "vectorString": "CVSS:3.1/AV:N/AC:L/PR:N/UI:N/S:U/C:L/I:N/A:N",
            "version": "3.1"
          },
          "exploitabilityScore": 3.9,
          "impactScore": 1.4
        }
      ],
      "cvssMetricV30": null,
      "cvssMetricV2": [
        {
          "source": "nvd@nist.gov",
          "type": "Primary",
          "cvssData": {
            "accessComplexity": "LOW",
            "accessVector": "NETWORK",
            "authentication": "NONE",
            "availabilityImpact": "NONE",
            "baseScore": 5,
            "confidentialityImpact": "PARTIAL",
            "integrityImpact": "NONE",
            "vectorString": "AV:N/AC:L/Au:N/C:P/I:N/A:N",
            "version": "2.0"
          },
          "baseSeverity": "MEDIUM",
          "exploitabilityScore": 10,
          "impactScore": 2.9,
          "acInsufInfo": false,
          "obtainAllPrivilege": false,
          "obtainUserPrivilege": false,
          "obtainOtherPrivilege": false,
          "userInteractionRequired": false
        }
      ]
    },
    "weaknesses": [
      {
        "source": "nvd@nist.gov",
        "type": "Primary",
        "description": [
          {
            "lang": "en",
            "value": "NVD-CWE-noinfo"
          }
        ]
      }
    ],
    "configurations": [
      {
        "nodes": [
          {
            "operator": "OR",
            "negate": false,
            "cpeMatch": [
              {
                "vulnerable": true,
                "criteria": "cpe:2.3:a:jenkins:repo:*:*:*:*:*:jenkins:*:*",
                "matchCriteriaId": "70C720AF-1714-4D69-9FC3-FA3D88F32088",
                "versionEndExcluding": "1.15.0"
              }
            ]
          }
        ]
      }
    ],
    "references": [
      {
        "url": "http://www.openwall.com/lists/oss-security/2022/05/17/8",
        "source": "jenkinsci-cert@googlegroups.com",
        "tags": [
          "Mailing List",
          "Third Party Advisory"
        ]
      },
      {
        "url": "https://www.jenkins.io/security/advisory/2022-05-17/#SECURITY-2478",
        "source": "jenkinsci-cert@googlegroups.com",
        "tags": [
          "Vendor Advisory"
        ]
      }
    ],
    "data_type": "MITRE",
    "data_format": "CVE",
    "data_version": "4.0",
    "CVE_data_meta": {
      "ASSIGNER": "jenkinsci-cert@googlegroups.com",
      "ID": "CVE-2022-30949"
    },
    "problemtype": {
      "problemtype_data": [
        {
          "description": [
            {
              "lang": "en",
              "value": "NVD-CWE-noinfo"
            }
          ]
        }
      ]
    },
    "description": {
      "description_data": [
        {
          "lang": "en",
          "value": "Jenkins REPO Plugin 1.14.0 and earlier allows attackers able to configure pipelines to check out some SCM repositories stored on the Jenkins controller's file system using local paths as SCM URLs, obtaining limited information about other projects' SCM contents."
        },
        {
          "lang": "es",
          "value": "El plugin REPO de Jenkins versiones 1.14.0 y anteriores permite a atacantes capaces de configurar pipelines para comprobar algunos repositorios SCM almacenados en el sistema de archivos del controlador de Jenkins usando rutas locales como URLs SCM, obteniendo información limitada sobre el contenido SCM de otros proyectos"
        }
      ]
    }
  },
  "configurations": {
    "CVE_data_version": "4.0",
    "nodes": [
      {
        "operator": "OR",
        "cpe_match": [
          {
            "vulnerable": true,
            "cpe23Uri": "cpe:2.3:a:jenkins:repo:*:*:*:*:*:jenkins:*:*",
            "versionEndExcluding": "1.15.0"
          }
        ]
      }
    ]
  },
  "impact": {
    "baseMetricV2": {
      "cvssV2": {
        "accessComplexity": "LOW",
        "accessVector": "NETWORK",
        "authentication": "NONE",
        "availabilityImpact": "NONE",
        "baseScore": 5,
        "confidentialityImpact": "PARTIAL",
        "integrityImpact": "NONE",
        "vectorString": "AV:N/AC:L/Au:N/C:P/I:N/A:N",
        "version": "2.0"
      },
      "exploitabilityScore": 10,
      "impactScore": 2.9,
      "severity": "MEDIUM"
    },
    "baseMetricV3": {
      "cvssV3": {
        "attackComplexity": "LOW",
        "attackVector": "NETWORK",
        "availabilityImpact": "NONE",
        "baseScore": 5.3,
        "baseSeverity": "MEDIUM",
        "confidentialityImpact": "LOW",
        "integrityImpact": "NONE",
        "privilegesRequired": "NONE",
        "scope": "UNCHANGED",
        "userInteraction": "NONE",
        "vectorString": "CVSS:3.1/AV:N/AC:L/PR:N/UI:N/S:U/C:L/I:N/A:N",
        "version": "3.1"
      },
      "exploitabilityScore": 3.9,
      "impactScore": 1.4
    }
  },
  "publicationDate": "2022-05-17T15:15:08.963",
  "lastModifiedDate": "2023-12-21T21:54:57.407"
}
