{
  "cve": {
    "id": "CVE-2021-30560",
    "sourceIdentifier": "chrome-cve-admin@google.com",
    "published": "2021-08-03T19:15:08.127",
    "lastModified": "2024-03-27T14:45:52.567",
    "vulnStatus": "Analyzed",
    "descriptions": [
      {
        "lang": "en",
        "value": "Use after free in Blink XSLT in Google Chrome prior to 91.0.4472.164 allowed a remote attacker to potentially exploit heap corruption via a crafted HTML page."
      },
      {
        "lang": "es",
        "value": "Un uso de memoria previamente liberada en Blink XSLT en Google Chrome versiones anteriores a 91.0.4472.164, permitía a un atacante remoto explotar potencialmente una corrupción de la pila por medio de una página HTML diseñada"
      }
    ],
    "metrics": {
      "cvssMetricV31": [
        {
          "source": "nvd@nist.gov",
          "type": "Primary",
          "cvssData": {
            "attackComplexity": "LOW",
            "attackVector": "NETWORK",
            "availabilityImpact": "HIGH",
            "baseScore": 8.8,
            "baseSeverity": "HIGH",
            "confidentialityImpact": "HIGH",
            "integrityImpact": "HIGH",
            "privilegesRequired": "NONE",
            "scope": "UNCHANGED",
            "userInteraction": "REQUIRED",
            "vectorString": "CVSS:3.1/AV:N/AC:L/PR:N/UI:R/S:U/C:H/I:H/A:H",
            "version": "3.1"
          },
          "exploitabilityScore": 2.8,
          "impactScore": 5.9
        }
      ],
      "cvssMetricV30": null,
      "cvssMetricV2": [
        {
          "source": "nvd@nist.gov",
          "type": "Primary",
          "cvssData": {
            "accessComplexity": "MEDIUM",
            "accessVector": "NETWORK",
            "authentication": "NONE",
            "availabilityImpact": "PARTIAL",
            "baseScore": 6.8,
            "confidentialityImpact": "PARTIAL",
            "integrityImpact": "PARTIAL",
            "vectorString": "AV:N/AC:M/Au:N/C:P/I:P/A:P",
            "version": "2.0"
          },
          "baseSeverity": "MEDIUM",
          "exploitabilityScore": 8.6,
          "impactScore": 6.4,
          "acInsufInfo": false,
          "obtainAllPrivilege": false,
          "obtainUserPrivilege": false,
          "obtainOtherPrivilege": false,
          "userInteractionRequired": true
        }
      ]
    },
    "weaknesses": [
      {
        "source": "nvd@nist.gov",
        "type": "Primary",
        "description": [
          {
            "lang": "en",
            "value": "CWE-416"
          }
        ]
      }
    ],
    "configurations": [
      {
        "nodes": [
          {
            "operator": "OR",
            "negate": false,
            "cpeMatch": [
              {
                "vulnerable": true,
                "criteria": "cpe:2.3:a:google:chrome:*:*:*:*:*:*:*:*",
                "matchCriteriaId": "3B0BF7DD-0FAE-4761-B2CD-7D14E83A7B6F",
                "versionEndExcluding": "91.0.4472.164"
              }
            ]
          }
        ]
      },
      {
        "nodes": [
          {
            "operator": "OR",
            "negate": false,
            "cpeMatch": [
              {
                "vulnerable": true,
                "criteria": "cpe:2.3:a:xmlsoft:libxslt:*:*:*:*:*:*:*:*",
                "matchCriteriaId": "7E7A28AB-D5DA-4F00-9795-4DA4951B4E75",
                "versionEndExcluding": "1.1.35"
              }
            ]
          }
        ]
      },
      {
        "nodes": [
          {
            "operator": "OR",
            "negate": false,
            "cpeMatch": [
              {
                "vulnerable": true,
                "criteria": "cpe:2.3:o:debian:debian_linux:10.0:*:*:*:*:*:*:*",
                "matchCriteriaId": "07B237A9-69A3-4A9C-9DA0-4E06BD37AE73"
              },
              {
                "vulnerable": true,
                "criteria": "cpe:2.3:o:debian:debian_linux:11.0:*:*:*:*:*:*:*",
                "matchCriteriaId": "FA6FEEC2-9F11-4643-8827-749718254FED"
              }
            ]
          }
        ]
      },
      {
        "nodes": [
          {
            "operator": "OR",
            "negate": false,
            "cpeMatch": [
              {
                "vulnerable": true,
                "criteria": "cpe:2.3:a:splunk:universal_forwarder:*:*:*:*:*:*:*:*",
                "matchCriteriaId": "5722E753-75DE-4944-A11B-556CB299B57D",
                "versionStartIncluding": "8.2.0",
                "versionEndExcluding": "8.2.12"
              },
              {
                "vulnerable": true,
                "criteria": "cpe:2.3:a:splunk:universal_forwarder:*:*:*:*:*:*:*:*",
                "matchCriteriaId": "DC0F9351-81A4-4FEA-B6B5-6E960A933D32",
                "versionStartIncluding": "9.0.0",
                "versionEndExcluding": "9.0.6"
              },
              {
                "vulnerable": true,
                "criteria": "cpe:2.3:a:splunk:universal_forwarder:9.1.0:*:*:*:*:*:*:*",
                "matchCriteriaId": "EED24E67-2957-4C1B-8FEA-E2D2FE7B97FC"
              }
            ]
          }
        ]
      }
    ],
    "references": [
      {
        "url": "https://chromereleases.googleblog.com/2021/07/stable-channel-update-for-desktop.html",
        "source": "chrome-cve-admin@google.com",
        "tags": [
          "Release Notes",
          "Vendor Advisory"
        ]
      },
      {
        "url": "https://crbug.com/1219209",
        "source": "chrome-cve-admin@google.com",
        "tags": [
          "Issue Tracking",
          "Patch",
          "Vendor Advisory"
        ]
      },
      {
        "url": "https://lists.debian.org/debian-lts-announce/2022/09/msg00010.html",
        "source": "chrome-cve-admin@google.com",
        "tags": [
          "Mailing List",
          "Third Party Advisory"
        ]
      },
      {
        "url": "https://security.gentoo.org/glsa/202310-23",
        "source": "chrome-cve-admin@google.com",
        "tags": [
          "Third Party Advisory"
        ]
      },
      {
        "url": "https://www.debian.org/security/2022/dsa-5216",
        "source": "chrome-cve-admin@google.com",
        "tags": [
          "Third Party Advisory"
        ]
      }
    ],
    "data_type": "MITRE",
    "data_format": "CVE",
    "data_version": "4.0",
    "CVE_data_meta": {
      "ASSIGNER": "chrome-cve-admin@google.com",
      "ID": "CVE-2021-30560"
    },
    "problemtype": {
      "problemtype_data": [
        {
          "description": [
            {
              "lang": "en",
              "value": "CWE-416"
            }
          ]
        }
      ]
    },
    "description": {
      "description_data": [
        {
          "lang": "en",
          "value": "Use after free in Blink XSLT in Google Chrome prior to 91.0.4472.164 allowed a remote attacker to potentially exploit heap corruption via a crafted HTML page."
        },
        {
          "lang": "es",
          "value": "Un uso de memoria previamente liberada en Blink XSLT en Google Chrome versiones anteriores a 91.0.4472.164, permitía a un atacante remoto explotar potencialmente una corrupción de la pila por medio de una página HTML diseñada"
        }
      ]
    }
  },
  "configurations": {
    "CVE_data_version": "4.0",
    "nodes": [
      {
        "operator": "OR",
        "cpe_match": [
          {
            "vulnerable": true,
            "cpe23Uri": "cpe:2.3:a:google:chrome:*:*:*:*:*:*:*:*",
            "versionEndExcluding": "91.0.4472.164"
          }
        ]
      },
      {
        "operator": "OR",
        "cpe_match": [
          {
            "vulnerable": true,
            "cpe23Uri": "cpe:2.3:a:xmlsoft:libxslt:*:*:*:*:*:*:*:*",
            "versionEndExcluding": "1.1.35"
          }
        ]
      },
      {
        "operator": "OR",
        "cpe_match": [
          {
            "vulnerable": true,
            "cpe23Uri": "cpe:2.3:o:debian:debian_linux:10.0:*:*:*:*:*:*:*"
          },
          {
            "vulnerable": true,
            "cpe23Uri": "cpe:2.3:o:debian:debian_linux:11.0:*:*:*:*:*:*:*"
          }
        ]
      },
      {
        "operator": "OR",
        "cpe_match": [
          {
            "vulnerable": true,
            "cpe23Uri": "cpe:2.3:a:splunk:universal_forwarder:*:*:*:*:*:*:*:*",
            "versionStartIncluding": "8.2.0",
            "versionEndExcluding": "8.2.12"
          },
          {
            "vulnerable": true,
            "cpe23Uri": "cpe:2.3:a:splunk:universal_forwarder:*:*:*:*:*:*:*:*",
            "versionStartIncluding": "9.0.0",
            "versionEndExcluding": "9.0.6"
          },
          {
            "vulnerable": true,
            "cpe23Uri": "cpe:2.3:a:splunk:universal_forwarder:9.1.0:*:*:*:*:*:*:*"
          }
        ]
      }
    ]
  },
  "impact": {
    "baseMetricV2": {
      "cvssV2": {
        "accessComplexity": "MEDIUM",
        "accessVector": "NETWORK",
        "authentication": "NONE",
        "availabilityImpact": "PARTIAL",
        "baseScore": 6.8,
        "confidentialityImpact": "PARTIAL",
        "integrityImpact": "PARTIAL",
        "vectorString": "AV:N/AC:M/Au:N/C:P/I:P/A:P",
        "version": "2.0"
      },
      "exploitabilityScore": 8.6,
      "impactScore": 6.4,
      "severity": "MEDIUM",
      "userInteractionRequired": true
    },
    "baseMetricV3": {
      "cvssV3": {
        "attackComplexity": "LOW",
        "attackVector": "NETWORK",
        "availabilityImpact": "HIGH",
        "baseScore": 8.8,
        "baseSeverity": "HIGH",
        "confidentialityImpact": "HIGH",
        "integrityImpact": "HIGH",
        "privilegesRequired": "NONE",
        "scope": "UNCHANGED",
        "userInteraction": "REQUIRED",
        "vectorString": "CVSS:3.1/AV:N/AC:L/PR:N/UI:R/S:U/C:H/I:H/A:H",
        "version": "3.1"
      },
      "exploitabilityScore": 2.8,
      "impactScore": 5.9
    }
  },
  "publicationDate": "2021-08-03T19:15:08.127",
  "lastModifiedDate": "2024-03-27T14:45:52.567"
}
