{
  "cve": {
    "id": "CVE-2021-22925",
    "sourceIdentifier": "support@hackerone.com",
    "published": "2021-08-05T21:15:11.467",
    "lastModified": "2024-03-27T15:11:42.063",
    "vulnStatus": "Analyzed",
    "descriptions": [
      {
        "lang": "en",
        "value": "curl supports the `-t` command line option, known as `CURLOPT_TELNETOPTIONS`in libcurl. This rarely used option is used to send variable=content pairs toTELNET servers.Due to flaw in the option parser for sending `NEW_ENV` variables, libcurlcould be made to pass on uninitialized data from a stack based buffer to theserver. Therefore potentially revealing sensitive internal information to theserver using a clear-text network protocol.This could happen because curl did not call and use sscanf() correctly whenparsing the string provided by the application."
      },
      {
        "lang": "es",
        "value": "curl soporta la opción de línea de comandos \"-t\", conocida como \"CURLOPT_TELNETOPTIONS\" en libcurl. Debido a un fallo en el analizador de opciones para el envío de variables \"NEW_ENV\", libcurl podría pasar datos no inicializados de un búfer en la región stack de la memoria al servidor. Por lo tanto, podría revelar potencialmente información interna confidencial al servidor usando un protocolo de red de texto sin cifrar. Esto podría ocurrir porque curl no llamó y usó la función sscanf() apropiadamente al analizar la cadena proporcionada por la aplicación"
      }
    ],
    "metrics": {
      "cvssMetricV31": [
        {
          "source": "nvd@nist.gov",
          "type": "Primary",
          "cvssData": {
            "attackComplexity": "LOW",
            "attackVector": "NETWORK",
            "availabilityImpact": "NONE",
            "baseScore": 5.3,
            "baseSeverity": "MEDIUM",
            "confidentialityImpact": "LOW",
            "integrityImpact": "NONE",
            "privilegesRequired": "NONE",
            "scope": "UNCHANGED",
            "userInteraction": "NONE",
            "vectorString": "CVSS:3.1/AV:N/AC:L/PR:N/UI:N/S:U/C:L/I:N/A:N",
            "version": "3.1"
          },
          "exploitabilityScore": 3.9,
          "impactScore": 1.4
        }
      ],
      "cvssMetricV30": null,
      "cvssMetricV2": [
        {
          "source": "nvd@nist.gov",
          "type": "Primary",
          "cvssData": {
            "accessComplexity": "LOW",
            "accessVector": "NETWORK",
            "authentication": "NONE",
            "availabilityImpact": "NONE",
            "baseScore": 5,
            "confidentialityImpact": "PARTIAL",
            "integrityImpact": "NONE",
            "vectorString": "AV:N/AC:L/Au:N/C:P/I:N/A:N",
            "version": "2.0"
          },
          "baseSeverity": "MEDIUM",
          "exploitabilityScore": 10,
          "impactScore": 2.9,
          "acInsufInfo": false,
          "obtainAllPrivilege": false,
          "obtainUserPrivilege": false,
          "obtainOtherPrivilege": false,
          "userInteractionRequired": false
        }
      ]
    },
    "weaknesses": [
      {
        "source": "nvd@nist.gov",
        "type": "Primary",
        "description": [
          {
            "lang": "en",
            "value": "CWE-908"
          }
        ]
      },
      {
        "source": "support@hackerone.com",
        "type": "Secondary",
        "description": [
          {
            "lang": "en",
            "value": "CWE-200"
          }
        ]
      }
    ],
    "configurations": [
      {
        "nodes": [
          {
            "operator": "OR",
            "negate": false,
            "cpeMatch": [
              {
                "vulnerable": true,
                "criteria": "cpe:2.3:a:haxx:curl:*:*:*:*:*:*:*:*",
                "matchCriteriaId": "BFF31995-A9B7-4FFE-86B1-6EAB08305586",
                "versionStartIncluding": "7.7",
                "versionEndExcluding": "7.78.0"
              }
            ]
          }
        ]
      },
      {
        "nodes": [
          {
            "operator": "OR",
            "negate": false,
            "cpeMatch": [
              {
                "vulnerable": true,
                "criteria": "cpe:2.3:o:fedoraproject:fedora:33:*:*:*:*:*:*:*",
                "matchCriteriaId": "E460AA51-FCDA-46B9-AE97-E6676AA5E194"
              }
            ]
          }
        ]
      },
      {
        "nodes": [
          {
            "operator": "OR",
            "negate": false,
            "cpeMatch": [
              {
                "vulnerable": true,
                "criteria": "cpe:2.3:a:netapp:cloud_backup:-:*:*:*:*:*:*:*",
                "matchCriteriaId": "5C2089EE-5D7F-47EC-8EA5-0F69790564C4"
              },
              {
                "vulnerable": true,
                "criteria": "cpe:2.3:a:netapp:clustered_data_ontap:-:*:*:*:*:*:*:*",
                "matchCriteriaId": "1FE996B1-6951-4F85-AA58-B99A379D2163"
              },
              {
                "vulnerable": true,
                "criteria": "cpe:2.3:a:netapp:hci_management_node:-:*:*:*:*:*:*:*",
                "matchCriteriaId": "A3C19813-E823-456A-B1CE-EC0684CE1953"
              },
              {
                "vulnerable": true,
                "criteria": "cpe:2.3:a:netapp:solidfire:-:*:*:*:*:*:*:*",
                "matchCriteriaId": "A6E9EF0C-AFA8-4F7B-9FDC-1E0F7C26E737"
              }
            ]
          }
        ]
      },
      {
        "nodes": [
          {
            "operator": "OR",
            "negate": false,
            "cpeMatch": [
              {
                "vulnerable": true,
                "criteria": "cpe:2.3:o:apple:mac_os_x:10.15.7:-:*:*:*:*:*:*",
                "matchCriteriaId": "A654B8A2-FC30-4171-B0BB-366CD7ED4B6A"
              },
              {
                "vulnerable": true,
                "criteria": "cpe:2.3:o:apple:mac_os_x:10.15.7:security_update_2021-001:*:*:*:*:*:*",
                "matchCriteriaId": "0F441A43-1669-478D-9EC8-E96882DE4F9F"
              },
              {
                "vulnerable": true,
                "criteria": "cpe:2.3:o:apple:mac_os_x:10.15.7:security_update_2021-002:*:*:*:*:*:*",
                "matchCriteriaId": "D425C653-37A2-448C-BF2F-B684ADB08A26"
              },
              {
                "vulnerable": true,
                "criteria": "cpe:2.3:o:apple:mac_os_x:10.15.7:security_update_2021-003:*:*:*:*:*:*",
                "matchCriteriaId": "A54D63B7-B92B-47C3-B1C5-9892E5873A98"
              },
              {
                "vulnerable": true,
                "criteria": "cpe:2.3:o:apple:mac_os_x:10.15.7:security_update_2021-004:*:*:*:*:*:*",
                "matchCriteriaId": "3456176F-9185-4EE2-A8CE-3D989D674AB7"
              },
              {
                "vulnerable": true,
                "criteria": "cpe:2.3:o:apple:macos:11.0:*:*:*:*:*:*:*",
                "matchCriteriaId": "89056ADD-BD96-4D5B-AD42-4871A8253229"
              },
              {
                "vulnerable": true,
                "criteria": "cpe:2.3:o:apple:macos:11.0.1:*:*:*:*:*:*:*",
                "matchCriteriaId": "96C3F2DF-96A5-40F2-B5C7-E961C2EE4489"
              },
              {
                "vulnerable": true,
                "criteria": "cpe:2.3:o:apple:macos:11.1:*:*:*:*:*:*:*",
                "matchCriteriaId": "D120FD05-70E5-46AE-9B43-4F97BC8E05FE"
              },
              {
                "vulnerable": true,
                "criteria": "cpe:2.3:o:apple:macos:11.1.0:*:*:*:*:*:*:*",
                "matchCriteriaId": "B1C7383E-AD3C-4065-A719-96D806426266"
              },
              {
                "vulnerable": true,
                "criteria": "cpe:2.3:o:apple:macos:11.2:*:*:*:*:*:*:*",
                "matchCriteriaId": "752548E2-BB8F-49AB-9D80-38182232989B"
              },
              {
                "vulnerable": true,
                "criteria": "cpe:2.3:o:apple:macos:11.2.1:*:*:*:*:*:*:*",
                "matchCriteriaId": "4C0548BC-0134-4D90-8B03-C7BA8E2B16DA"
              },
              {
                "vulnerable": true,
                "criteria": "cpe:2.3:o:apple:macos:11.3:*:*:*:*:*:*:*",
                "matchCriteriaId": "4CE016D4-F266-4B30-AEC4-E420001D418A"
              },
              {
                "vulnerable": true,
                "criteria": "cpe:2.3:o:apple:macos:11.3.1:*:*:*:*:*:*:*",
                "matchCriteriaId": "C9CBE894-B368-47C3-8951-87C7A8E977A8"
              },
              {
                "vulnerable": true,
                "criteria": "cpe:2.3:o:apple:macos:11.4:*:*:*:*:*:*:*",
                "matchCriteriaId": "7172F36D-BA62-4A1F-86BF-D814FD5B1AEC"
              },
              {
                "vulnerable": true,
                "criteria": "cpe:2.3:o:apple:macos:11.5:*:*:*:*:*:*:*",
                "matchCriteriaId": "25B7EB54-4260-4F11-897E-3C97A8DF7042"
              }
            ]
          }
        ]
      },
      {
        "nodes": [
          {
            "operator": "OR",
            "negate": false,
            "cpeMatch": [
              {
                "vulnerable": true,
                "criteria": "cpe:2.3:a:oracle:mysql_server:*:*:*:*:*:*:*:*",
                "matchCriteriaId": "E667933A-37EA-4BC2-9180-C3B4B7038866",
                "versionStartIncluding": "5.7.0",
                "versionEndIncluding": "5.7.35"
              },
              {
                "vulnerable": true,
                "criteria": "cpe:2.3:a:oracle:mysql_server:*:*:*:*:*:*:*:*",
                "matchCriteriaId": "709E83B4-8C66-4255-870B-2F72B37BA8C6",
                "versionStartIncluding": "8.0.0",
                "versionEndIncluding": "8.0.26"
              },
              {
                "vulnerable": true,
                "criteria": "cpe:2.3:a:oracle:peoplesoft_enterprise_peopletools:8.57:*:*:*:*:*:*:*",
                "matchCriteriaId": "7E1E416B-920B-49A0-9523-382898C2979D"
              },
              {
                "vulnerable": true,
                "criteria": "cpe:2.3:a:oracle:peoplesoft_enterprise_peopletools:8.58:*:*:*:*:*:*:*",
                "matchCriteriaId": "D9DB4A14-2EF5-4B54-95D2-75E6CF9AA0A9"
              },
              {
                "vulnerable": true,
                "criteria": "cpe:2.3:a:oracle:peoplesoft_enterprise_peopletools:8.59:*:*:*:*:*:*:*",
                "matchCriteriaId": "C8AF00C6-B97F-414D-A8DF-057E6BFD8597"
              }
            ]
          }
        ]
      },
      {
        "nodes": [
          {
            "operator": "OR",
            "negate": false,
            "cpeMatch": [
              {
                "vulnerable": true,
                "criteria": "cpe:2.3:a:siemens:sinec_infrastructure_network_services:*:*:*:*:*:*:*:*",
                "matchCriteriaId": "B0F46497-4AB0-49A7-9453-CC26837BF253",
                "versionEndExcluding": "1.0.1.1"
              },
              {
                "vulnerable": true,
                "criteria": "cpe:2.3:a:siemens:sinema_remote_connect_server:*:*:*:*:*:*:*:*",
                "matchCriteriaId": "98CC9C9A-FE14-4D50-A8EC-C309229356C8",
                "versionEndExcluding": "3.1"
              }
            ]
          }
        ]
      },
      {
        "nodes": [
          {
            "operator": "OR",
            "negate": false,
            "cpeMatch": [
              {
                "vulnerable": true,
                "criteria": "cpe:2.3:o:netapp:h300s_firmware:-:*:*:*:*:*:*:*",
                "matchCriteriaId": "6770B6C3-732E-4E22-BF1C-2D2FD610061C"
              }
            ]
          },
          {
            "operator": "OR",
            "negate": false,
            "cpeMatch": [
              {
                "vulnerable": false,
                "criteria": "cpe:2.3:h:netapp:h300s:-:*:*:*:*:*:*:*",
                "matchCriteriaId": "9F9C8C20-42EB-4AB5-BD97-212DEB070C43"
              }
            ]
          }
        ]
      },
      {
        "nodes": [
          {
            "operator": "OR",
            "negate": false,
            "cpeMatch": [
              {
                "vulnerable": true,
                "criteria": "cpe:2.3:o:netapp:h500s_firmware:-:*:*:*:*:*:*:*",
                "matchCriteriaId": "7FFF7106-ED78-49BA-9EC5-B889E3685D53"
              }
            ]
          },
          {
            "operator": "OR",
            "negate": false,
            "cpeMatch": [
              {
                "vulnerable": false,
                "criteria": "cpe:2.3:h:netapp:h500s:-:*:*:*:*:*:*:*",
                "matchCriteriaId": "E63D8B0F-006E-4801-BF9D-1C001BBFB4F9"
              }
            ]
          }
        ]
      },
      {
        "nodes": [
          {
            "operator": "OR",
            "negate": false,
            "cpeMatch": [
              {
                "vulnerable": true,
                "criteria": "cpe:2.3:o:netapp:h700s_firmware:-:*:*:*:*:*:*:*",
                "matchCriteriaId": "56409CEC-5A1E-4450-AA42-641E459CC2AF"
              }
            ]
          },
          {
            "operator": "OR",
            "negate": false,
            "cpeMatch": [
              {
                "vulnerable": false,
                "criteria": "cpe:2.3:h:netapp:h700s:-:*:*:*:*:*:*:*",
                "matchCriteriaId": "B06F4839-D16A-4A61-9BB5-55B13F41E47F"
              }
            ]
          }
        ]
      },
      {
        "nodes": [
          {
            "operator": "OR",
            "negate": false,
            "cpeMatch": [
              {
                "vulnerable": true,
                "criteria": "cpe:2.3:o:netapp:h300e_firmware:-:*:*:*:*:*:*:*",
                "matchCriteriaId": "108A2215-50FB-4074-94CF-C130FA14566D"
              }
            ]
          },
          {
            "operator": "OR",
            "negate": false,
            "cpeMatch": [
              {
                "vulnerable": false,
                "criteria": "cpe:2.3:h:netapp:h300e:-:*:*:*:*:*:*:*",
                "matchCriteriaId": "7AFC73CE-ABB9-42D3-9A71-3F5BC5381E0E"
              }
            ]
          }
        ]
      },
      {
        "nodes": [
          {
            "operator": "OR",
            "negate": false,
            "cpeMatch": [
              {
                "vulnerable": true,
                "criteria": "cpe:2.3:o:netapp:h500e_firmware:-:*:*:*:*:*:*:*",
                "matchCriteriaId": "32F0B6C0-F930-480D-962B-3F4EFDCC13C7"
              }
            ]
          },
          {
            "operator": "OR",
            "negate": false,
            "cpeMatch": [
              {
                "vulnerable": false,
                "criteria": "cpe:2.3:h:netapp:h500e:-:*:*:*:*:*:*:*",
                "matchCriteriaId": "803BC414-B250-4E3A-A478-A3881340D6B8"
              }
            ]
          }
        ]
      },
      {
        "nodes": [
          {
            "operator": "OR",
            "negate": false,
            "cpeMatch": [
              {
                "vulnerable": true,
                "criteria": "cpe:2.3:o:netapp:h700e_firmware:-:*:*:*:*:*:*:*",
                "matchCriteriaId": "0FEB3337-BFDE-462A-908B-176F92053CEC"
              }
            ]
          },
          {
            "operator": "OR",
            "negate": false,
            "cpeMatch": [
              {
                "vulnerable": false,
                "criteria": "cpe:2.3:h:netapp:h700e:-:*:*:*:*:*:*:*",
                "matchCriteriaId": "736AEAE9-782B-4F71-9893-DED53367E102"
              }
            ]
          }
        ]
      },
      {
        "nodes": [
          {
            "operator": "OR",
            "negate": false,
            "cpeMatch": [
              {
                "vulnerable": true,
                "criteria": "cpe:2.3:o:netapp:h410s_firmware:-:*:*:*:*:*:*:*",
                "matchCriteriaId": "D0B4AD8A-F172-4558-AEC6-FF424BA2D912"
              }
            ]
          },
          {
            "operator": "OR",
            "negate": false,
            "cpeMatch": [
              {
                "vulnerable": false,
                "criteria": "cpe:2.3:h:netapp:h410s:-:*:*:*:*:*:*:*",
                "matchCriteriaId": "8497A4C9-8474-4A62-8331-3FE862ED4098"
              }
            ]
          }
        ]
      },
      {
        "nodes": [
          {
            "operator": "OR",
            "negate": false,
            "cpeMatch": [
              {
                "vulnerable": true,
                "criteria": "cpe:2.3:a:splunk:universal_forwarder:*:*:*:*:*:*:*:*",
                "matchCriteriaId": "5722E753-75DE-4944-A11B-556CB299B57D",
                "versionStartIncluding": "8.2.0",
                "versionEndExcluding": "8.2.12"
              },
              {
                "vulnerable": true,
                "criteria": "cpe:2.3:a:splunk:universal_forwarder:*:*:*:*:*:*:*:*",
                "matchCriteriaId": "DC0F9351-81A4-4FEA-B6B5-6E960A933D32",
                "versionStartIncluding": "9.0.0",
                "versionEndExcluding": "9.0.6"
              },
              {
                "vulnerable": true,
                "criteria": "cpe:2.3:a:splunk:universal_forwarder:9.1.0:*:*:*:*:*:*:*",
                "matchCriteriaId": "EED24E67-2957-4C1B-8FEA-E2D2FE7B97FC"
              }
            ]
          }
        ]
      }
    ],
    "references": [
      {
        "url": "http://seclists.org/fulldisclosure/2021/Sep/39",
        "source": "support@hackerone.com",
        "tags": [
          "Mailing List",
          "Third Party Advisory"
        ]
      },
      {
        "url": "http://seclists.org/fulldisclosure/2021/Sep/40",
        "source": "support@hackerone.com",
        "tags": [
          "Mailing List",
          "Third Party Advisory"
        ]
      },
      {
        "url": "https://cert-portal.siemens.com/productcert/pdf/ssa-389290.pdf",
        "source": "support@hackerone.com",
        "tags": [
          "Patch",
          "Third Party Advisory"
        ]
      },
      {
        "url": "https://cert-portal.siemens.com/productcert/pdf/ssa-484086.pdf",
        "source": "support@hackerone.com",
        "tags": [
          "Third Party Advisory"
        ]
      },
      {
        "url": "https://hackerone.com/reports/1223882",
        "source": "support@hackerone.com",
        "tags": [
          "Exploit",
          "Issue Tracking",
          "Patch",
          "Third Party Advisory"
        ]
      },
      {
        "url": "https://lists.fedoraproject.org/archives/list/package-announce%40lists.fedoraproject.org/message/FRUCW2UVNYUDZF72DQLFQR4PJEC6CF7V/",
        "source": "support@hackerone.com",
        "tags": [
          "Mailing List",
          "Third Party Advisory"
        ]
      },
      {
        "url": "https://security.gentoo.org/glsa/202212-01",
        "source": "support@hackerone.com",
        "tags": [
          "Third Party Advisory"
        ]
      },
      {
        "url": "https://security.netapp.com/advisory/ntap-20210902-0003/",
        "source": "support@hackerone.com",
        "tags": [
          "Third Party Advisory"
        ]
      },
      {
        "url": "https://support.apple.com/kb/HT212804",
        "source": "support@hackerone.com",
        "tags": [
          "Third Party Advisory"
        ]
      },
      {
        "url": "https://support.apple.com/kb/HT212805",
        "source": "support@hackerone.com",
        "tags": [
          "Third Party Advisory"
        ]
      },
      {
        "url": "https://www.oracle.com/security-alerts/cpujan2022.html",
        "source": "support@hackerone.com",
        "tags": [
          "Patch",
          "Third Party Advisory"
        ]
      },
      {
        "url": "https://www.oracle.com/security-alerts/cpuoct2021.html",
        "source": "support@hackerone.com",
        "tags": [
          "Patch",
          "Third Party Advisory"
        ]
      }
    ],
    "data_type": "MITRE",
    "data_format": "CVE",
    "data_version": "4.0",
    "CVE_data_meta": {
      "ASSIGNER": "support@hackerone.com",
      "ID": "CVE-2021-22925"
    },
    "problemtype": {
      "problemtype_data": [
        {
          "description": [
            {
              "lang": "en",
              "value": "CWE-908"
            }
          ]
        },
        {
          "description": [
            {
              "lang": "en",
              "value": "CWE-200"
            }
          ]
        }
      ]
    },
    "description": {
      "description_data": [
        {
          "lang": "en",
          "value": "curl supports the `-t` command line option, known as `CURLOPT_TELNETOPTIONS`in libcurl. This rarely used option is used to send variable=content pairs toTELNET servers.Due to flaw in the option parser for sending `NEW_ENV` variables, libcurlcould be made to pass on uninitialized data from a stack based buffer to theserver. Therefore potentially revealing sensitive internal information to theserver using a clear-text network protocol.This could happen because curl did not call and use sscanf() correctly whenparsing the string provided by the application."
        },
        {
          "lang": "es",
          "value": "curl soporta la opción de línea de comandos \"-t\", conocida como \"CURLOPT_TELNETOPTIONS\" en libcurl. Debido a un fallo en el analizador de opciones para el envío de variables \"NEW_ENV\", libcurl podría pasar datos no inicializados de un búfer en la región stack de la memoria al servidor. Por lo tanto, podría revelar potencialmente información interna confidencial al servidor usando un protocolo de red de texto sin cifrar. Esto podría ocurrir porque curl no llamó y usó la función sscanf() apropiadamente al analizar la cadena proporcionada por la aplicación"
        }
      ]
    }
  },
  "configurations": {
    "CVE_data_version": "4.0",
    "nodes": [
      {
        "operator": "OR",
        "cpe_match": [
          {
            "vulnerable": true,
            "cpe23Uri": "cpe:2.3:a:haxx:curl:*:*:*:*:*:*:*:*",
            "versionStartIncluding": "7.7",
            "versionEndExcluding": "7.78.0"
          }
        ]
      },
      {
        "operator": "OR",
        "cpe_match": [
          {
            "vulnerable": true,
            "cpe23Uri": "cpe:2.3:o:fedoraproject:fedora:33:*:*:*:*:*:*:*"
          }
        ]
      },
      {
        "operator": "OR",
        "cpe_match": [
          {
            "vulnerable": true,
            "cpe23Uri": "cpe:2.3:a:netapp:cloud_backup:-:*:*:*:*:*:*:*"
          },
          {
            "vulnerable": true,
            "cpe23Uri": "cpe:2.3:a:netapp:clustered_data_ontap:-:*:*:*:*:*:*:*"
          },
          {
            "vulnerable": true,
            "cpe23Uri": "cpe:2.3:a:netapp:hci_management_node:-:*:*:*:*:*:*:*"
          },
          {
            "vulnerable": true,
            "cpe23Uri": "cpe:2.3:a:netapp:solidfire:-:*:*:*:*:*:*:*"
          }
        ]
      },
      {
        "operator": "OR",
        "cpe_match": [
          {
            "vulnerable": true,
            "cpe23Uri": "cpe:2.3:o:apple:mac_os_x:10.15.7:-:*:*:*:*:*:*"
          },
          {
            "vulnerable": true,
            "cpe23Uri": "cpe:2.3:o:apple:mac_os_x:10.15.7:security_update_2021-001:*:*:*:*:*:*"
          },
          {
            "vulnerable": true,
            "cpe23Uri": "cpe:2.3:o:apple:mac_os_x:10.15.7:security_update_2021-002:*:*:*:*:*:*"
          },
          {
            "vulnerable": true,
            "cpe23Uri": "cpe:2.3:o:apple:mac_os_x:10.15.7:security_update_2021-003:*:*:*:*:*:*"
          },
          {
            "vulnerable": true,
            "cpe23Uri": "cpe:2.3:o:apple:mac_os_x:10.15.7:security_update_2021-004:*:*:*:*:*:*"
          },
          {
            "vulnerable": true,
            "cpe23Uri": "cpe:2.3:o:apple:macos:11.0:*:*:*:*:*:*:*"
          },
          {
            "vulnerable": true,
            "cpe23Uri": "cpe:2.3:o:apple:macos:11.0.1:*:*:*:*:*:*:*"
          },
          {
            "vulnerable": true,
            "cpe23Uri": "cpe:2.3:o:apple:macos:11.1:*:*:*:*:*:*:*"
          },
          {
            "vulnerable": true,
            "cpe23Uri": "cpe:2.3:o:apple:macos:11.1.0:*:*:*:*:*:*:*"
          },
          {
            "vulnerable": true,
            "cpe23Uri": "cpe:2.3:o:apple:macos:11.2:*:*:*:*:*:*:*"
          },
          {
            "vulnerable": true,
            "cpe23Uri": "cpe:2.3:o:apple:macos:11.2.1:*:*:*:*:*:*:*"
          },
          {
            "vulnerable": true,
            "cpe23Uri": "cpe:2.3:o:apple:macos:11.3:*:*:*:*:*:*:*"
          },
          {
            "vulnerable": true,
            "cpe23Uri": "cpe:2.3:o:apple:macos:11.3.1:*:*:*:*:*:*:*"
          },
          {
            "vulnerable": true,
            "cpe23Uri": "cpe:2.3:o:apple:macos:11.4:*:*:*:*:*:*:*"
          },
          {
            "vulnerable": true,
            "cpe23Uri": "cpe:2.3:o:apple:macos:11.5:*:*:*:*:*:*:*"
          }
        ]
      },
      {
        "operator": "OR",
        "cpe_match": [
          {
            "vulnerable": true,
            "cpe23Uri": "cpe:2.3:a:oracle:mysql_server:*:*:*:*:*:*:*:*",
            "versionStartIncluding": "5.7.0",
            "versionEndIncluding": "5.7.35"
          },
          {
            "vulnerable": true,
            "cpe23Uri": "cpe:2.3:a:oracle:mysql_server:*:*:*:*:*:*:*:*",
            "versionStartIncluding": "8.0.0",
            "versionEndIncluding": "8.0.26"
          },
          {
            "vulnerable": true,
            "cpe23Uri": "cpe:2.3:a:oracle:peoplesoft_enterprise_peopletools:8.57:*:*:*:*:*:*:*"
          },
          {
            "vulnerable": true,
            "cpe23Uri": "cpe:2.3:a:oracle:peoplesoft_enterprise_peopletools:8.58:*:*:*:*:*:*:*"
          },
          {
            "vulnerable": true,
            "cpe23Uri": "cpe:2.3:a:oracle:peoplesoft_enterprise_peopletools:8.59:*:*:*:*:*:*:*"
          }
        ]
      },
      {
        "operator": "OR",
        "cpe_match": [
          {
            "vulnerable": true,
            "cpe23Uri": "cpe:2.3:a:siemens:sinec_infrastructure_network_services:*:*:*:*:*:*:*:*",
            "versionEndExcluding": "1.0.1.1"
          },
          {
            "vulnerable": true,
            "cpe23Uri": "cpe:2.3:a:siemens:sinema_remote_connect_server:*:*:*:*:*:*:*:*",
            "versionEndExcluding": "3.1"
          }
        ]
      },
      {
        "operator": "OR",
        "cpe_match": [
          {
            "vulnerable": true,
            "cpe23Uri": "cpe:2.3:o:netapp:h300s_firmware:-:*:*:*:*:*:*:*"
          }
        ]
      },
      {
        "operator": "OR",
        "cpe_match": [
          {
            "cpe23Uri": "cpe:2.3:h:netapp:h300s:-:*:*:*:*:*:*:*"
          }
        ]
      },
      {
        "operator": "OR",
        "cpe_match": [
          {
            "vulnerable": true,
            "cpe23Uri": "cpe:2.3:o:netapp:h500s_firmware:-:*:*:*:*:*:*:*"
          }
        ]
      },
      {
        "operator": "OR",
        "cpe_match": [
          {
            "cpe23Uri": "cpe:2.3:h:netapp:h500s:-:*:*:*:*:*:*:*"
          }
        ]
      },
      {
        "operator": "OR",
        "cpe_match": [
          {
            "vulnerable": true,
            "cpe23Uri": "cpe:2.3:o:netapp:h700s_firmware:-:*:*:*:*:*:*:*"
          }
        ]
      },
      {
        "operator": "OR",
        "cpe_match": [
          {
            "cpe23Uri": "cpe:2.3:h:netapp:h700s:-:*:*:*:*:*:*:*"
          }
        ]
      },
      {
        "operator": "OR",
        "cpe_match": [
          {
            "vulnerable": true,
            "cpe23Uri": "cpe:2.3:o:netapp:h300e_firmware:-:*:*:*:*:*:*:*"
          }
        ]
      },
      {
        "operator": "OR",
        "cpe_match": [
          {
            "cpe23Uri": "cpe:2.3:h:netapp:h300e:-:*:*:*:*:*:*:*"
          }
        ]
      },
      {
        "operator": "OR",
        "cpe_match": [
          {
            "vulnerable": true,
            "cpe23Uri": "cpe:2.3:o:netapp:h500e_firmware:-:*:*:*:*:*:*:*"
          }
        ]
      },
      {
        "operator": "OR",
        "cpe_match": [
          {
            "cpe23Uri": "cpe:2.3:h:netapp:h500e:-:*:*:*:*:*:*:*"
          }
        ]
      },
      {
        "operator": "OR",
        "cpe_match": [
          {
            "vulnerable": true,
            "cpe23Uri": "cpe:2.3:o:netapp:h700e_firmware:-:*:*:*:*:*:*:*"
          }
        ]
      },
      {
        "operator": "OR",
        "cpe_match": [
          {
            "cpe23Uri": "cpe:2.3:h:netapp:h700e:-:*:*:*:*:*:*:*"
          }
        ]
      },
      {
        "operator": "OR",
        "cpe_match": [
          {
            "vulnerable": true,
            "cpe23Uri": "cpe:2.3:o:netapp:h410s_firmware:-:*:*:*:*:*:*:*"
          }
        ]
      },
      {
        "operator": "OR",
        "cpe_match": [
          {
            "cpe23Uri": "cpe:2.3:h:netapp:h410s:-:*:*:*:*:*:*:*"
          }
        ]
      },
      {
        "operator": "OR",
        "cpe_match": [
          {
            "vulnerable": true,
            "cpe23Uri": "cpe:2.3:a:splunk:universal_forwarder:*:*:*:*:*:*:*:*",
            "versionStartIncluding": "8.2.0",
            "versionEndExcluding": "8.2.12"
          },
          {
            "vulnerable": true,
            "cpe23Uri": "cpe:2.3:a:splunk:universal_forwarder:*:*:*:*:*:*:*:*",
            "versionStartIncluding": "9.0.0",
            "versionEndExcluding": "9.0.6"
          },
          {
            "vulnerable": true,
            "cpe23Uri": "cpe:2.3:a:splunk:universal_forwarder:9.1.0:*:*:*:*:*:*:*"
          }
        ]
      }
    ]
  },
  "impact": {
    "baseMetricV2": {
      "cvssV2": {
        "accessComplexity": "LOW",
        "accessVector": "NETWORK",
        "authentication": "NONE",
        "availabilityImpact": "NONE",
        "baseScore": 5,
        "confidentialityImpact": "PARTIAL",
        "integrityImpact": "NONE",
        "vectorString": "AV:N/AC:L/Au:N/C:P/I:N/A:N",
        "version": "2.0"
      },
      "exploitabilityScore": 10,
      "impactScore": 2.9,
      "severity": "MEDIUM"
    },
    "baseMetricV3": {
      "cvssV3": {
        "attackComplexity": "LOW",
        "attackVector": "NETWORK",
        "availabilityImpact": "NONE",
        "baseScore": 5.3,
        "baseSeverity": "MEDIUM",
        "confidentialityImpact": "LOW",
        "integrityImpact": "NONE",
        "privilegesRequired": "NONE",
        "scope": "UNCHANGED",
        "userInteraction": "NONE",
        "vectorString": "CVSS:3.1/AV:N/AC:L/PR:N/UI:N/S:U/C:L/I:N/A:N",
        "version": "3.1"
      },
      "exploitabilityScore": 3.9,
      "impactScore": 1.4
    }
  },
  "publicationDate": "2021-08-05T21:15:11.467",
  "lastModifiedDate": "2024-03-27T15:11:42.063"
}
