{
  "cve": {
    "id": "CVE-2021-21684",
    "sourceIdentifier": "jenkinsci-cert@googlegroups.com",
    "published": "2021-10-06T23:15:06.977",
    "lastModified": "2023-11-22T21:18:23.860",
    "vulnStatus": "Analyzed",
    "descriptions": [
      {
        "lang": "en",
        "value": "Jenkins Git Plugin 4.8.2 and earlier does not escape the Git SHA-1 checksum parameters provided to commit notifications when displaying them in a build cause, resulting in a stored cross-site scripting (XSS) vulnerability."
      },
      {
        "lang": "es",
        "value": "El plugin Git de Jenkins versiones 4.8.2 y anteriores, no escapa a los parámetros de suma de comprobación Git SHA-1 proporcionados a las notificaciones de commit cuando se muestran en una causa de construcción, resultando en una vulnerabilidad de tipo cross-site scripting (XSS) almacenado"
      }
    ],
    "metrics": {
      "cvssMetricV31": [
        {
          "source": "nvd@nist.gov",
          "type": "Primary",
          "cvssData": {
            "attackComplexity": "LOW",
            "attackVector": "NETWORK",
            "availabilityImpact": "NONE",
            "baseScore": 6.1,
            "baseSeverity": "MEDIUM",
            "confidentialityImpact": "LOW",
            "integrityImpact": "LOW",
            "privilegesRequired": "NONE",
            "scope": "CHANGED",
            "userInteraction": "REQUIRED",
            "vectorString": "CVSS:3.1/AV:N/AC:L/PR:N/UI:R/S:C/C:L/I:L/A:N",
            "version": "3.1"
          },
          "exploitabilityScore": 2.8,
          "impactScore": 2.7
        }
      ],
      "cvssMetricV30": null,
      "cvssMetricV2": [
        {
          "source": "nvd@nist.gov",
          "type": "Primary",
          "cvssData": {
            "accessComplexity": "MEDIUM",
            "accessVector": "NETWORK",
            "authentication": "NONE",
            "availabilityImpact": "NONE",
            "baseScore": 4.3,
            "confidentialityImpact": "NONE",
            "integrityImpact": "PARTIAL",
            "vectorString": "AV:N/AC:M/Au:N/C:N/I:P/A:N",
            "version": "2.0"
          },
          "baseSeverity": "MEDIUM",
          "exploitabilityScore": 8.6,
          "impactScore": 2.9,
          "acInsufInfo": false,
          "obtainAllPrivilege": false,
          "obtainUserPrivilege": false,
          "obtainOtherPrivilege": false,
          "userInteractionRequired": true
        }
      ]
    },
    "weaknesses": [
      {
        "source": "nvd@nist.gov",
        "type": "Primary",
        "description": [
          {
            "lang": "en",
            "value": "CWE-116"
          }
        ]
      }
    ],
    "configurations": [
      {
        "nodes": [
          {
            "operator": "OR",
            "negate": false,
            "cpeMatch": [
              {
                "vulnerable": true,
                "criteria": "cpe:2.3:a:jenkins:git:*:*:*:*:*:jenkins:*:*",
                "matchCriteriaId": "0FF494B4-1102-4B55-8842-6D07058B3D2D",
                "versionEndIncluding": "4.8.2"
              }
            ]
          }
        ]
      }
    ],
    "references": [
      {
        "url": "http://www.openwall.com/lists/oss-security/2021/10/06/1",
        "source": "jenkinsci-cert@googlegroups.com",
        "tags": [
          "Mailing List",
          "Third Party Advisory"
        ]
      },
      {
        "url": "https://www.jenkins.io/security/advisory/2021-10-06/#SECURITY-2499",
        "source": "jenkinsci-cert@googlegroups.com",
        "tags": [
          "Vendor Advisory"
        ]
      }
    ],
    "data_type": "MITRE",
    "data_format": "CVE",
    "data_version": "4.0",
    "CVE_data_meta": {
      "ASSIGNER": "jenkinsci-cert@googlegroups.com",
      "ID": "CVE-2021-21684"
    },
    "problemtype": {
      "problemtype_data": [
        {
          "description": [
            {
              "lang": "en",
              "value": "CWE-116"
            }
          ]
        }
      ]
    },
    "description": {
      "description_data": [
        {
          "lang": "en",
          "value": "Jenkins Git Plugin 4.8.2 and earlier does not escape the Git SHA-1 checksum parameters provided to commit notifications when displaying them in a build cause, resulting in a stored cross-site scripting (XSS) vulnerability."
        },
        {
          "lang": "es",
          "value": "El plugin Git de Jenkins versiones 4.8.2 y anteriores, no escapa a los parámetros de suma de comprobación Git SHA-1 proporcionados a las notificaciones de commit cuando se muestran en una causa de construcción, resultando en una vulnerabilidad de tipo cross-site scripting (XSS) almacenado"
        }
      ]
    }
  },
  "configurations": {
    "CVE_data_version": "4.0",
    "nodes": [
      {
        "operator": "OR",
        "cpe_match": [
          {
            "vulnerable": true,
            "cpe23Uri": "cpe:2.3:a:jenkins:git:*:*:*:*:*:jenkins:*:*",
            "versionEndIncluding": "4.8.2"
          }
        ]
      }
    ]
  },
  "impact": {
    "baseMetricV2": {
      "cvssV2": {
        "accessComplexity": "MEDIUM",
        "accessVector": "NETWORK",
        "authentication": "NONE",
        "availabilityImpact": "NONE",
        "baseScore": 4.3,
        "confidentialityImpact": "NONE",
        "integrityImpact": "PARTIAL",
        "vectorString": "AV:N/AC:M/Au:N/C:N/I:P/A:N",
        "version": "2.0"
      },
      "exploitabilityScore": 8.6,
      "impactScore": 2.9,
      "severity": "MEDIUM",
      "userInteractionRequired": true
    },
    "baseMetricV3": {
      "cvssV3": {
        "attackComplexity": "LOW",
        "attackVector": "NETWORK",
        "availabilityImpact": "NONE",
        "baseScore": 6.1,
        "baseSeverity": "MEDIUM",
        "confidentialityImpact": "LOW",
        "integrityImpact": "LOW",
        "privilegesRequired": "NONE",
        "scope": "CHANGED",
        "userInteraction": "REQUIRED",
        "vectorString": "CVSS:3.1/AV:N/AC:L/PR:N/UI:R/S:C/C:L/I:L/A:N",
        "version": "3.1"
      },
      "exploitabilityScore": 2.8,
      "impactScore": 2.7
    }
  },
  "publicationDate": "2021-10-06T23:15:06.977",
  "lastModifiedDate": "2023-11-22T21:18:23.860"
}
