{
  "cve": {
    "id": "CVE-2022-0778",
    "sourceIdentifier": "openssl-security@openssl.org",
    "published": "2022-03-15T17:15:08.513",
    "lastModified": "2024-06-21T19:15:21.473",
    "vulnStatus": "Modified",
    "descriptions": [
      {
        "lang": "en",
        "value": "The BN_mod_sqrt() function, which computes a modular square root, contains a bug that can cause it to loop forever for non-prime moduli. Internally this function is used when parsing certificates that contain elliptic curve public keys in compressed form or explicit elliptic curve parameters with a base point encoded in compressed form. It is possible to trigger the infinite loop by crafting a certificate that has invalid explicit curve parameters. Since certificate parsing happens prior to verification of the certificate signature, any process that parses an externally supplied certificate may thus be subject to a denial of service attack. The infinite loop can also be reached when parsing crafted private keys as they can contain explicit elliptic curve parameters. Thus vulnerable situations include: - TLS clients consuming server certificates - TLS servers consuming client certificates - Hosting providers taking certificates or private keys from customers - Certificate authorities parsing certification requests from subscribers - Anything else which parses ASN.1 elliptic curve parameters Also any other applications that use the BN_mod_sqrt() where the attacker can control the parameter values are vulnerable to this DoS issue. In the OpenSSL 1.0.2 version the public key is not parsed during initial parsing of the certificate which makes it slightly harder to trigger the infinite loop. However any operation which requires the public key from the certificate will trigger the infinite loop. In particular the attacker can use a self-signed certificate to trigger the loop during verification of the certificate signature. This issue affects OpenSSL versions 1.0.2, 1.1.1 and 3.0. It was addressed in the releases of 1.1.1n and 3.0.2 on the 15th March 2022. Fixed in OpenSSL 3.0.2 (Affected 3.0.0,3.0.1). Fixed in OpenSSL 1.1.1n (Affected 1.1.1-1.1.1m). Fixed in OpenSSL 1.0.2zd (Affected 1.0.2-1.0.2zc)."
      },
      {
        "lang": "es",
        "value": "La función BN_mod_sqrt(), que calcula una raíz cuadrada modular, contiene un error que puede causar un bucle eterno para módulos no primos. Internamente, esta función es usado cuando son analizados certificados que contienen claves públicas de curva elíptica en forma comprimida o parámetros de curva elíptica explícitos con un punto base codificado en forma comprimida. Es posible desencadenar el bucle infinito si es diseñado un certificado con parámetros de curva explícitos no válidos. Dado que el análisis del certificado es realizado antes de la verificación de la firma del certificado, cualquier proceso que analice un certificado suministrado externamente puede ser objeto de un ataque de denegación de servicio. El bucle infinito también puede alcanzarse cuando son analizadas claves privadas diseñadas, ya que pueden contener parámetros explícitos de la curva elíptica. Por lo tanto, las situaciones vulnerables incluyen: - Clientes TLS que consumen certificados de servidor - Servidores TLS que consumen certificados de cliente - Proveedores de hosting que toman certificados o claves privadas de clientes - Autoridades de certificación que analizan peticiones de certificación de suscriptores - Cualquier otra cosa que analice parámetros de curva elíptica ASN.1 También cualquier otra aplicación que utilice BN_mod_sqrt() donde el atacante pueda controlar los valores de los parámetros es vulnerable a este problema de DoS. En OpenSSL versión 1.0.2, la clave pública no es analizada durante el análisis inicial del certificado, lo que dificulta ligeramente la activación del bucle infinito. Sin embargo, cualquier operación que requiera la clave pública del certificado desencadenará el bucle infinito. En particular, el atacante puede usar un certificado autofirmado para desencadenar el bucle durante la verificación de la firma del certificado. Este problema afecta a OpenSSL versiones 1.0.2, 1.1.1 y 3.0. Fue abordado en las versiones 1.1.1n y 3.0.2 del 15 de marzo de 2022. Corregido en OpenSSL versión 3.0.2 (Afectado 3.0.0,3.0.1). Corregido en OpenSSL versión 1.1.1n (Afectado 1.1.1-1.1.1m). Corregido en OpenSSL versión 1.0.2zd (Afectado 1.0.2-1.0.2zc)"
      }
    ],
    "metrics": {
      "cvssMetricV31": [
        {
          "source": "nvd@nist.gov",
          "type": "Primary",
          "cvssData": {
            "attackComplexity": "LOW",
            "attackVector": "NETWORK",
            "availabilityImpact": "HIGH",
            "baseScore": 7.5,
            "baseSeverity": "HIGH",
            "confidentialityImpact": "NONE",
            "integrityImpact": "NONE",
            "privilegesRequired": "NONE",
            "scope": "UNCHANGED",
            "userInteraction": "NONE",
            "vectorString": "CVSS:3.1/AV:N/AC:L/PR:N/UI:N/S:U/C:N/I:N/A:H",
            "version": "3.1"
          },
          "exploitabilityScore": 3.9,
          "impactScore": 3.6
        }
      ],
      "cvssMetricV30": null,
      "cvssMetricV2": [
        {
          "source": "nvd@nist.gov",
          "type": "Primary",
          "cvssData": {
            "accessComplexity": "LOW",
            "accessVector": "NETWORK",
            "authentication": "NONE",
            "availabilityImpact": "PARTIAL",
            "baseScore": 5,
            "confidentialityImpact": "NONE",
            "integrityImpact": "NONE",
            "vectorString": "AV:N/AC:L/Au:N/C:N/I:N/A:P",
            "version": "2.0"
          },
          "baseSeverity": "MEDIUM",
          "exploitabilityScore": 10,
          "impactScore": 2.9,
          "acInsufInfo": false,
          "obtainAllPrivilege": false,
          "obtainUserPrivilege": false,
          "obtainOtherPrivilege": false,
          "userInteractionRequired": false
        }
      ]
    },
    "weaknesses": [
      {
        "source": "nvd@nist.gov",
        "type": "Primary",
        "description": [
          {
            "lang": "en",
            "value": "CWE-835"
          }
        ]
      }
    ],
    "configurations": [
      {
        "nodes": [
          {
            "operator": "OR",
            "negate": false,
            "cpeMatch": [
              {
                "vulnerable": true,
                "criteria": "cpe:2.3:a:openssl:openssl:*:*:*:*:*:*:*:*",
                "matchCriteriaId": "F3BC593C-D7BB-42A8-9488-BE910A8C3B68",
                "versionStartIncluding": "1.0.2",
                "versionEndExcluding": "1.0.2zd"
              },
              {
                "vulnerable": true,
                "criteria": "cpe:2.3:a:openssl:openssl:*:*:*:*:*:*:*:*",
                "matchCriteriaId": "16D7B14C-9D04-40AC-9FCE-73D3DF468DB2",
                "versionStartIncluding": "1.1.0",
                "versionEndExcluding": "1.1.1n"
              },
              {
                "vulnerable": true,
                "criteria": "cpe:2.3:a:openssl:openssl:*:*:*:*:*:*:*:*",
                "matchCriteriaId": "E7225F27-E0BC-4716-AF68-8D68EE90F7CE",
                "versionStartIncluding": "3.0.0",
                "versionEndExcluding": "3.0.2"
              }
            ]
          }
        ]
      },
      {
        "nodes": [
          {
            "operator": "OR",
            "negate": false,
            "cpeMatch": [
              {
                "vulnerable": true,
                "criteria": "cpe:2.3:o:debian:debian_linux:9.0:*:*:*:*:*:*:*",
                "matchCriteriaId": "DEECE5FC-CACF-4496-A3E7-164736409252"
              },
              {
                "vulnerable": true,
                "criteria": "cpe:2.3:o:debian:debian_linux:10.0:*:*:*:*:*:*:*",
                "matchCriteriaId": "07B237A9-69A3-4A9C-9DA0-4E06BD37AE73"
              },
              {
                "vulnerable": true,
                "criteria": "cpe:2.3:o:debian:debian_linux:11.0:*:*:*:*:*:*:*",
                "matchCriteriaId": "FA6FEEC2-9F11-4643-8827-749718254FED"
              }
            ]
          }
        ]
      },
      {
        "nodes": [
          {
            "operator": "OR",
            "negate": false,
            "cpeMatch": [
              {
                "vulnerable": true,
                "criteria": "cpe:2.3:a:netapp:cloud_volumes_ontap_mediator:-:*:*:*:*:*:*:*",
                "matchCriteriaId": "280AA828-6FA9-4260-8EC1-019423B966E1"
              },
              {
                "vulnerable": true,
                "criteria": "cpe:2.3:a:netapp:clustered_data_ontap:-:*:*:*:*:*:*:*",
                "matchCriteriaId": "1FE996B1-6951-4F85-AA58-B99A379D2163"
              },
              {
                "vulnerable": true,
                "criteria": "cpe:2.3:a:netapp:clustered_data_ontap_antivirus_connector:-:*:*:*:*:*:*:*",
                "matchCriteriaId": "62347994-1353-497C-9C4A-D5D8D95F67E8"
              },
              {
                "vulnerable": true,
                "criteria": "cpe:2.3:a:netapp:santricity_smi-s_provider:-:*:*:*:*:*:*:*",
                "matchCriteriaId": "361B791A-D336-4431-8F68-8135BEFFAEA2"
              },
              {
                "vulnerable": true,
                "criteria": "cpe:2.3:a:netapp:storagegrid:-:*:*:*:*:*:*:*",
                "matchCriteriaId": "8ADFF451-740F-4DBA-BD23-3881945D3E40"
              }
            ]
          }
        ]
      },
      {
        "nodes": [
          {
            "operator": "OR",
            "negate": false,
            "cpeMatch": [
              {
                "vulnerable": true,
                "criteria": "cpe:2.3:o:netapp:a250_firmware:-:*:*:*:*:*:*:*",
                "matchCriteriaId": "1236B66D-EB11-4324-929F-E2B86683C3C7"
              }
            ]
          },
          {
            "operator": "OR",
            "negate": false,
            "cpeMatch": [
              {
                "vulnerable": false,
                "criteria": "cpe:2.3:h:netapp:a250:-:*:*:*:*:*:*:*",
                "matchCriteriaId": "281DFC67-46BB-4FC2-BE03-3C65C9311F65"
              }
            ]
          }
        ]
      },
      {
        "nodes": [
          {
            "operator": "OR",
            "negate": false,
            "cpeMatch": [
              {
                "vulnerable": true,
                "criteria": "cpe:2.3:o:netapp:500f_firmware:-:*:*:*:*:*:*:*",
                "matchCriteriaId": "ECF32BB1-9A58-4821-AE49-5D5C8200631F"
              }
            ]
          },
          {
            "operator": "OR",
            "negate": false,
            "cpeMatch": [
              {
                "vulnerable": false,
                "criteria": "cpe:2.3:h:netapp:500f:-:*:*:*:*:*:*:*",
                "matchCriteriaId": "F21DE67F-CDFD-4D36-9967-633CD0240C6F"
              }
            ]
          }
        ]
      },
      {
        "nodes": [
          {
            "operator": "OR",
            "negate": false,
            "cpeMatch": [
              {
                "vulnerable": true,
                "criteria": "cpe:2.3:o:fedoraproject:fedora:34:*:*:*:*:*:*:*",
                "matchCriteriaId": "A930E247-0B43-43CB-98FF-6CE7B8189835"
              },
              {
                "vulnerable": true,
                "criteria": "cpe:2.3:o:fedoraproject:fedora:36:*:*:*:*:*:*:*",
                "matchCriteriaId": "5C675112-476C-4D7C-BCB9-A2FB2D0BC9FD"
              }
            ]
          }
        ]
      },
      {
        "nodes": [
          {
            "operator": "OR",
            "negate": false,
            "cpeMatch": [
              {
                "vulnerable": true,
                "criteria": "cpe:2.3:a:tenable:nessus:*:*:*:*:*:*:*:*",
                "matchCriteriaId": "1188273E-D496-41A9-AE16-75C0EB70EFB2",
                "versionEndExcluding": "8.15.4"
              },
              {
                "vulnerable": true,
                "criteria": "cpe:2.3:a:tenable:nessus:*:*:*:*:*:*:*:*",
                "matchCriteriaId": "644DD241-261E-41A3-86B5-C0834502EA81",
                "versionStartIncluding": "10.0.0",
                "versionEndExcluding": "10.1.2"
              }
            ]
          }
        ]
      },
      {
        "nodes": [
          {
            "operator": "OR",
            "negate": false,
            "cpeMatch": [
              {
                "vulnerable": true,
                "criteria": "cpe:2.3:a:mariadb:mariadb:*:*:*:*:*:*:*:*",
                "matchCriteriaId": "49CFE4A3-DDFC-4801-8C68-510EB5CFBC36",
                "versionStartIncluding": "10.2.0",
                "versionEndExcluding": "10.2.42"
              },
              {
                "vulnerable": true,
                "criteria": "cpe:2.3:a:mariadb:mariadb:*:*:*:*:*:*:*:*",
                "matchCriteriaId": "F8EB13E9-AFD7-4E82-A471-61201460CAC4",
                "versionStartIncluding": "10.3.0",
                "versionEndExcluding": "10.3.33"
              },
              {
                "vulnerable": true,
                "criteria": "cpe:2.3:a:mariadb:mariadb:*:*:*:*:*:*:*:*",
                "matchCriteriaId": "3EFE42EF-DB07-4DD4-A40C-6DD6A7D1E6DC",
                "versionStartIncluding": "10.4.0",
                "versionEndExcluding": "10.4.23"
              },
              {
                "vulnerable": true,
                "criteria": "cpe:2.3:a:mariadb:mariadb:*:*:*:*:*:*:*:*",
                "matchCriteriaId": "E3C63CE6-6B86-4C48-8D30-DC74CA83C5EC",
                "versionStartIncluding": "10.5.0",
                "versionEndExcluding": "10.5.14"
              },
              {
                "vulnerable": true,
                "criteria": "cpe:2.3:a:mariadb:mariadb:*:*:*:*:*:*:*:*",
                "matchCriteriaId": "09ADA35C-125F-4970-ACB7-36A9CC3516BF",
                "versionStartIncluding": "10.6.0",
                "versionEndExcluding": "10.6.6"
              },
              {
                "vulnerable": true,
                "criteria": "cpe:2.3:a:mariadb:mariadb:*:*:*:*:*:*:*:*",
                "matchCriteriaId": "E0435104-B0F9-4997-A769-36821689DF45",
                "versionStartIncluding": "10.7.0",
                "versionEndExcluding": "10.7.2"
              }
            ]
          }
        ]
      },
      {
        "nodes": [
          {
            "operator": "OR",
            "negate": false,
            "cpeMatch": [
              {
                "vulnerable": true,
                "criteria": "cpe:2.3:a:nodejs:node.js:*:*:*:*:-:*:*:*",
                "matchCriteriaId": "564ED5C8-50D7-413A-B88E-E62B6C07336A",
                "versionStartIncluding": "12.0.0",
                "versionEndIncluding": "12.12.0"
              },
              {
                "vulnerable": true,
                "criteria": "cpe:2.3:a:nodejs:node.js:*:*:*:*:lts:*:*:*",
                "matchCriteriaId": "274A9803-2997-4E65-BDB0-8B5C23120CD1",
                "versionStartIncluding": "12.13.0",
                "versionEndExcluding": "12.22.11"
              },
              {
                "vulnerable": true,
                "criteria": "cpe:2.3:a:nodejs:node.js:*:*:*:*:-:*:*:*",
                "matchCriteriaId": "05678B4E-5F27-4096-8E9B-38B84A7E7793",
                "versionStartExcluding": "14.0.0",
                "versionEndIncluding": "14.14.0"
              },
              {
                "vulnerable": true,
                "criteria": "cpe:2.3:a:nodejs:node.js:*:*:*:*:lts:*:*:*",
                "matchCriteriaId": "CECEE1EE-B2A2-476B-82AE-48DFF6F1729A",
                "versionStartIncluding": "14.15.0",
                "versionEndExcluding": "14.19.1"
              },
              {
                "vulnerable": true,
                "criteria": "cpe:2.3:a:nodejs:node.js:*:*:*:*:-:*:*:*",
                "matchCriteriaId": "DC9C8402-7102-4BCF-8A49-CFDF1C59B92F",
                "versionStartExcluding": "16.0.0",
                "versionEndIncluding": "16.12.0"
              },
              {
                "vulnerable": true,
                "criteria": "cpe:2.3:a:nodejs:node.js:*:*:*:*:lts:*:*:*",
                "matchCriteriaId": "3DF34038-6987-4196-B5E7-FF5656D1EE5A",
                "versionStartIncluding": "16.13.0",
                "versionEndExcluding": "16.14.2"
              },
              {
                "vulnerable": true,
                "criteria": "cpe:2.3:a:nodejs:node.js:*:*:*:*:-:*:*:*",
                "matchCriteriaId": "0AD8D8BB-702C-4FDF-A0A2-872744B8BF68",
                "versionStartExcluding": "17.0.0",
                "versionEndExcluding": "17.7.2"
              }
            ]
          }
        ]
      }
    ],
    "references": [
      {
        "url": "http://packetstormsecurity.com/files/167344/OpenSSL-1.0.2-1.1.1-3.0-BN_mod_sqrt-Infinite-Loop.html",
        "source": "openssl-security@openssl.org",
        "tags": [
          "Third Party Advisory",
          "VDB Entry"
        ]
      },
      {
        "url": "http://seclists.org/fulldisclosure/2022/May/33",
        "source": "openssl-security@openssl.org",
        "tags": [
          "Mailing List",
          "Third Party Advisory"
        ]
      },
      {
        "url": "http://seclists.org/fulldisclosure/2022/May/35",
        "source": "openssl-security@openssl.org",
        "tags": [
          "Mailing List",
          "Third Party Advisory"
        ]
      },
      {
        "url": "http://seclists.org/fulldisclosure/2022/May/38",
        "source": "openssl-security@openssl.org",
        "tags": [
          "Mailing List",
          "Third Party Advisory"
        ]
      },
      {
        "url": "https://cert-portal.siemens.com/productcert/pdf/ssa-712929.pdf",
        "source": "openssl-security@openssl.org",
        "tags": [
          "Third Party Advisory"
        ]
      },
      {
        "url": "https://git.openssl.org/gitweb/?p=openssl.git%3Ba=commitdiff%3Bh=3118eb64934499d93db3230748a452351d1d9a65",
        "source": "openssl-security@openssl.org"
      },
      {
        "url": "https://git.openssl.org/gitweb/?p=openssl.git%3Ba=commitdiff%3Bh=380085481c64de749a6dd25cdf0bcf4360b30f83",
        "source": "openssl-security@openssl.org"
      },
      {
        "url": "https://git.openssl.org/gitweb/?p=openssl.git%3Ba=commitdiff%3Bh=a466912611aa6cbdf550cd10601390e587451246",
        "source": "openssl-security@openssl.org"
      },
      {
        "url": "https://lists.debian.org/debian-lts-announce/2022/03/msg00023.html",
        "source": "openssl-security@openssl.org",
        "tags": [
          "Mailing List",
          "Third Party Advisory"
        ]
      },
      {
        "url": "https://lists.debian.org/debian-lts-announce/2022/03/msg00024.html",
        "source": "openssl-security@openssl.org",
        "tags": [
          "Mailing List",
          "Third Party Advisory"
        ]
      },
      {
        "url": "https://lists.fedoraproject.org/archives/list/package-announce%40lists.fedoraproject.org/message/323SNN6ZX7PRJJWP2BUAFLPUAE42XWLZ/",
        "source": "openssl-security@openssl.org"
      },
      {
        "url": "https://lists.fedoraproject.org/archives/list/package-announce%40lists.fedoraproject.org/message/GDB3GQVJPXJE7X5C5JN6JAA4XUDWD6E6/",
        "source": "openssl-security@openssl.org"
      },
      {
        "url": "https://lists.fedoraproject.org/archives/list/package-announce%40lists.fedoraproject.org/message/W6K3PR542DXWLEFFMFIDMME4CWMHJRMG/",
        "source": "openssl-security@openssl.org"
      },
      {
        "url": "https://psirt.global.sonicwall.com/vuln-detail/SNWLID-2022-0002",
        "source": "openssl-security@openssl.org",
        "tags": [
          "Third Party Advisory"
        ]
      },
      {
        "url": "https://security.gentoo.org/glsa/202210-02",
        "source": "openssl-security@openssl.org",
        "tags": [
          "Third Party Advisory"
        ]
      },
      {
        "url": "https://security.netapp.com/advisory/ntap-20220321-0002/",
        "source": "openssl-security@openssl.org",
        "tags": [
          "Third Party Advisory"
        ]
      },
      {
        "url": "https://security.netapp.com/advisory/ntap-20220429-0005/",
        "source": "openssl-security@openssl.org",
        "tags": [
          "Third Party Advisory"
        ]
      },
      {
        "url": "https://security.netapp.com/advisory/ntap-20240621-0006/",
        "source": "openssl-security@openssl.org"
      },
      {
        "url": "https://support.apple.com/kb/HT213255",
        "source": "openssl-security@openssl.org",
        "tags": [
          "Third Party Advisory"
        ]
      },
      {
        "url": "https://support.apple.com/kb/HT213256",
        "source": "openssl-security@openssl.org",
        "tags": [
          "Third Party Advisory"
        ]
      },
      {
        "url": "https://support.apple.com/kb/HT213257",
        "source": "openssl-security@openssl.org",
        "tags": [
          "Third Party Advisory"
        ]
      },
      {
        "url": "https://www.debian.org/security/2022/dsa-5103",
        "source": "openssl-security@openssl.org",
        "tags": [
          "Third Party Advisory"
        ]
      },
      {
        "url": "https://www.openssl.org/news/secadv/20220315.txt",
        "source": "openssl-security@openssl.org",
        "tags": [
          "Vendor Advisory"
        ]
      },
      {
        "url": "https://www.oracle.com/security-alerts/cpuapr2022.html",
        "source": "openssl-security@openssl.org",
        "tags": [
          "Third Party Advisory"
        ]
      },
      {
        "url": "https://www.oracle.com/security-alerts/cpujul2022.html",
        "source": "openssl-security@openssl.org",
        "tags": [
          "Third Party Advisory"
        ]
      },
      {
        "url": "https://www.tenable.com/security/tns-2022-06",
        "source": "openssl-security@openssl.org",
        "tags": [
          "Third Party Advisory"
        ]
      },
      {
        "url": "https://www.tenable.com/security/tns-2022-07",
        "source": "openssl-security@openssl.org",
        "tags": [
          "Third Party Advisory"
        ]
      },
      {
        "url": "https://www.tenable.com/security/tns-2022-08",
        "source": "openssl-security@openssl.org",
        "tags": [
          "Third Party Advisory"
        ]
      },
      {
        "url": "https://www.tenable.com/security/tns-2022-09",
        "source": "openssl-security@openssl.org",
        "tags": [
          "Third Party Advisory"
        ]
      }
    ],
    "data_type": "MITRE",
    "data_format": "CVE",
    "data_version": "4.0",
    "CVE_data_meta": {
      "ASSIGNER": "openssl-security@openssl.org",
      "ID": "CVE-2022-0778"
    },
    "problemtype": {
      "problemtype_data": [
        {
          "description": [
            {
              "lang": "en",
              "value": "CWE-835"
            }
          ]
        }
      ]
    },
    "description": {
      "description_data": [
        {
          "lang": "en",
          "value": "The BN_mod_sqrt() function, which computes a modular square root, contains a bug that can cause it to loop forever for non-prime moduli. Internally this function is used when parsing certificates that contain elliptic curve public keys in compressed form or explicit elliptic curve parameters with a base point encoded in compressed form. It is possible to trigger the infinite loop by crafting a certificate that has invalid explicit curve parameters. Since certificate parsing happens prior to verification of the certificate signature, any process that parses an externally supplied certificate may thus be subject to a denial of service attack. The infinite loop can also be reached when parsing crafted private keys as they can contain explicit elliptic curve parameters. Thus vulnerable situations include: - TLS clients consuming server certificates - TLS servers consuming client certificates - Hosting providers taking certificates or private keys from customers - Certificate authorities parsing certification requests from subscribers - Anything else which parses ASN.1 elliptic curve parameters Also any other applications that use the BN_mod_sqrt() where the attacker can control the parameter values are vulnerable to this DoS issue. In the OpenSSL 1.0.2 version the public key is not parsed during initial parsing of the certificate which makes it slightly harder to trigger the infinite loop. However any operation which requires the public key from the certificate will trigger the infinite loop. In particular the attacker can use a self-signed certificate to trigger the loop during verification of the certificate signature. This issue affects OpenSSL versions 1.0.2, 1.1.1 and 3.0. It was addressed in the releases of 1.1.1n and 3.0.2 on the 15th March 2022. Fixed in OpenSSL 3.0.2 (Affected 3.0.0,3.0.1). Fixed in OpenSSL 1.1.1n (Affected 1.1.1-1.1.1m). Fixed in OpenSSL 1.0.2zd (Affected 1.0.2-1.0.2zc)."
        },
        {
          "lang": "es",
          "value": "La función BN_mod_sqrt(), que calcula una raíz cuadrada modular, contiene un error que puede causar un bucle eterno para módulos no primos. Internamente, esta función es usado cuando son analizados certificados que contienen claves públicas de curva elíptica en forma comprimida o parámetros de curva elíptica explícitos con un punto base codificado en forma comprimida. Es posible desencadenar el bucle infinito si es diseñado un certificado con parámetros de curva explícitos no válidos. Dado que el análisis del certificado es realizado antes de la verificación de la firma del certificado, cualquier proceso que analice un certificado suministrado externamente puede ser objeto de un ataque de denegación de servicio. El bucle infinito también puede alcanzarse cuando son analizadas claves privadas diseñadas, ya que pueden contener parámetros explícitos de la curva elíptica. Por lo tanto, las situaciones vulnerables incluyen: - Clientes TLS que consumen certificados de servidor - Servidores TLS que consumen certificados de cliente - Proveedores de hosting que toman certificados o claves privadas de clientes - Autoridades de certificación que analizan peticiones de certificación de suscriptores - Cualquier otra cosa que analice parámetros de curva elíptica ASN.1 También cualquier otra aplicación que utilice BN_mod_sqrt() donde el atacante pueda controlar los valores de los parámetros es vulnerable a este problema de DoS. En OpenSSL versión 1.0.2, la clave pública no es analizada durante el análisis inicial del certificado, lo que dificulta ligeramente la activación del bucle infinito. Sin embargo, cualquier operación que requiera la clave pública del certificado desencadenará el bucle infinito. En particular, el atacante puede usar un certificado autofirmado para desencadenar el bucle durante la verificación de la firma del certificado. Este problema afecta a OpenSSL versiones 1.0.2, 1.1.1 y 3.0. Fue abordado en las versiones 1.1.1n y 3.0.2 del 15 de marzo de 2022. Corregido en OpenSSL versión 3.0.2 (Afectado 3.0.0,3.0.1). Corregido en OpenSSL versión 1.1.1n (Afectado 1.1.1-1.1.1m). Corregido en OpenSSL versión 1.0.2zd (Afectado 1.0.2-1.0.2zc)"
        }
      ]
    }
  },
  "configurations": {
    "CVE_data_version": "4.0",
    "nodes": [
      {
        "operator": "OR",
        "cpe_match": [
          {
            "vulnerable": true,
            "cpe23Uri": "cpe:2.3:a:openssl:openssl:*:*:*:*:*:*:*:*",
            "versionStartIncluding": "1.0.2",
            "versionEndExcluding": "1.0.2zd"
          },
          {
            "vulnerable": true,
            "cpe23Uri": "cpe:2.3:a:openssl:openssl:*:*:*:*:*:*:*:*",
            "versionStartIncluding": "1.1.0",
            "versionEndExcluding": "1.1.1n"
          },
          {
            "vulnerable": true,
            "cpe23Uri": "cpe:2.3:a:openssl:openssl:*:*:*:*:*:*:*:*",
            "versionStartIncluding": "3.0.0",
            "versionEndExcluding": "3.0.2"
          }
        ]
      },
      {
        "operator": "OR",
        "cpe_match": [
          {
            "vulnerable": true,
            "cpe23Uri": "cpe:2.3:o:debian:debian_linux:9.0:*:*:*:*:*:*:*"
          },
          {
            "vulnerable": true,
            "cpe23Uri": "cpe:2.3:o:debian:debian_linux:10.0:*:*:*:*:*:*:*"
          },
          {
            "vulnerable": true,
            "cpe23Uri": "cpe:2.3:o:debian:debian_linux:11.0:*:*:*:*:*:*:*"
          }
        ]
      },
      {
        "operator": "OR",
        "cpe_match": [
          {
            "vulnerable": true,
            "cpe23Uri": "cpe:2.3:a:netapp:cloud_volumes_ontap_mediator:-:*:*:*:*:*:*:*"
          },
          {
            "vulnerable": true,
            "cpe23Uri": "cpe:2.3:a:netapp:clustered_data_ontap:-:*:*:*:*:*:*:*"
          },
          {
            "vulnerable": true,
            "cpe23Uri": "cpe:2.3:a:netapp:clustered_data_ontap_antivirus_connector:-:*:*:*:*:*:*:*"
          },
          {
            "vulnerable": true,
            "cpe23Uri": "cpe:2.3:a:netapp:santricity_smi-s_provider:-:*:*:*:*:*:*:*"
          },
          {
            "vulnerable": true,
            "cpe23Uri": "cpe:2.3:a:netapp:storagegrid:-:*:*:*:*:*:*:*"
          }
        ]
      },
      {
        "operator": "OR",
        "cpe_match": [
          {
            "vulnerable": true,
            "cpe23Uri": "cpe:2.3:o:netapp:a250_firmware:-:*:*:*:*:*:*:*"
          }
        ]
      },
      {
        "operator": "OR",
        "cpe_match": [
          {
            "cpe23Uri": "cpe:2.3:h:netapp:a250:-:*:*:*:*:*:*:*"
          }
        ]
      },
      {
        "operator": "OR",
        "cpe_match": [
          {
            "vulnerable": true,
            "cpe23Uri": "cpe:2.3:o:netapp:500f_firmware:-:*:*:*:*:*:*:*"
          }
        ]
      },
      {
        "operator": "OR",
        "cpe_match": [
          {
            "cpe23Uri": "cpe:2.3:h:netapp:500f:-:*:*:*:*:*:*:*"
          }
        ]
      },
      {
        "operator": "OR",
        "cpe_match": [
          {
            "vulnerable": true,
            "cpe23Uri": "cpe:2.3:o:fedoraproject:fedora:34:*:*:*:*:*:*:*"
          },
          {
            "vulnerable": true,
            "cpe23Uri": "cpe:2.3:o:fedoraproject:fedora:36:*:*:*:*:*:*:*"
          }
        ]
      },
      {
        "operator": "OR",
        "cpe_match": [
          {
            "vulnerable": true,
            "cpe23Uri": "cpe:2.3:a:tenable:nessus:*:*:*:*:*:*:*:*",
            "versionEndExcluding": "8.15.4"
          },
          {
            "vulnerable": true,
            "cpe23Uri": "cpe:2.3:a:tenable:nessus:*:*:*:*:*:*:*:*",
            "versionStartIncluding": "10.0.0",
            "versionEndExcluding": "10.1.2"
          }
        ]
      },
      {
        "operator": "OR",
        "cpe_match": [
          {
            "vulnerable": true,
            "cpe23Uri": "cpe:2.3:a:mariadb:mariadb:*:*:*:*:*:*:*:*",
            "versionStartIncluding": "10.2.0",
            "versionEndExcluding": "10.2.42"
          },
          {
            "vulnerable": true,
            "cpe23Uri": "cpe:2.3:a:mariadb:mariadb:*:*:*:*:*:*:*:*",
            "versionStartIncluding": "10.3.0",
            "versionEndExcluding": "10.3.33"
          },
          {
            "vulnerable": true,
            "cpe23Uri": "cpe:2.3:a:mariadb:mariadb:*:*:*:*:*:*:*:*",
            "versionStartIncluding": "10.4.0",
            "versionEndExcluding": "10.4.23"
          },
          {
            "vulnerable": true,
            "cpe23Uri": "cpe:2.3:a:mariadb:mariadb:*:*:*:*:*:*:*:*",
            "versionStartIncluding": "10.5.0",
            "versionEndExcluding": "10.5.14"
          },
          {
            "vulnerable": true,
            "cpe23Uri": "cpe:2.3:a:mariadb:mariadb:*:*:*:*:*:*:*:*",
            "versionStartIncluding": "10.6.0",
            "versionEndExcluding": "10.6.6"
          },
          {
            "vulnerable": true,
            "cpe23Uri": "cpe:2.3:a:mariadb:mariadb:*:*:*:*:*:*:*:*",
            "versionStartIncluding": "10.7.0",
            "versionEndExcluding": "10.7.2"
          }
        ]
      },
      {
        "operator": "OR",
        "cpe_match": [
          {
            "vulnerable": true,
            "cpe23Uri": "cpe:2.3:a:nodejs:node.js:*:*:*:*:-:*:*:*",
            "versionStartIncluding": "12.0.0",
            "versionEndIncluding": "12.12.0"
          },
          {
            "vulnerable": true,
            "cpe23Uri": "cpe:2.3:a:nodejs:node.js:*:*:*:*:lts:*:*:*",
            "versionStartIncluding": "12.13.0",
            "versionEndExcluding": "12.22.11"
          },
          {
            "vulnerable": true,
            "cpe23Uri": "cpe:2.3:a:nodejs:node.js:*:*:*:*:-:*:*:*",
            "versionStartExcluding": "14.0.0",
            "versionEndIncluding": "14.14.0"
          },
          {
            "vulnerable": true,
            "cpe23Uri": "cpe:2.3:a:nodejs:node.js:*:*:*:*:lts:*:*:*",
            "versionStartIncluding": "14.15.0",
            "versionEndExcluding": "14.19.1"
          },
          {
            "vulnerable": true,
            "cpe23Uri": "cpe:2.3:a:nodejs:node.js:*:*:*:*:-:*:*:*",
            "versionStartExcluding": "16.0.0",
            "versionEndIncluding": "16.12.0"
          },
          {
            "vulnerable": true,
            "cpe23Uri": "cpe:2.3:a:nodejs:node.js:*:*:*:*:lts:*:*:*",
            "versionStartIncluding": "16.13.0",
            "versionEndExcluding": "16.14.2"
          },
          {
            "vulnerable": true,
            "cpe23Uri": "cpe:2.3:a:nodejs:node.js:*:*:*:*:-:*:*:*",
            "versionStartExcluding": "17.0.0",
            "versionEndExcluding": "17.7.2"
          }
        ]
      }
    ]
  },
  "impact": {
    "baseMetricV2": {
      "cvssV2": {
        "accessComplexity": "LOW",
        "accessVector": "NETWORK",
        "authentication": "NONE",
        "availabilityImpact": "PARTIAL",
        "baseScore": 5,
        "confidentialityImpact": "NONE",
        "integrityImpact": "NONE",
        "vectorString": "AV:N/AC:L/Au:N/C:N/I:N/A:P",
        "version": "2.0"
      },
      "exploitabilityScore": 10,
      "impactScore": 2.9,
      "severity": "MEDIUM"
    },
    "baseMetricV3": {
      "cvssV3": {
        "attackComplexity": "LOW",
        "attackVector": "NETWORK",
        "availabilityImpact": "HIGH",
        "baseScore": 7.5,
        "baseSeverity": "HIGH",
        "confidentialityImpact": "NONE",
        "integrityImpact": "NONE",
        "privilegesRequired": "NONE",
        "scope": "UNCHANGED",
        "userInteraction": "NONE",
        "vectorString": "CVSS:3.1/AV:N/AC:L/PR:N/UI:N/S:U/C:N/I:N/A:H",
        "version": "3.1"
      },
      "exploitabilityScore": 3.9,
      "impactScore": 3.6
    }
  },
  "publicationDate": "2022-03-15T17:15:08.513",
  "lastModifiedDate": "2024-06-21T19:15:21.473"
}
