{
  "cve": {
    "id": "CVE-2021-22922",
    "sourceIdentifier": "support@hackerone.com",
    "published": "2021-08-05T21:15:11.173",
    "lastModified": "2024-03-27T15:12:55.770",
    "vulnStatus": "Analyzed",
    "descriptions": [
      {
        "lang": "en",
        "value": "When curl is instructed to download content using the metalink feature, thecontents is verified against a hash provided in the metalink XML file.The metalink XML file points out to the client how to get the same contentfrom a set of different URLs, potentially hosted by different servers and theclient can then download the file from one or several of them. In a serial orparallel manner.If one of the servers hosting the contents has been breached and the contentsof the specific file on that server is replaced with a modified payload, curlshould detect this when the hash of the file mismatches after a completeddownload. It should remove the contents and instead try getting the contentsfrom another URL. This is not done, and instead such a hash mismatch is onlymentioned in text and the potentially malicious content is kept in the file ondisk."
      },
      {
        "lang": "es",
        "value": "Cuando es instruido a curl descargar un contenido usando la funcionalidad metalink, el contenido es comprobado con un hash proporcionado en el archivo XML metalink. El archivo XML metalink indica al cliente cómo obtener el mismo contenido de un conjunto de URLs diferentes, potencialmente alojadas en distintos servidores y el cliente puede entonces descargar el archivo de uno o varios de ellos. En una manera paralela o en serie. Si uno de los servidores que aloja el contenido ha sido violado y el contenido del archivo específico en ese servidor es reemplazado por una carga útil modificada, Curl debería detectar esto cuando el hash del archivo no coincide después de una descarga completa. Debería eliminar los contenidos y tratar de obtenerlo de otra URL. Esto no se hace, y en su lugar, tal desajuste de hash sólo se menciona en el texto y el contenido potencialmente malicioso se mantiene en el archivo en el disco"
      }
    ],
    "metrics": {
      "cvssMetricV31": [
        {
          "source": "nvd@nist.gov",
          "type": "Primary",
          "cvssData": {
            "attackComplexity": "LOW",
            "attackVector": "NETWORK",
            "availabilityImpact": "NONE",
            "baseScore": 6.5,
            "baseSeverity": "MEDIUM",
            "confidentialityImpact": "NONE",
            "integrityImpact": "HIGH",
            "privilegesRequired": "NONE",
            "scope": "UNCHANGED",
            "userInteraction": "REQUIRED",
            "vectorString": "CVSS:3.1/AV:N/AC:L/PR:N/UI:R/S:U/C:N/I:H/A:N",
            "version": "3.1"
          },
          "exploitabilityScore": 2.8,
          "impactScore": 3.6
        }
      ],
      "cvssMetricV30": null,
      "cvssMetricV2": [
        {
          "source": "nvd@nist.gov",
          "type": "Primary",
          "cvssData": {
            "accessComplexity": "MEDIUM",
            "accessVector": "NETWORK",
            "authentication": "NONE",
            "availabilityImpact": "NONE",
            "baseScore": 4.3,
            "confidentialityImpact": "NONE",
            "integrityImpact": "PARTIAL",
            "vectorString": "AV:N/AC:M/Au:N/C:N/I:P/A:N",
            "version": "2.0"
          },
          "baseSeverity": "MEDIUM",
          "exploitabilityScore": 8.6,
          "impactScore": 2.9,
          "acInsufInfo": false,
          "obtainAllPrivilege": false,
          "obtainUserPrivilege": false,
          "obtainOtherPrivilege": false,
          "userInteractionRequired": true
        }
      ]
    },
    "weaknesses": [
      {
        "source": "nvd@nist.gov",
        "type": "Primary",
        "description": [
          {
            "lang": "en",
            "value": "CWE-755"
          }
        ]
      },
      {
        "source": "support@hackerone.com",
        "type": "Secondary",
        "description": [
          {
            "lang": "en",
            "value": "CWE-840"
          }
        ]
      }
    ],
    "configurations": [
      {
        "nodes": [
          {
            "operator": "OR",
            "negate": false,
            "cpeMatch": [
              {
                "vulnerable": true,
                "criteria": "cpe:2.3:a:haxx:curl:*:*:*:*:*:*:*:*",
                "matchCriteriaId": "9900B00E-B0BA-4E8B-89EA-B66E97AC406D",
                "versionStartIncluding": "7.27.0",
                "versionEndExcluding": "7.78.0"
              }
            ]
          }
        ]
      },
      {
        "nodes": [
          {
            "operator": "OR",
            "negate": false,
            "cpeMatch": [
              {
                "vulnerable": true,
                "criteria": "cpe:2.3:o:fedoraproject:fedora:33:*:*:*:*:*:*:*",
                "matchCriteriaId": "E460AA51-FCDA-46B9-AE97-E6676AA5E194"
              }
            ]
          }
        ]
      },
      {
        "nodes": [
          {
            "operator": "OR",
            "negate": false,
            "cpeMatch": [
              {
                "vulnerable": true,
                "criteria": "cpe:2.3:a:netapp:cloud_backup:-:*:*:*:*:*:*:*",
                "matchCriteriaId": "5C2089EE-5D7F-47EC-8EA5-0F69790564C4"
              },
              {
                "vulnerable": true,
                "criteria": "cpe:2.3:a:netapp:clustered_data_ontap:-:*:*:*:*:*:*:*",
                "matchCriteriaId": "1FE996B1-6951-4F85-AA58-B99A379D2163"
              },
              {
                "vulnerable": true,
                "criteria": "cpe:2.3:a:netapp:hci_management_node:-:*:*:*:*:*:*:*",
                "matchCriteriaId": "A3C19813-E823-456A-B1CE-EC0684CE1953"
              },
              {
                "vulnerable": true,
                "criteria": "cpe:2.3:a:netapp:solidfire:-:*:*:*:*:*:*:*",
                "matchCriteriaId": "A6E9EF0C-AFA8-4F7B-9FDC-1E0F7C26E737"
              }
            ]
          }
        ]
      },
      {
        "nodes": [
          {
            "operator": "OR",
            "negate": false,
            "cpeMatch": [
              {
                "vulnerable": true,
                "criteria": "cpe:2.3:a:oracle:mysql_server:*:*:*:*:*:*:*:*",
                "matchCriteriaId": "E667933A-37EA-4BC2-9180-C3B4B7038866",
                "versionStartIncluding": "5.7.0",
                "versionEndIncluding": "5.7.35"
              },
              {
                "vulnerable": true,
                "criteria": "cpe:2.3:a:oracle:mysql_server:*:*:*:*:*:*:*:*",
                "matchCriteriaId": "709E83B4-8C66-4255-870B-2F72B37BA8C6",
                "versionStartIncluding": "8.0.0",
                "versionEndIncluding": "8.0.26"
              }
            ]
          }
        ]
      },
      {
        "nodes": [
          {
            "operator": "OR",
            "negate": false,
            "cpeMatch": [
              {
                "vulnerable": true,
                "criteria": "cpe:2.3:a:siemens:sinec_infrastructure_network_services:*:*:*:*:*:*:*:*",
                "matchCriteriaId": "B0F46497-4AB0-49A7-9453-CC26837BF253",
                "versionEndExcluding": "1.0.1.1"
              }
            ]
          }
        ]
      },
      {
        "nodes": [
          {
            "operator": "OR",
            "negate": false,
            "cpeMatch": [
              {
                "vulnerable": true,
                "criteria": "cpe:2.3:o:netapp:h300s_firmware:-:*:*:*:*:*:*:*",
                "matchCriteriaId": "6770B6C3-732E-4E22-BF1C-2D2FD610061C"
              }
            ]
          },
          {
            "operator": "OR",
            "negate": false,
            "cpeMatch": [
              {
                "vulnerable": false,
                "criteria": "cpe:2.3:h:netapp:h300s:-:*:*:*:*:*:*:*",
                "matchCriteriaId": "9F9C8C20-42EB-4AB5-BD97-212DEB070C43"
              }
            ]
          }
        ]
      },
      {
        "nodes": [
          {
            "operator": "OR",
            "negate": false,
            "cpeMatch": [
              {
                "vulnerable": true,
                "criteria": "cpe:2.3:o:netapp:h500s_firmware:-:*:*:*:*:*:*:*",
                "matchCriteriaId": "7FFF7106-ED78-49BA-9EC5-B889E3685D53"
              }
            ]
          },
          {
            "operator": "OR",
            "negate": false,
            "cpeMatch": [
              {
                "vulnerable": false,
                "criteria": "cpe:2.3:h:netapp:h500s:-:*:*:*:*:*:*:*",
                "matchCriteriaId": "E63D8B0F-006E-4801-BF9D-1C001BBFB4F9"
              }
            ]
          }
        ]
      },
      {
        "nodes": [
          {
            "operator": "OR",
            "negate": false,
            "cpeMatch": [
              {
                "vulnerable": true,
                "criteria": "cpe:2.3:o:netapp:h700s_firmware:-:*:*:*:*:*:*:*",
                "matchCriteriaId": "56409CEC-5A1E-4450-AA42-641E459CC2AF"
              }
            ]
          },
          {
            "operator": "OR",
            "negate": false,
            "cpeMatch": [
              {
                "vulnerable": false,
                "criteria": "cpe:2.3:h:netapp:h700s:-:*:*:*:*:*:*:*",
                "matchCriteriaId": "B06F4839-D16A-4A61-9BB5-55B13F41E47F"
              }
            ]
          }
        ]
      },
      {
        "nodes": [
          {
            "operator": "OR",
            "negate": false,
            "cpeMatch": [
              {
                "vulnerable": true,
                "criteria": "cpe:2.3:o:netapp:h300e_firmware:-:*:*:*:*:*:*:*",
                "matchCriteriaId": "108A2215-50FB-4074-94CF-C130FA14566D"
              }
            ]
          },
          {
            "operator": "OR",
            "negate": false,
            "cpeMatch": [
              {
                "vulnerable": false,
                "criteria": "cpe:2.3:h:netapp:h300e:-:*:*:*:*:*:*:*",
                "matchCriteriaId": "7AFC73CE-ABB9-42D3-9A71-3F5BC5381E0E"
              }
            ]
          }
        ]
      },
      {
        "nodes": [
          {
            "operator": "OR",
            "negate": false,
            "cpeMatch": [
              {
                "vulnerable": true,
                "criteria": "cpe:2.3:o:netapp:h500e_firmware:-:*:*:*:*:*:*:*",
                "matchCriteriaId": "32F0B6C0-F930-480D-962B-3F4EFDCC13C7"
              }
            ]
          },
          {
            "operator": "OR",
            "negate": false,
            "cpeMatch": [
              {
                "vulnerable": false,
                "criteria": "cpe:2.3:h:netapp:h500e:-:*:*:*:*:*:*:*",
                "matchCriteriaId": "803BC414-B250-4E3A-A478-A3881340D6B8"
              }
            ]
          }
        ]
      },
      {
        "nodes": [
          {
            "operator": "OR",
            "negate": false,
            "cpeMatch": [
              {
                "vulnerable": true,
                "criteria": "cpe:2.3:o:netapp:h700e_firmware:-:*:*:*:*:*:*:*",
                "matchCriteriaId": "0FEB3337-BFDE-462A-908B-176F92053CEC"
              }
            ]
          },
          {
            "operator": "OR",
            "negate": false,
            "cpeMatch": [
              {
                "vulnerable": false,
                "criteria": "cpe:2.3:h:netapp:h700e:-:*:*:*:*:*:*:*",
                "matchCriteriaId": "736AEAE9-782B-4F71-9893-DED53367E102"
              }
            ]
          }
        ]
      },
      {
        "nodes": [
          {
            "operator": "OR",
            "negate": false,
            "cpeMatch": [
              {
                "vulnerable": true,
                "criteria": "cpe:2.3:o:netapp:h410s_firmware:-:*:*:*:*:*:*:*",
                "matchCriteriaId": "D0B4AD8A-F172-4558-AEC6-FF424BA2D912"
              }
            ]
          },
          {
            "operator": "OR",
            "negate": false,
            "cpeMatch": [
              {
                "vulnerable": false,
                "criteria": "cpe:2.3:h:netapp:h410s:-:*:*:*:*:*:*:*",
                "matchCriteriaId": "8497A4C9-8474-4A62-8331-3FE862ED4098"
              }
            ]
          }
        ]
      },
      {
        "nodes": [
          {
            "operator": "OR",
            "negate": false,
            "cpeMatch": [
              {
                "vulnerable": true,
                "criteria": "cpe:2.3:a:splunk:universal_forwarder:*:*:*:*:*:*:*:*",
                "matchCriteriaId": "5722E753-75DE-4944-A11B-556CB299B57D",
                "versionStartIncluding": "8.2.0",
                "versionEndExcluding": "8.2.12"
              },
              {
                "vulnerable": true,
                "criteria": "cpe:2.3:a:splunk:universal_forwarder:*:*:*:*:*:*:*:*",
                "matchCriteriaId": "DC0F9351-81A4-4FEA-B6B5-6E960A933D32",
                "versionStartIncluding": "9.0.0",
                "versionEndExcluding": "9.0.6"
              },
              {
                "vulnerable": true,
                "criteria": "cpe:2.3:a:splunk:universal_forwarder:9.1.0:*:*:*:*:*:*:*",
                "matchCriteriaId": "EED24E67-2957-4C1B-8FEA-E2D2FE7B97FC"
              }
            ]
          }
        ]
      }
    ],
    "references": [
      {
        "url": "https://cert-portal.siemens.com/productcert/pdf/ssa-389290.pdf",
        "source": "support@hackerone.com",
        "tags": [
          "Patch",
          "Third Party Advisory"
        ]
      },
      {
        "url": "https://hackerone.com/reports/1213175",
        "source": "support@hackerone.com",
        "tags": [
          "Exploit",
          "Issue Tracking",
          "Third Party Advisory"
        ]
      },
      {
        "url": "https://lists.apache.org/thread.html/r61db8e7dcb56dc000a5387a88f7a473bacec5ee01b9ff3f55308aacc%40%3Cdev.kafka.apache.org%3E",
        "source": "support@hackerone.com",
        "tags": [
          "Mailing List",
          "Third Party Advisory"
        ]
      },
      {
        "url": "https://lists.apache.org/thread.html/r61db8e7dcb56dc000a5387a88f7a473bacec5ee01b9ff3f55308aacc%40%3Cusers.kafka.apache.org%3E",
        "source": "support@hackerone.com",
        "tags": [
          "Mailing List",
          "Third Party Advisory"
        ]
      },
      {
        "url": "https://lists.apache.org/thread.html/rbf4ce74b0d1fa9810dec50ba3ace0caeea677af7c27a97111c06ccb7%40%3Cdev.kafka.apache.org%3E",
        "source": "support@hackerone.com",
        "tags": [
          "Mailing List",
          "Third Party Advisory"
        ]
      },
      {
        "url": "https://lists.apache.org/thread.html/rbf4ce74b0d1fa9810dec50ba3ace0caeea677af7c27a97111c06ccb7%40%3Cusers.kafka.apache.org%3E",
        "source": "support@hackerone.com",
        "tags": [
          "Mailing List",
          "Third Party Advisory"
        ]
      },
      {
        "url": "https://lists.fedoraproject.org/archives/list/package-announce%40lists.fedoraproject.org/message/FRUCW2UVNYUDZF72DQLFQR4PJEC6CF7V/",
        "source": "support@hackerone.com",
        "tags": [
          "Mailing List",
          "Third Party Advisory"
        ]
      },
      {
        "url": "https://security.gentoo.org/glsa/202212-01",
        "source": "support@hackerone.com",
        "tags": [
          "Third Party Advisory"
        ]
      },
      {
        "url": "https://security.netapp.com/advisory/ntap-20210902-0003/",
        "source": "support@hackerone.com",
        "tags": [
          "Third Party Advisory"
        ]
      },
      {
        "url": "https://www.oracle.com/security-alerts/cpuoct2021.html",
        "source": "support@hackerone.com",
        "tags": [
          "Patch",
          "Third Party Advisory"
        ]
      }
    ],
    "data_type": "MITRE",
    "data_format": "CVE",
    "data_version": "4.0",
    "CVE_data_meta": {
      "ASSIGNER": "support@hackerone.com",
      "ID": "CVE-2021-22922"
    },
    "problemtype": {
      "problemtype_data": [
        {
          "description": [
            {
              "lang": "en",
              "value": "CWE-755"
            }
          ]
        },
        {
          "description": [
            {
              "lang": "en",
              "value": "CWE-840"
            }
          ]
        }
      ]
    },
    "description": {
      "description_data": [
        {
          "lang": "en",
          "value": "When curl is instructed to download content using the metalink feature, thecontents is verified against a hash provided in the metalink XML file.The metalink XML file points out to the client how to get the same contentfrom a set of different URLs, potentially hosted by different servers and theclient can then download the file from one or several of them. In a serial orparallel manner.If one of the servers hosting the contents has been breached and the contentsof the specific file on that server is replaced with a modified payload, curlshould detect this when the hash of the file mismatches after a completeddownload. It should remove the contents and instead try getting the contentsfrom another URL. This is not done, and instead such a hash mismatch is onlymentioned in text and the potentially malicious content is kept in the file ondisk."
        },
        {
          "lang": "es",
          "value": "Cuando es instruido a curl descargar un contenido usando la funcionalidad metalink, el contenido es comprobado con un hash proporcionado en el archivo XML metalink. El archivo XML metalink indica al cliente cómo obtener el mismo contenido de un conjunto de URLs diferentes, potencialmente alojadas en distintos servidores y el cliente puede entonces descargar el archivo de uno o varios de ellos. En una manera paralela o en serie. Si uno de los servidores que aloja el contenido ha sido violado y el contenido del archivo específico en ese servidor es reemplazado por una carga útil modificada, Curl debería detectar esto cuando el hash del archivo no coincide después de una descarga completa. Debería eliminar los contenidos y tratar de obtenerlo de otra URL. Esto no se hace, y en su lugar, tal desajuste de hash sólo se menciona en el texto y el contenido potencialmente malicioso se mantiene en el archivo en el disco"
        }
      ]
    }
  },
  "configurations": {
    "CVE_data_version": "4.0",
    "nodes": [
      {
        "operator": "OR",
        "cpe_match": [
          {
            "vulnerable": true,
            "cpe23Uri": "cpe:2.3:a:haxx:curl:*:*:*:*:*:*:*:*",
            "versionStartIncluding": "7.27.0",
            "versionEndExcluding": "7.78.0"
          }
        ]
      },
      {
        "operator": "OR",
        "cpe_match": [
          {
            "vulnerable": true,
            "cpe23Uri": "cpe:2.3:o:fedoraproject:fedora:33:*:*:*:*:*:*:*"
          }
        ]
      },
      {
        "operator": "OR",
        "cpe_match": [
          {
            "vulnerable": true,
            "cpe23Uri": "cpe:2.3:a:netapp:cloud_backup:-:*:*:*:*:*:*:*"
          },
          {
            "vulnerable": true,
            "cpe23Uri": "cpe:2.3:a:netapp:clustered_data_ontap:-:*:*:*:*:*:*:*"
          },
          {
            "vulnerable": true,
            "cpe23Uri": "cpe:2.3:a:netapp:hci_management_node:-:*:*:*:*:*:*:*"
          },
          {
            "vulnerable": true,
            "cpe23Uri": "cpe:2.3:a:netapp:solidfire:-:*:*:*:*:*:*:*"
          }
        ]
      },
      {
        "operator": "OR",
        "cpe_match": [
          {
            "vulnerable": true,
            "cpe23Uri": "cpe:2.3:a:oracle:mysql_server:*:*:*:*:*:*:*:*",
            "versionStartIncluding": "5.7.0",
            "versionEndIncluding": "5.7.35"
          },
          {
            "vulnerable": true,
            "cpe23Uri": "cpe:2.3:a:oracle:mysql_server:*:*:*:*:*:*:*:*",
            "versionStartIncluding": "8.0.0",
            "versionEndIncluding": "8.0.26"
          }
        ]
      },
      {
        "operator": "OR",
        "cpe_match": [
          {
            "vulnerable": true,
            "cpe23Uri": "cpe:2.3:a:siemens:sinec_infrastructure_network_services:*:*:*:*:*:*:*:*",
            "versionEndExcluding": "1.0.1.1"
          }
        ]
      },
      {
        "operator": "OR",
        "cpe_match": [
          {
            "vulnerable": true,
            "cpe23Uri": "cpe:2.3:o:netapp:h300s_firmware:-:*:*:*:*:*:*:*"
          }
        ]
      },
      {
        "operator": "OR",
        "cpe_match": [
          {
            "cpe23Uri": "cpe:2.3:h:netapp:h300s:-:*:*:*:*:*:*:*"
          }
        ]
      },
      {
        "operator": "OR",
        "cpe_match": [
          {
            "vulnerable": true,
            "cpe23Uri": "cpe:2.3:o:netapp:h500s_firmware:-:*:*:*:*:*:*:*"
          }
        ]
      },
      {
        "operator": "OR",
        "cpe_match": [
          {
            "cpe23Uri": "cpe:2.3:h:netapp:h500s:-:*:*:*:*:*:*:*"
          }
        ]
      },
      {
        "operator": "OR",
        "cpe_match": [
          {
            "vulnerable": true,
            "cpe23Uri": "cpe:2.3:o:netapp:h700s_firmware:-:*:*:*:*:*:*:*"
          }
        ]
      },
      {
        "operator": "OR",
        "cpe_match": [
          {
            "cpe23Uri": "cpe:2.3:h:netapp:h700s:-:*:*:*:*:*:*:*"
          }
        ]
      },
      {
        "operator": "OR",
        "cpe_match": [
          {
            "vulnerable": true,
            "cpe23Uri": "cpe:2.3:o:netapp:h300e_firmware:-:*:*:*:*:*:*:*"
          }
        ]
      },
      {
        "operator": "OR",
        "cpe_match": [
          {
            "cpe23Uri": "cpe:2.3:h:netapp:h300e:-:*:*:*:*:*:*:*"
          }
        ]
      },
      {
        "operator": "OR",
        "cpe_match": [
          {
            "vulnerable": true,
            "cpe23Uri": "cpe:2.3:o:netapp:h500e_firmware:-:*:*:*:*:*:*:*"
          }
        ]
      },
      {
        "operator": "OR",
        "cpe_match": [
          {
            "cpe23Uri": "cpe:2.3:h:netapp:h500e:-:*:*:*:*:*:*:*"
          }
        ]
      },
      {
        "operator": "OR",
        "cpe_match": [
          {
            "vulnerable": true,
            "cpe23Uri": "cpe:2.3:o:netapp:h700e_firmware:-:*:*:*:*:*:*:*"
          }
        ]
      },
      {
        "operator": "OR",
        "cpe_match": [
          {
            "cpe23Uri": "cpe:2.3:h:netapp:h700e:-:*:*:*:*:*:*:*"
          }
        ]
      },
      {
        "operator": "OR",
        "cpe_match": [
          {
            "vulnerable": true,
            "cpe23Uri": "cpe:2.3:o:netapp:h410s_firmware:-:*:*:*:*:*:*:*"
          }
        ]
      },
      {
        "operator": "OR",
        "cpe_match": [
          {
            "cpe23Uri": "cpe:2.3:h:netapp:h410s:-:*:*:*:*:*:*:*"
          }
        ]
      },
      {
        "operator": "OR",
        "cpe_match": [
          {
            "vulnerable": true,
            "cpe23Uri": "cpe:2.3:a:splunk:universal_forwarder:*:*:*:*:*:*:*:*",
            "versionStartIncluding": "8.2.0",
            "versionEndExcluding": "8.2.12"
          },
          {
            "vulnerable": true,
            "cpe23Uri": "cpe:2.3:a:splunk:universal_forwarder:*:*:*:*:*:*:*:*",
            "versionStartIncluding": "9.0.0",
            "versionEndExcluding": "9.0.6"
          },
          {
            "vulnerable": true,
            "cpe23Uri": "cpe:2.3:a:splunk:universal_forwarder:9.1.0:*:*:*:*:*:*:*"
          }
        ]
      }
    ]
  },
  "impact": {
    "baseMetricV2": {
      "cvssV2": {
        "accessComplexity": "MEDIUM",
        "accessVector": "NETWORK",
        "authentication": "NONE",
        "availabilityImpact": "NONE",
        "baseScore": 4.3,
        "confidentialityImpact": "NONE",
        "integrityImpact": "PARTIAL",
        "vectorString": "AV:N/AC:M/Au:N/C:N/I:P/A:N",
        "version": "2.0"
      },
      "exploitabilityScore": 8.6,
      "impactScore": 2.9,
      "severity": "MEDIUM",
      "userInteractionRequired": true
    },
    "baseMetricV3": {
      "cvssV3": {
        "attackComplexity": "LOW",
        "attackVector": "NETWORK",
        "availabilityImpact": "NONE",
        "baseScore": 6.5,
        "baseSeverity": "MEDIUM",
        "confidentialityImpact": "NONE",
        "integrityImpact": "HIGH",
        "privilegesRequired": "NONE",
        "scope": "UNCHANGED",
        "userInteraction": "REQUIRED",
        "vectorString": "CVSS:3.1/AV:N/AC:L/PR:N/UI:R/S:U/C:N/I:H/A:N",
        "version": "3.1"
      },
      "exploitabilityScore": 2.8,
      "impactScore": 3.6
    }
  },
  "publicationDate": "2021-08-05T21:15:11.173",
  "lastModifiedDate": "2024-03-27T15:12:55.770"
}
