{
  "cve": {
    "id": "CVE-2021-32066",
    "sourceIdentifier": "cve@mitre.org",
    "published": "2021-08-01T19:15:07.697",
    "lastModified": "2024-01-24T05:15:10.040",
    "vulnStatus": "Modified",
    "descriptions": [
      {
        "lang": "en",
        "value": "An issue was discovered in Ruby through 2.6.7, 2.7.x through 2.7.3, and 3.x through 3.0.1. Net::IMAP does not raise an exception when StartTLS fails with an an unknown response, which might allow man-in-the-middle attackers to bypass the TLS protections by leveraging a network position between the client and the registry to block the StartTLS command, aka a \"StartTLS stripping attack.\""
      },
      {
        "lang": "es",
        "value": "Se ha detectado un problema en Ruby versiones hasta 2.6.7, versiones 2.7.x hasta 2.7.3, y versiones 3.x hasta 3.0.1. Net::IMAP no lanza una excepción cuando StartTLS falla con una respuesta desconocida, lo que podría permitir a atacantes tipo man-in-the-middle omitir las protecciones TLS, al aprovechar una posición de red entre el cliente y el registro para bloquear el comando StartTLS, también se conoce como \"StartTLS stripping attack\""
      }
    ],
    "metrics": {
      "cvssMetricV31": [
        {
          "source": "nvd@nist.gov",
          "type": "Primary",
          "cvssData": {
            "attackComplexity": "HIGH",
            "attackVector": "NETWORK",
            "availabilityImpact": "NONE",
            "baseScore": 7.4,
            "baseSeverity": "HIGH",
            "confidentialityImpact": "HIGH",
            "integrityImpact": "HIGH",
            "privilegesRequired": "NONE",
            "scope": "UNCHANGED",
            "userInteraction": "NONE",
            "vectorString": "CVSS:3.1/AV:N/AC:H/PR:N/UI:N/S:U/C:H/I:H/A:N",
            "version": "3.1"
          },
          "exploitabilityScore": 2.2,
          "impactScore": 5.2
        }
      ],
      "cvssMetricV30": null,
      "cvssMetricV2": [
        {
          "source": "nvd@nist.gov",
          "type": "Primary",
          "cvssData": {
            "accessComplexity": "MEDIUM",
            "accessVector": "NETWORK",
            "authentication": "NONE",
            "availabilityImpact": "NONE",
            "baseScore": 5.8,
            "confidentialityImpact": "PARTIAL",
            "integrityImpact": "PARTIAL",
            "vectorString": "AV:N/AC:M/Au:N/C:P/I:P/A:N",
            "version": "2.0"
          },
          "baseSeverity": "MEDIUM",
          "exploitabilityScore": 8.6,
          "impactScore": 4.9,
          "acInsufInfo": false,
          "obtainAllPrivilege": false,
          "obtainUserPrivilege": false,
          "obtainOtherPrivilege": false,
          "userInteractionRequired": false
        }
      ]
    },
    "weaknesses": [
      {
        "source": "nvd@nist.gov",
        "type": "Primary",
        "description": [
          {
            "lang": "en",
            "value": "CWE-755"
          }
        ]
      }
    ],
    "configurations": [
      {
        "nodes": [
          {
            "operator": "OR",
            "negate": false,
            "cpeMatch": [
              {
                "vulnerable": true,
                "criteria": "cpe:2.3:a:ruby-lang:ruby:*:*:*:*:*:*:*:*",
                "matchCriteriaId": "45D6E5FE-D60E-41D3-9FCA-00F8218377EA",
                "versionStartIncluding": "2.6.0",
                "versionEndIncluding": "2.6.7"
              },
              {
                "vulnerable": true,
                "criteria": "cpe:2.3:a:ruby-lang:ruby:*:*:*:*:*:*:*:*",
                "matchCriteriaId": "D29D5386-D306-4CB4-82EC-678319F0101D",
                "versionStartIncluding": "2.7.0",
                "versionEndIncluding": "2.7.3"
              },
              {
                "vulnerable": true,
                "criteria": "cpe:2.3:a:ruby-lang:ruby:*:*:*:*:*:*:*:*",
                "matchCriteriaId": "528E25B8-22A4-4AAF-9582-76BCDF3705B5",
                "versionStartIncluding": "3.0.0",
                "versionEndIncluding": "3.0.1"
              }
            ]
          }
        ]
      },
      {
        "nodes": [
          {
            "operator": "OR",
            "negate": false,
            "cpeMatch": [
              {
                "vulnerable": true,
                "criteria": "cpe:2.3:a:oracle:jd_edwards_enterpriseone_tools:*:*:*:*:*:*:*:*",
                "matchCriteriaId": "D1298AA2-0103-4457-B260-F976B78468E7",
                "versionEndExcluding": "9.2.6.1"
              }
            ]
          }
        ]
      }
    ],
    "references": [
      {
        "url": "https://github.com/ruby/ruby/commit/a21a3b7d23704a01d34bd79d09dc37897e00922a",
        "source": "cve@mitre.org",
        "tags": [
          "Patch",
          "Third Party Advisory"
        ]
      },
      {
        "url": "https://hackerone.com/reports/1178562",
        "source": "cve@mitre.org",
        "tags": [
          "Exploit",
          "Patch",
          "Third Party Advisory"
        ]
      },
      {
        "url": "https://lists.debian.org/debian-lts-announce/2021/10/msg00009.html",
        "source": "cve@mitre.org",
        "tags": [
          "Third Party Advisory"
        ]
      },
      {
        "url": "https://lists.debian.org/debian-lts-announce/2023/04/msg00033.html",
        "source": "cve@mitre.org"
      },
      {
        "url": "https://security.gentoo.org/glsa/202401-27",
        "source": "cve@mitre.org"
      },
      {
        "url": "https://security.netapp.com/advisory/ntap-20210902-0004/",
        "source": "cve@mitre.org",
        "tags": [
          "Third Party Advisory"
        ]
      },
      {
        "url": "https://www.oracle.com/security-alerts/cpuapr2022.html",
        "source": "cve@mitre.org",
        "tags": [
          "Patch",
          "Third Party Advisory"
        ]
      },
      {
        "url": "https://www.ruby-lang.org/en/news/2021/07/07/starttls-stripping-in-net-imap/",
        "source": "cve@mitre.org",
        "tags": [
          "Vendor Advisory"
        ]
      }
    ],
    "data_type": "MITRE",
    "data_format": "CVE",
    "data_version": "4.0",
    "CVE_data_meta": {
      "ASSIGNER": "cve@mitre.org",
      "ID": "CVE-2021-32066"
    },
    "problemtype": {
      "problemtype_data": [
        {
          "description": [
            {
              "lang": "en",
              "value": "CWE-755"
            }
          ]
        }
      ]
    },
    "description": {
      "description_data": [
        {
          "lang": "en",
          "value": "An issue was discovered in Ruby through 2.6.7, 2.7.x through 2.7.3, and 3.x through 3.0.1. Net::IMAP does not raise an exception when StartTLS fails with an an unknown response, which might allow man-in-the-middle attackers to bypass the TLS protections by leveraging a network position between the client and the registry to block the StartTLS command, aka a \"StartTLS stripping attack.\""
        },
        {
          "lang": "es",
          "value": "Se ha detectado un problema en Ruby versiones hasta 2.6.7, versiones 2.7.x hasta 2.7.3, y versiones 3.x hasta 3.0.1. Net::IMAP no lanza una excepción cuando StartTLS falla con una respuesta desconocida, lo que podría permitir a atacantes tipo man-in-the-middle omitir las protecciones TLS, al aprovechar una posición de red entre el cliente y el registro para bloquear el comando StartTLS, también se conoce como \"StartTLS stripping attack\""
        }
      ]
    }
  },
  "configurations": {
    "CVE_data_version": "4.0",
    "nodes": [
      {
        "operator": "OR",
        "cpe_match": [
          {
            "vulnerable": true,
            "cpe23Uri": "cpe:2.3:a:ruby-lang:ruby:*:*:*:*:*:*:*:*",
            "versionStartIncluding": "2.6.0",
            "versionEndIncluding": "2.6.7"
          },
          {
            "vulnerable": true,
            "cpe23Uri": "cpe:2.3:a:ruby-lang:ruby:*:*:*:*:*:*:*:*",
            "versionStartIncluding": "2.7.0",
            "versionEndIncluding": "2.7.3"
          },
          {
            "vulnerable": true,
            "cpe23Uri": "cpe:2.3:a:ruby-lang:ruby:*:*:*:*:*:*:*:*",
            "versionStartIncluding": "3.0.0",
            "versionEndIncluding": "3.0.1"
          }
        ]
      },
      {
        "operator": "OR",
        "cpe_match": [
          {
            "vulnerable": true,
            "cpe23Uri": "cpe:2.3:a:oracle:jd_edwards_enterpriseone_tools:*:*:*:*:*:*:*:*",
            "versionEndExcluding": "9.2.6.1"
          }
        ]
      }
    ]
  },
  "impact": {
    "baseMetricV2": {
      "cvssV2": {
        "accessComplexity": "MEDIUM",
        "accessVector": "NETWORK",
        "authentication": "NONE",
        "availabilityImpact": "NONE",
        "baseScore": 5.8,
        "confidentialityImpact": "PARTIAL",
        "integrityImpact": "PARTIAL",
        "vectorString": "AV:N/AC:M/Au:N/C:P/I:P/A:N",
        "version": "2.0"
      },
      "exploitabilityScore": 8.6,
      "impactScore": 4.9,
      "severity": "MEDIUM"
    },
    "baseMetricV3": {
      "cvssV3": {
        "attackComplexity": "HIGH",
        "attackVector": "NETWORK",
        "availabilityImpact": "NONE",
        "baseScore": 7.4,
        "baseSeverity": "HIGH",
        "confidentialityImpact": "HIGH",
        "integrityImpact": "HIGH",
        "privilegesRequired": "NONE",
        "scope": "UNCHANGED",
        "userInteraction": "NONE",
        "vectorString": "CVSS:3.1/AV:N/AC:H/PR:N/UI:N/S:U/C:H/I:H/A:N",
        "version": "3.1"
      },
      "exploitabilityScore": 2.2,
      "impactScore": 5.2
    }
  },
  "publicationDate": "2021-08-01T19:15:07.697",
  "lastModifiedDate": "2024-01-24T05:15:10.040"
}
