{
  "cve": {
    "id": "CVE-2021-22926",
    "sourceIdentifier": "support@hackerone.com",
    "published": "2021-08-05T21:15:11.553",
    "lastModified": "2024-03-27T15:11:38.047",
    "vulnStatus": "Analyzed",
    "descriptions": [
      {
        "lang": "en",
        "value": "libcurl-using applications can ask for a specific client certificate to be used in a transfer. This is done with the `CURLOPT_SSLCERT` option (`--cert` with the command line tool).When libcurl is built to use the macOS native TLS library Secure Transport, an application can ask for the client certificate by name or with a file name - using the same option. If the name exists as a file, it will be used instead of by name.If the appliction runs with a current working directory that is writable by other users (like `/tmp`), a malicious user can create a file name with the same name as the app wants to use by name, and thereby trick the application to use the file based cert instead of the one referred to by name making libcurl send the wrong client certificate in the TLS connection handshake."
      },
      {
        "lang": "es",
        "value": "Las aplicaciones que usan libcurl pueden pedir un certificado de cliente específico para ser usado en una transferencia. Esto se hace con la opción \"CURLOPT_SSLCERT\" (\"--cert\" con la herramienta de línea de comandos).Cuando libcurl se construye para usar la biblioteca TLS nativa de macOS Transporte Seguro, una aplicación puede pedir el certificado del cliente por su nombre o con un nombre de archivo - usando la misma opción. Si la aplicación se ejecuta con un directorio de trabajo actual que puede ser escrito por otros usuarios (como \"/tmp\"), un usuario malintencionado puede crear un nombre de archivo con el mismo nombre que la aplicación quiere usar por nombre, y así engañar a la aplicación para que use el certificado basado en el archivo en lugar del referido por nombre, haciendo que libcurl envíe el certificado de cliente incorrecto en el handshake de la conexión TLS"
      }
    ],
    "metrics": {
      "cvssMetricV31": [
        {
          "source": "nvd@nist.gov",
          "type": "Primary",
          "cvssData": {
            "attackComplexity": "LOW",
            "attackVector": "NETWORK",
            "availabilityImpact": "HIGH",
            "baseScore": 7.5,
            "baseSeverity": "HIGH",
            "confidentialityImpact": "NONE",
            "integrityImpact": "NONE",
            "privilegesRequired": "NONE",
            "scope": "UNCHANGED",
            "userInteraction": "NONE",
            "vectorString": "CVSS:3.1/AV:N/AC:L/PR:N/UI:N/S:U/C:N/I:N/A:H",
            "version": "3.1"
          },
          "exploitabilityScore": 3.9,
          "impactScore": 3.6
        }
      ],
      "cvssMetricV30": null,
      "cvssMetricV2": [
        {
          "source": "nvd@nist.gov",
          "type": "Primary",
          "cvssData": {
            "accessComplexity": "LOW",
            "accessVector": "NETWORK",
            "authentication": "NONE",
            "availabilityImpact": "PARTIAL",
            "baseScore": 5,
            "confidentialityImpact": "NONE",
            "integrityImpact": "NONE",
            "vectorString": "AV:N/AC:L/Au:N/C:N/I:N/A:P",
            "version": "2.0"
          },
          "baseSeverity": "MEDIUM",
          "exploitabilityScore": 10,
          "impactScore": 2.9,
          "acInsufInfo": false,
          "obtainAllPrivilege": false,
          "obtainUserPrivilege": false,
          "obtainOtherPrivilege": false,
          "userInteractionRequired": false
        }
      ]
    },
    "weaknesses": [
      {
        "source": "nvd@nist.gov",
        "type": "Primary",
        "description": [
          {
            "lang": "en",
            "value": "CWE-295"
          }
        ]
      },
      {
        "source": "support@hackerone.com",
        "type": "Secondary",
        "description": [
          {
            "lang": "en",
            "value": "CWE-840"
          }
        ]
      }
    ],
    "configurations": [
      {
        "nodes": [
          {
            "operator": "OR",
            "negate": false,
            "cpeMatch": [
              {
                "vulnerable": true,
                "criteria": "cpe:2.3:a:haxx:curl:*:*:*:*:*:*:*:*",
                "matchCriteriaId": "2D8F65E4-C15D-47AB-BE9C-687300329EE7",
                "versionStartIncluding": "7.33.0",
                "versionEndExcluding": "7.78.0"
              }
            ]
          }
        ]
      },
      {
        "nodes": [
          {
            "operator": "OR",
            "negate": false,
            "cpeMatch": [
              {
                "vulnerable": true,
                "criteria": "cpe:2.3:a:netapp:active_iq_unified_manager:-:*:*:*:*:vmware_vsphere:*:*",
                "matchCriteriaId": "3A756737-1CC4-42C2-A4DF-E1C893B4E2D5"
              },
              {
                "vulnerable": true,
                "criteria": "cpe:2.3:a:netapp:active_iq_unified_manager:-:*:*:*:*:windows:*:*",
                "matchCriteriaId": "B55E8D50-99B4-47EC-86F9-699B67D473CE"
              },
              {
                "vulnerable": true,
                "criteria": "cpe:2.3:a:netapp:clustered_data_ontap:-:*:*:*:*:*:*:*",
                "matchCriteriaId": "1FE996B1-6951-4F85-AA58-B99A379D2163"
              },
              {
                "vulnerable": true,
                "criteria": "cpe:2.3:a:netapp:hci_management_node:-:*:*:*:*:*:*:*",
                "matchCriteriaId": "A3C19813-E823-456A-B1CE-EC0684CE1953"
              },
              {
                "vulnerable": true,
                "criteria": "cpe:2.3:a:netapp:oncommand_insight:-:*:*:*:*:*:*:*",
                "matchCriteriaId": "F1BE6C1F-2565-4E97-92AA-16563E5660A5"
              },
              {
                "vulnerable": true,
                "criteria": "cpe:2.3:a:netapp:oncommand_workflow_automation:-:*:*:*:*:*:*:*",
                "matchCriteriaId": "5735E553-9731-4AAC-BCFF-989377F817B3"
              },
              {
                "vulnerable": true,
                "criteria": "cpe:2.3:a:netapp:snapcenter:-:*:*:*:*:*:*:*",
                "matchCriteriaId": "BDFB1169-41A0-4A86-8E4F-FDA9730B1E94"
              },
              {
                "vulnerable": true,
                "criteria": "cpe:2.3:a:netapp:solidfire:-:*:*:*:*:*:*:*",
                "matchCriteriaId": "A6E9EF0C-AFA8-4F7B-9FDC-1E0F7C26E737"
              }
            ]
          }
        ]
      },
      {
        "nodes": [
          {
            "operator": "OR",
            "negate": false,
            "cpeMatch": [
              {
                "vulnerable": true,
                "criteria": "cpe:2.3:a:oracle:mysql_server:*:*:*:*:*:*:*:*",
                "matchCriteriaId": "E667933A-37EA-4BC2-9180-C3B4B7038866",
                "versionStartIncluding": "5.7.0",
                "versionEndIncluding": "5.7.35"
              },
              {
                "vulnerable": true,
                "criteria": "cpe:2.3:a:oracle:mysql_server:*:*:*:*:*:*:*:*",
                "matchCriteriaId": "709E83B4-8C66-4255-870B-2F72B37BA8C6",
                "versionStartIncluding": "8.0.0",
                "versionEndIncluding": "8.0.26"
              },
              {
                "vulnerable": true,
                "criteria": "cpe:2.3:a:oracle:peoplesoft_enterprise_peopletools:8.57:*:*:*:*:*:*:*",
                "matchCriteriaId": "7E1E416B-920B-49A0-9523-382898C2979D"
              },
              {
                "vulnerable": true,
                "criteria": "cpe:2.3:a:oracle:peoplesoft_enterprise_peopletools:8.58:*:*:*:*:*:*:*",
                "matchCriteriaId": "D9DB4A14-2EF5-4B54-95D2-75E6CF9AA0A9"
              },
              {
                "vulnerable": true,
                "criteria": "cpe:2.3:a:oracle:peoplesoft_enterprise_peopletools:8.59:*:*:*:*:*:*:*",
                "matchCriteriaId": "C8AF00C6-B97F-414D-A8DF-057E6BFD8597"
              }
            ]
          }
        ]
      },
      {
        "nodes": [
          {
            "operator": "OR",
            "negate": false,
            "cpeMatch": [
              {
                "vulnerable": true,
                "criteria": "cpe:2.3:a:siemens:sinec_infrastructure_network_services:*:*:*:*:*:*:*:*",
                "matchCriteriaId": "B0F46497-4AB0-49A7-9453-CC26837BF253",
                "versionEndExcluding": "1.0.1.1"
              }
            ]
          }
        ]
      },
      {
        "nodes": [
          {
            "operator": "OR",
            "negate": false,
            "cpeMatch": [
              {
                "vulnerable": true,
                "criteria": "cpe:2.3:o:netapp:h300s_firmware:-:*:*:*:*:*:*:*",
                "matchCriteriaId": "6770B6C3-732E-4E22-BF1C-2D2FD610061C"
              }
            ]
          },
          {
            "operator": "OR",
            "negate": false,
            "cpeMatch": [
              {
                "vulnerable": false,
                "criteria": "cpe:2.3:h:netapp:h300s:-:*:*:*:*:*:*:*",
                "matchCriteriaId": "9F9C8C20-42EB-4AB5-BD97-212DEB070C43"
              }
            ]
          }
        ]
      },
      {
        "nodes": [
          {
            "operator": "OR",
            "negate": false,
            "cpeMatch": [
              {
                "vulnerable": true,
                "criteria": "cpe:2.3:o:netapp:h300e_firmware:-:*:*:*:*:*:*:*",
                "matchCriteriaId": "108A2215-50FB-4074-94CF-C130FA14566D"
              }
            ]
          },
          {
            "operator": "OR",
            "negate": false,
            "cpeMatch": [
              {
                "vulnerable": false,
                "criteria": "cpe:2.3:h:netapp:h300e:-:*:*:*:*:*:*:*",
                "matchCriteriaId": "7AFC73CE-ABB9-42D3-9A71-3F5BC5381E0E"
              }
            ]
          }
        ]
      },
      {
        "nodes": [
          {
            "operator": "OR",
            "negate": false,
            "cpeMatch": [
              {
                "vulnerable": true,
                "criteria": "cpe:2.3:o:netapp:h500e_firmware:-:*:*:*:*:*:*:*",
                "matchCriteriaId": "32F0B6C0-F930-480D-962B-3F4EFDCC13C7"
              }
            ]
          },
          {
            "operator": "OR",
            "negate": false,
            "cpeMatch": [
              {
                "vulnerable": false,
                "criteria": "cpe:2.3:h:netapp:h500e:-:*:*:*:*:*:*:*",
                "matchCriteriaId": "803BC414-B250-4E3A-A478-A3881340D6B8"
              }
            ]
          }
        ]
      },
      {
        "nodes": [
          {
            "operator": "OR",
            "negate": false,
            "cpeMatch": [
              {
                "vulnerable": true,
                "criteria": "cpe:2.3:o:netapp:h500s_firmware:-:*:*:*:*:*:*:*",
                "matchCriteriaId": "7FFF7106-ED78-49BA-9EC5-B889E3685D53"
              }
            ]
          },
          {
            "operator": "OR",
            "negate": false,
            "cpeMatch": [
              {
                "vulnerable": false,
                "criteria": "cpe:2.3:h:netapp:h500s:-:*:*:*:*:*:*:*",
                "matchCriteriaId": "E63D8B0F-006E-4801-BF9D-1C001BBFB4F9"
              }
            ]
          }
        ]
      },
      {
        "nodes": [
          {
            "operator": "OR",
            "negate": false,
            "cpeMatch": [
              {
                "vulnerable": true,
                "criteria": "cpe:2.3:o:netapp:h700s_firmware:-:*:*:*:*:*:*:*",
                "matchCriteriaId": "56409CEC-5A1E-4450-AA42-641E459CC2AF"
              }
            ]
          },
          {
            "operator": "OR",
            "negate": false,
            "cpeMatch": [
              {
                "vulnerable": false,
                "criteria": "cpe:2.3:h:netapp:h700s:-:*:*:*:*:*:*:*",
                "matchCriteriaId": "B06F4839-D16A-4A61-9BB5-55B13F41E47F"
              }
            ]
          }
        ]
      },
      {
        "nodes": [
          {
            "operator": "OR",
            "negate": false,
            "cpeMatch": [
              {
                "vulnerable": true,
                "criteria": "cpe:2.3:o:netapp:h700e_firmware:-:*:*:*:*:*:*:*",
                "matchCriteriaId": "0FEB3337-BFDE-462A-908B-176F92053CEC"
              }
            ]
          },
          {
            "operator": "OR",
            "negate": false,
            "cpeMatch": [
              {
                "vulnerable": false,
                "criteria": "cpe:2.3:h:netapp:h700e:-:*:*:*:*:*:*:*",
                "matchCriteriaId": "736AEAE9-782B-4F71-9893-DED53367E102"
              }
            ]
          }
        ]
      },
      {
        "nodes": [
          {
            "operator": "OR",
            "negate": false,
            "cpeMatch": [
              {
                "vulnerable": true,
                "criteria": "cpe:2.3:o:netapp:h410s_firmware:-:*:*:*:*:*:*:*",
                "matchCriteriaId": "D0B4AD8A-F172-4558-AEC6-FF424BA2D912"
              }
            ]
          },
          {
            "operator": "OR",
            "negate": false,
            "cpeMatch": [
              {
                "vulnerable": false,
                "criteria": "cpe:2.3:h:netapp:h410s:-:*:*:*:*:*:*:*",
                "matchCriteriaId": "8497A4C9-8474-4A62-8331-3FE862ED4098"
              }
            ]
          }
        ]
      },
      {
        "nodes": [
          {
            "operator": "OR",
            "negate": false,
            "cpeMatch": [
              {
                "vulnerable": true,
                "criteria": "cpe:2.3:a:splunk:universal_forwarder:*:*:*:*:*:*:*:*",
                "matchCriteriaId": "5722E753-75DE-4944-A11B-556CB299B57D",
                "versionStartIncluding": "8.2.0",
                "versionEndExcluding": "8.2.12"
              },
              {
                "vulnerable": true,
                "criteria": "cpe:2.3:a:splunk:universal_forwarder:*:*:*:*:*:*:*:*",
                "matchCriteriaId": "DC0F9351-81A4-4FEA-B6B5-6E960A933D32",
                "versionStartIncluding": "9.0.0",
                "versionEndExcluding": "9.0.6"
              },
              {
                "vulnerable": true,
                "criteria": "cpe:2.3:a:splunk:universal_forwarder:9.1.0:*:*:*:*:*:*:*",
                "matchCriteriaId": "EED24E67-2957-4C1B-8FEA-E2D2FE7B97FC"
              }
            ]
          }
        ]
      }
    ],
    "references": [
      {
        "url": "https://cert-portal.siemens.com/productcert/pdf/ssa-389290.pdf",
        "source": "support@hackerone.com",
        "tags": [
          "Patch",
          "Third Party Advisory"
        ]
      },
      {
        "url": "https://hackerone.com/reports/1234760",
        "source": "support@hackerone.com",
        "tags": [
          "Exploit",
          "Third Party Advisory"
        ]
      },
      {
        "url": "https://lists.apache.org/thread.html/r61db8e7dcb56dc000a5387a88f7a473bacec5ee01b9ff3f55308aacc%40%3Cdev.kafka.apache.org%3E",
        "source": "support@hackerone.com",
        "tags": [
          "Mailing List",
          "Third Party Advisory"
        ]
      },
      {
        "url": "https://lists.apache.org/thread.html/r61db8e7dcb56dc000a5387a88f7a473bacec5ee01b9ff3f55308aacc%40%3Cusers.kafka.apache.org%3E",
        "source": "support@hackerone.com",
        "tags": [
          "Mailing List",
          "Third Party Advisory"
        ]
      },
      {
        "url": "https://lists.apache.org/thread.html/rbf4ce74b0d1fa9810dec50ba3ace0caeea677af7c27a97111c06ccb7%40%3Cdev.kafka.apache.org%3E",
        "source": "support@hackerone.com",
        "tags": [
          "Mailing List",
          "Third Party Advisory"
        ]
      },
      {
        "url": "https://lists.apache.org/thread.html/rbf4ce74b0d1fa9810dec50ba3ace0caeea677af7c27a97111c06ccb7%40%3Cusers.kafka.apache.org%3E",
        "source": "support@hackerone.com",
        "tags": [
          "Mailing List",
          "Third Party Advisory"
        ]
      },
      {
        "url": "https://security.gentoo.org/glsa/202212-01",
        "source": "support@hackerone.com",
        "tags": [
          "Third Party Advisory"
        ]
      },
      {
        "url": "https://security.netapp.com/advisory/ntap-20210902-0003/",
        "source": "support@hackerone.com",
        "tags": [
          "Third Party Advisory"
        ]
      },
      {
        "url": "https://security.netapp.com/advisory/ntap-20211022-0003/",
        "source": "support@hackerone.com",
        "tags": [
          "Third Party Advisory"
        ]
      },
      {
        "url": "https://www.oracle.com/security-alerts/cpujan2022.html",
        "source": "support@hackerone.com",
        "tags": [
          "Patch",
          "Third Party Advisory"
        ]
      },
      {
        "url": "https://www.oracle.com/security-alerts/cpuoct2021.html",
        "source": "support@hackerone.com",
        "tags": [
          "Patch",
          "Third Party Advisory"
        ]
      }
    ],
    "data_type": "MITRE",
    "data_format": "CVE",
    "data_version": "4.0",
    "CVE_data_meta": {
      "ASSIGNER": "support@hackerone.com",
      "ID": "CVE-2021-22926"
    },
    "problemtype": {
      "problemtype_data": [
        {
          "description": [
            {
              "lang": "en",
              "value": "CWE-295"
            }
          ]
        },
        {
          "description": [
            {
              "lang": "en",
              "value": "CWE-840"
            }
          ]
        }
      ]
    },
    "description": {
      "description_data": [
        {
          "lang": "en",
          "value": "libcurl-using applications can ask for a specific client certificate to be used in a transfer. This is done with the `CURLOPT_SSLCERT` option (`--cert` with the command line tool).When libcurl is built to use the macOS native TLS library Secure Transport, an application can ask for the client certificate by name or with a file name - using the same option. If the name exists as a file, it will be used instead of by name.If the appliction runs with a current working directory that is writable by other users (like `/tmp`), a malicious user can create a file name with the same name as the app wants to use by name, and thereby trick the application to use the file based cert instead of the one referred to by name making libcurl send the wrong client certificate in the TLS connection handshake."
        },
        {
          "lang": "es",
          "value": "Las aplicaciones que usan libcurl pueden pedir un certificado de cliente específico para ser usado en una transferencia. Esto se hace con la opción \"CURLOPT_SSLCERT\" (\"--cert\" con la herramienta de línea de comandos).Cuando libcurl se construye para usar la biblioteca TLS nativa de macOS Transporte Seguro, una aplicación puede pedir el certificado del cliente por su nombre o con un nombre de archivo - usando la misma opción. Si la aplicación se ejecuta con un directorio de trabajo actual que puede ser escrito por otros usuarios (como \"/tmp\"), un usuario malintencionado puede crear un nombre de archivo con el mismo nombre que la aplicación quiere usar por nombre, y así engañar a la aplicación para que use el certificado basado en el archivo en lugar del referido por nombre, haciendo que libcurl envíe el certificado de cliente incorrecto en el handshake de la conexión TLS"
        }
      ]
    }
  },
  "configurations": {
    "CVE_data_version": "4.0",
    "nodes": [
      {
        "operator": "OR",
        "cpe_match": [
          {
            "vulnerable": true,
            "cpe23Uri": "cpe:2.3:a:haxx:curl:*:*:*:*:*:*:*:*",
            "versionStartIncluding": "7.33.0",
            "versionEndExcluding": "7.78.0"
          }
        ]
      },
      {
        "operator": "OR",
        "cpe_match": [
          {
            "vulnerable": true,
            "cpe23Uri": "cpe:2.3:a:netapp:active_iq_unified_manager:-:*:*:*:*:vmware_vsphere:*:*"
          },
          {
            "vulnerable": true,
            "cpe23Uri": "cpe:2.3:a:netapp:active_iq_unified_manager:-:*:*:*:*:windows:*:*"
          },
          {
            "vulnerable": true,
            "cpe23Uri": "cpe:2.3:a:netapp:clustered_data_ontap:-:*:*:*:*:*:*:*"
          },
          {
            "vulnerable": true,
            "cpe23Uri": "cpe:2.3:a:netapp:hci_management_node:-:*:*:*:*:*:*:*"
          },
          {
            "vulnerable": true,
            "cpe23Uri": "cpe:2.3:a:netapp:oncommand_insight:-:*:*:*:*:*:*:*"
          },
          {
            "vulnerable": true,
            "cpe23Uri": "cpe:2.3:a:netapp:oncommand_workflow_automation:-:*:*:*:*:*:*:*"
          },
          {
            "vulnerable": true,
            "cpe23Uri": "cpe:2.3:a:netapp:snapcenter:-:*:*:*:*:*:*:*"
          },
          {
            "vulnerable": true,
            "cpe23Uri": "cpe:2.3:a:netapp:solidfire:-:*:*:*:*:*:*:*"
          }
        ]
      },
      {
        "operator": "OR",
        "cpe_match": [
          {
            "vulnerable": true,
            "cpe23Uri": "cpe:2.3:a:oracle:mysql_server:*:*:*:*:*:*:*:*",
            "versionStartIncluding": "5.7.0",
            "versionEndIncluding": "5.7.35"
          },
          {
            "vulnerable": true,
            "cpe23Uri": "cpe:2.3:a:oracle:mysql_server:*:*:*:*:*:*:*:*",
            "versionStartIncluding": "8.0.0",
            "versionEndIncluding": "8.0.26"
          },
          {
            "vulnerable": true,
            "cpe23Uri": "cpe:2.3:a:oracle:peoplesoft_enterprise_peopletools:8.57:*:*:*:*:*:*:*"
          },
          {
            "vulnerable": true,
            "cpe23Uri": "cpe:2.3:a:oracle:peoplesoft_enterprise_peopletools:8.58:*:*:*:*:*:*:*"
          },
          {
            "vulnerable": true,
            "cpe23Uri": "cpe:2.3:a:oracle:peoplesoft_enterprise_peopletools:8.59:*:*:*:*:*:*:*"
          }
        ]
      },
      {
        "operator": "OR",
        "cpe_match": [
          {
            "vulnerable": true,
            "cpe23Uri": "cpe:2.3:a:siemens:sinec_infrastructure_network_services:*:*:*:*:*:*:*:*",
            "versionEndExcluding": "1.0.1.1"
          }
        ]
      },
      {
        "operator": "OR",
        "cpe_match": [
          {
            "vulnerable": true,
            "cpe23Uri": "cpe:2.3:o:netapp:h300s_firmware:-:*:*:*:*:*:*:*"
          }
        ]
      },
      {
        "operator": "OR",
        "cpe_match": [
          {
            "cpe23Uri": "cpe:2.3:h:netapp:h300s:-:*:*:*:*:*:*:*"
          }
        ]
      },
      {
        "operator": "OR",
        "cpe_match": [
          {
            "vulnerable": true,
            "cpe23Uri": "cpe:2.3:o:netapp:h300e_firmware:-:*:*:*:*:*:*:*"
          }
        ]
      },
      {
        "operator": "OR",
        "cpe_match": [
          {
            "cpe23Uri": "cpe:2.3:h:netapp:h300e:-:*:*:*:*:*:*:*"
          }
        ]
      },
      {
        "operator": "OR",
        "cpe_match": [
          {
            "vulnerable": true,
            "cpe23Uri": "cpe:2.3:o:netapp:h500e_firmware:-:*:*:*:*:*:*:*"
          }
        ]
      },
      {
        "operator": "OR",
        "cpe_match": [
          {
            "cpe23Uri": "cpe:2.3:h:netapp:h500e:-:*:*:*:*:*:*:*"
          }
        ]
      },
      {
        "operator": "OR",
        "cpe_match": [
          {
            "vulnerable": true,
            "cpe23Uri": "cpe:2.3:o:netapp:h500s_firmware:-:*:*:*:*:*:*:*"
          }
        ]
      },
      {
        "operator": "OR",
        "cpe_match": [
          {
            "cpe23Uri": "cpe:2.3:h:netapp:h500s:-:*:*:*:*:*:*:*"
          }
        ]
      },
      {
        "operator": "OR",
        "cpe_match": [
          {
            "vulnerable": true,
            "cpe23Uri": "cpe:2.3:o:netapp:h700s_firmware:-:*:*:*:*:*:*:*"
          }
        ]
      },
      {
        "operator": "OR",
        "cpe_match": [
          {
            "cpe23Uri": "cpe:2.3:h:netapp:h700s:-:*:*:*:*:*:*:*"
          }
        ]
      },
      {
        "operator": "OR",
        "cpe_match": [
          {
            "vulnerable": true,
            "cpe23Uri": "cpe:2.3:o:netapp:h700e_firmware:-:*:*:*:*:*:*:*"
          }
        ]
      },
      {
        "operator": "OR",
        "cpe_match": [
          {
            "cpe23Uri": "cpe:2.3:h:netapp:h700e:-:*:*:*:*:*:*:*"
          }
        ]
      },
      {
        "operator": "OR",
        "cpe_match": [
          {
            "vulnerable": true,
            "cpe23Uri": "cpe:2.3:o:netapp:h410s_firmware:-:*:*:*:*:*:*:*"
          }
        ]
      },
      {
        "operator": "OR",
        "cpe_match": [
          {
            "cpe23Uri": "cpe:2.3:h:netapp:h410s:-:*:*:*:*:*:*:*"
          }
        ]
      },
      {
        "operator": "OR",
        "cpe_match": [
          {
            "vulnerable": true,
            "cpe23Uri": "cpe:2.3:a:splunk:universal_forwarder:*:*:*:*:*:*:*:*",
            "versionStartIncluding": "8.2.0",
            "versionEndExcluding": "8.2.12"
          },
          {
            "vulnerable": true,
            "cpe23Uri": "cpe:2.3:a:splunk:universal_forwarder:*:*:*:*:*:*:*:*",
            "versionStartIncluding": "9.0.0",
            "versionEndExcluding": "9.0.6"
          },
          {
            "vulnerable": true,
            "cpe23Uri": "cpe:2.3:a:splunk:universal_forwarder:9.1.0:*:*:*:*:*:*:*"
          }
        ]
      }
    ]
  },
  "impact": {
    "baseMetricV2": {
      "cvssV2": {
        "accessComplexity": "LOW",
        "accessVector": "NETWORK",
        "authentication": "NONE",
        "availabilityImpact": "PARTIAL",
        "baseScore": 5,
        "confidentialityImpact": "NONE",
        "integrityImpact": "NONE",
        "vectorString": "AV:N/AC:L/Au:N/C:N/I:N/A:P",
        "version": "2.0"
      },
      "exploitabilityScore": 10,
      "impactScore": 2.9,
      "severity": "MEDIUM"
    },
    "baseMetricV3": {
      "cvssV3": {
        "attackComplexity": "LOW",
        "attackVector": "NETWORK",
        "availabilityImpact": "HIGH",
        "baseScore": 7.5,
        "baseSeverity": "HIGH",
        "confidentialityImpact": "NONE",
        "integrityImpact": "NONE",
        "privilegesRequired": "NONE",
        "scope": "UNCHANGED",
        "userInteraction": "NONE",
        "vectorString": "CVSS:3.1/AV:N/AC:L/PR:N/UI:N/S:U/C:N/I:N/A:H",
        "version": "3.1"
      },
      "exploitabilityScore": 3.9,
      "impactScore": 3.6
    }
  },
  "publicationDate": "2021-08-05T21:15:11.553",
  "lastModifiedDate": "2024-03-27T15:11:38.047"
}
