{
  "cve": {
    "id": "CVE-2022-22576",
    "sourceIdentifier": "support@hackerone.com",
    "published": "2022-05-26T17:15:09.077",
    "lastModified": "2024-03-27T15:02:35.557",
    "vulnStatus": "Analyzed",
    "descriptions": [
      {
        "lang": "en",
        "value": "An improper authentication vulnerability exists in curl 7.33.0 to and including 7.82.0 which might allow reuse OAUTH2-authenticated connections without properly making sure that the connection was authenticated with the same credentials as set for this transfer. This affects SASL-enabled protocols: SMPTP(S), IMAP(S), POP3(S) and LDAP(S) (openldap only)."
      },
      {
        "lang": "es",
        "value": "Se presenta una vulnerabilidad de autenticación inapropiada en curl versiones 7.33.0 hasta 7.82.0 incluyéndola, que podría permitir reúso de conexiones autenticadas por OAUTH2 sin asegurarse apropiadamente de que la conexión fue autenticada con las mismas credenciales establecidas para esta transferencia. Esto afecta a los protocolos con SASL: SMPTP(S), IMAP(S), POP3(S) y LDAP(S) (sólo openldap)"
      }
    ],
    "metrics": {
      "cvssMetricV31": [
        {
          "source": "nvd@nist.gov",
          "type": "Primary",
          "cvssData": {
            "attackComplexity": "LOW",
            "attackVector": "NETWORK",
            "availabilityImpact": "NONE",
            "baseScore": 8.1,
            "baseSeverity": "HIGH",
            "confidentialityImpact": "HIGH",
            "integrityImpact": "HIGH",
            "privilegesRequired": "LOW",
            "scope": "UNCHANGED",
            "userInteraction": "NONE",
            "vectorString": "CVSS:3.1/AV:N/AC:L/PR:L/UI:N/S:U/C:H/I:H/A:N",
            "version": "3.1"
          },
          "exploitabilityScore": 2.8,
          "impactScore": 5.2
        }
      ],
      "cvssMetricV30": null,
      "cvssMetricV2": [
        {
          "source": "nvd@nist.gov",
          "type": "Primary",
          "cvssData": {
            "accessComplexity": "LOW",
            "accessVector": "NETWORK",
            "authentication": "SINGLE",
            "availabilityImpact": "NONE",
            "baseScore": 5.5,
            "confidentialityImpact": "PARTIAL",
            "integrityImpact": "PARTIAL",
            "vectorString": "AV:N/AC:L/Au:S/C:P/I:P/A:N",
            "version": "2.0"
          },
          "baseSeverity": "MEDIUM",
          "exploitabilityScore": 8,
          "impactScore": 4.9,
          "acInsufInfo": false,
          "obtainAllPrivilege": false,
          "obtainUserPrivilege": false,
          "obtainOtherPrivilege": false,
          "userInteractionRequired": false
        }
      ]
    },
    "weaknesses": [
      {
        "source": "nvd@nist.gov",
        "type": "Primary",
        "description": [
          {
            "lang": "en",
            "value": "CWE-306"
          }
        ]
      },
      {
        "source": "support@hackerone.com",
        "type": "Secondary",
        "description": [
          {
            "lang": "en",
            "value": "CWE-287"
          }
        ]
      }
    ],
    "configurations": [
      {
        "nodes": [
          {
            "operator": "OR",
            "negate": false,
            "cpeMatch": [
              {
                "vulnerable": true,
                "criteria": "cpe:2.3:a:haxx:curl:*:*:*:*:*:*:*:*",
                "matchCriteriaId": "74CAAB48-E0AD-4BD2-B143-A02937679092",
                "versionStartIncluding": "7.33.0",
                "versionEndExcluding": "7.83.0"
              }
            ]
          }
        ]
      },
      {
        "nodes": [
          {
            "operator": "OR",
            "negate": false,
            "cpeMatch": [
              {
                "vulnerable": true,
                "criteria": "cpe:2.3:o:debian:debian_linux:10.0:*:*:*:*:*:*:*",
                "matchCriteriaId": "07B237A9-69A3-4A9C-9DA0-4E06BD37AE73"
              },
              {
                "vulnerable": true,
                "criteria": "cpe:2.3:o:debian:debian_linux:11.0:*:*:*:*:*:*:*",
                "matchCriteriaId": "FA6FEEC2-9F11-4643-8827-749718254FED"
              }
            ]
          }
        ]
      },
      {
        "nodes": [
          {
            "operator": "OR",
            "negate": false,
            "cpeMatch": [
              {
                "vulnerable": true,
                "criteria": "cpe:2.3:a:netapp:clustered_data_ontap:-:*:*:*:*:*:*:*",
                "matchCriteriaId": "1FE996B1-6951-4F85-AA58-B99A379D2163"
              },
              {
                "vulnerable": true,
                "criteria": "cpe:2.3:a:netapp:solidfire_\\&_hci_management_node:-:*:*:*:*:*:*:*",
                "matchCriteriaId": "D6D700C5-F67F-4FFB-BE69-D524592A3D2E"
              },
              {
                "vulnerable": true,
                "criteria": "cpe:2.3:a:netapp:solidfire_\\&_hci_storage_node:-:*:*:*:*:*:*:*",
                "matchCriteriaId": "D452B464-1200-4B72-9A89-42DC58486191"
              },
              {
                "vulnerable": true,
                "criteria": "cpe:2.3:o:brocade:fabric_operating_system:-:*:*:*:*:*:*:*",
                "matchCriteriaId": "41CD1160-B681-41EF-9EB4-06CE0F53C501"
              }
            ]
          }
        ]
      },
      {
        "nodes": [
          {
            "operator": "OR",
            "negate": false,
            "cpeMatch": [
              {
                "vulnerable": true,
                "criteria": "cpe:2.3:o:netapp:bootstrap_os:-:*:*:*:*:*:*:*",
                "matchCriteriaId": "95BA156C-C977-4F0C-8DFB-3FAE9CC8C02D"
              }
            ]
          },
          {
            "operator": "OR",
            "negate": false,
            "cpeMatch": [
              {
                "vulnerable": false,
                "criteria": "cpe:2.3:h:netapp:hci_compute_node:-:*:*:*:*:*:*:*",
                "matchCriteriaId": "AD7447BC-F315-4298-A822-549942FC118B"
              }
            ]
          }
        ]
      },
      {
        "nodes": [
          {
            "operator": "OR",
            "negate": false,
            "cpeMatch": [
              {
                "vulnerable": true,
                "criteria": "cpe:2.3:o:netapp:h300s_firmware:-:*:*:*:*:*:*:*",
                "matchCriteriaId": "6770B6C3-732E-4E22-BF1C-2D2FD610061C"
              }
            ]
          },
          {
            "operator": "OR",
            "negate": false,
            "cpeMatch": [
              {
                "vulnerable": false,
                "criteria": "cpe:2.3:h:netapp:h300s:-:*:*:*:*:*:*:*",
                "matchCriteriaId": "9F9C8C20-42EB-4AB5-BD97-212DEB070C43"
              }
            ]
          }
        ]
      },
      {
        "nodes": [
          {
            "operator": "OR",
            "negate": false,
            "cpeMatch": [
              {
                "vulnerable": true,
                "criteria": "cpe:2.3:o:netapp:h500s_firmware:-:*:*:*:*:*:*:*",
                "matchCriteriaId": "7FFF7106-ED78-49BA-9EC5-B889E3685D53"
              }
            ]
          },
          {
            "operator": "OR",
            "negate": false,
            "cpeMatch": [
              {
                "vulnerable": false,
                "criteria": "cpe:2.3:h:netapp:h500s:-:*:*:*:*:*:*:*",
                "matchCriteriaId": "E63D8B0F-006E-4801-BF9D-1C001BBFB4F9"
              }
            ]
          }
        ]
      },
      {
        "nodes": [
          {
            "operator": "OR",
            "negate": false,
            "cpeMatch": [
              {
                "vulnerable": true,
                "criteria": "cpe:2.3:o:netapp:h700s_firmware:-:*:*:*:*:*:*:*",
                "matchCriteriaId": "56409CEC-5A1E-4450-AA42-641E459CC2AF"
              }
            ]
          },
          {
            "operator": "OR",
            "negate": false,
            "cpeMatch": [
              {
                "vulnerable": false,
                "criteria": "cpe:2.3:h:netapp:h700s:-:*:*:*:*:*:*:*",
                "matchCriteriaId": "B06F4839-D16A-4A61-9BB5-55B13F41E47F"
              }
            ]
          }
        ]
      },
      {
        "nodes": [
          {
            "operator": "OR",
            "negate": false,
            "cpeMatch": [
              {
                "vulnerable": true,
                "criteria": "cpe:2.3:o:netapp:h410s_firmware:-:*:*:*:*:*:*:*",
                "matchCriteriaId": "D0B4AD8A-F172-4558-AEC6-FF424BA2D912"
              }
            ]
          },
          {
            "operator": "OR",
            "negate": false,
            "cpeMatch": [
              {
                "vulnerable": false,
                "criteria": "cpe:2.3:h:netapp:h410s:-:*:*:*:*:*:*:*",
                "matchCriteriaId": "8497A4C9-8474-4A62-8331-3FE862ED4098"
              }
            ]
          }
        ]
      },
      {
        "nodes": [
          {
            "operator": "OR",
            "negate": false,
            "cpeMatch": [
              {
                "vulnerable": true,
                "criteria": "cpe:2.3:a:splunk:universal_forwarder:*:*:*:*:*:*:*:*",
                "matchCriteriaId": "5722E753-75DE-4944-A11B-556CB299B57D",
                "versionStartIncluding": "8.2.0",
                "versionEndExcluding": "8.2.12"
              },
              {
                "vulnerable": true,
                "criteria": "cpe:2.3:a:splunk:universal_forwarder:*:*:*:*:*:*:*:*",
                "matchCriteriaId": "DC0F9351-81A4-4FEA-B6B5-6E960A933D32",
                "versionStartIncluding": "9.0.0",
                "versionEndExcluding": "9.0.6"
              },
              {
                "vulnerable": true,
                "criteria": "cpe:2.3:a:splunk:universal_forwarder:9.1.0:*:*:*:*:*:*:*",
                "matchCriteriaId": "EED24E67-2957-4C1B-8FEA-E2D2FE7B97FC"
              }
            ]
          }
        ]
      }
    ],
    "references": [
      {
        "url": "https://hackerone.com/reports/1526328",
        "source": "support@hackerone.com",
        "tags": [
          "Exploit",
          "Issue Tracking",
          "Third Party Advisory"
        ]
      },
      {
        "url": "https://lists.debian.org/debian-lts-announce/2022/08/msg00017.html",
        "source": "support@hackerone.com",
        "tags": [
          "Mailing List",
          "Third Party Advisory"
        ]
      },
      {
        "url": "https://security.gentoo.org/glsa/202212-01",
        "source": "support@hackerone.com",
        "tags": [
          "Third Party Advisory"
        ]
      },
      {
        "url": "https://security.netapp.com/advisory/ntap-20220609-0008/",
        "source": "support@hackerone.com",
        "tags": [
          "Third Party Advisory"
        ]
      },
      {
        "url": "https://www.debian.org/security/2022/dsa-5197",
        "source": "support@hackerone.com",
        "tags": [
          "Third Party Advisory"
        ]
      }
    ],
    "data_type": "MITRE",
    "data_format": "CVE",
    "data_version": "4.0",
    "CVE_data_meta": {
      "ASSIGNER": "support@hackerone.com",
      "ID": "CVE-2022-22576"
    },
    "problemtype": {
      "problemtype_data": [
        {
          "description": [
            {
              "lang": "en",
              "value": "CWE-306"
            }
          ]
        },
        {
          "description": [
            {
              "lang": "en",
              "value": "CWE-287"
            }
          ]
        }
      ]
    },
    "description": {
      "description_data": [
        {
          "lang": "en",
          "value": "An improper authentication vulnerability exists in curl 7.33.0 to and including 7.82.0 which might allow reuse OAUTH2-authenticated connections without properly making sure that the connection was authenticated with the same credentials as set for this transfer. This affects SASL-enabled protocols: SMPTP(S), IMAP(S), POP3(S) and LDAP(S) (openldap only)."
        },
        {
          "lang": "es",
          "value": "Se presenta una vulnerabilidad de autenticación inapropiada en curl versiones 7.33.0 hasta 7.82.0 incluyéndola, que podría permitir reúso de conexiones autenticadas por OAUTH2 sin asegurarse apropiadamente de que la conexión fue autenticada con las mismas credenciales establecidas para esta transferencia. Esto afecta a los protocolos con SASL: SMPTP(S), IMAP(S), POP3(S) y LDAP(S) (sólo openldap)"
        }
      ]
    }
  },
  "configurations": {
    "CVE_data_version": "4.0",
    "nodes": [
      {
        "operator": "OR",
        "cpe_match": [
          {
            "vulnerable": true,
            "cpe23Uri": "cpe:2.3:a:haxx:curl:*:*:*:*:*:*:*:*",
            "versionStartIncluding": "7.33.0",
            "versionEndExcluding": "7.83.0"
          }
        ]
      },
      {
        "operator": "OR",
        "cpe_match": [
          {
            "vulnerable": true,
            "cpe23Uri": "cpe:2.3:o:debian:debian_linux:10.0:*:*:*:*:*:*:*"
          },
          {
            "vulnerable": true,
            "cpe23Uri": "cpe:2.3:o:debian:debian_linux:11.0:*:*:*:*:*:*:*"
          }
        ]
      },
      {
        "operator": "OR",
        "cpe_match": [
          {
            "vulnerable": true,
            "cpe23Uri": "cpe:2.3:a:netapp:clustered_data_ontap:-:*:*:*:*:*:*:*"
          },
          {
            "vulnerable": true,
            "cpe23Uri": "cpe:2.3:a:netapp:solidfire_\\&_hci_management_node:-:*:*:*:*:*:*:*"
          },
          {
            "vulnerable": true,
            "cpe23Uri": "cpe:2.3:a:netapp:solidfire_\\&_hci_storage_node:-:*:*:*:*:*:*:*"
          },
          {
            "vulnerable": true,
            "cpe23Uri": "cpe:2.3:o:brocade:fabric_operating_system:-:*:*:*:*:*:*:*"
          }
        ]
      },
      {
        "operator": "OR",
        "cpe_match": [
          {
            "vulnerable": true,
            "cpe23Uri": "cpe:2.3:o:netapp:bootstrap_os:-:*:*:*:*:*:*:*"
          }
        ]
      },
      {
        "operator": "OR",
        "cpe_match": [
          {
            "cpe23Uri": "cpe:2.3:h:netapp:hci_compute_node:-:*:*:*:*:*:*:*"
          }
        ]
      },
      {
        "operator": "OR",
        "cpe_match": [
          {
            "vulnerable": true,
            "cpe23Uri": "cpe:2.3:o:netapp:h300s_firmware:-:*:*:*:*:*:*:*"
          }
        ]
      },
      {
        "operator": "OR",
        "cpe_match": [
          {
            "cpe23Uri": "cpe:2.3:h:netapp:h300s:-:*:*:*:*:*:*:*"
          }
        ]
      },
      {
        "operator": "OR",
        "cpe_match": [
          {
            "vulnerable": true,
            "cpe23Uri": "cpe:2.3:o:netapp:h500s_firmware:-:*:*:*:*:*:*:*"
          }
        ]
      },
      {
        "operator": "OR",
        "cpe_match": [
          {
            "cpe23Uri": "cpe:2.3:h:netapp:h500s:-:*:*:*:*:*:*:*"
          }
        ]
      },
      {
        "operator": "OR",
        "cpe_match": [
          {
            "vulnerable": true,
            "cpe23Uri": "cpe:2.3:o:netapp:h700s_firmware:-:*:*:*:*:*:*:*"
          }
        ]
      },
      {
        "operator": "OR",
        "cpe_match": [
          {
            "cpe23Uri": "cpe:2.3:h:netapp:h700s:-:*:*:*:*:*:*:*"
          }
        ]
      },
      {
        "operator": "OR",
        "cpe_match": [
          {
            "vulnerable": true,
            "cpe23Uri": "cpe:2.3:o:netapp:h410s_firmware:-:*:*:*:*:*:*:*"
          }
        ]
      },
      {
        "operator": "OR",
        "cpe_match": [
          {
            "cpe23Uri": "cpe:2.3:h:netapp:h410s:-:*:*:*:*:*:*:*"
          }
        ]
      },
      {
        "operator": "OR",
        "cpe_match": [
          {
            "vulnerable": true,
            "cpe23Uri": "cpe:2.3:a:splunk:universal_forwarder:*:*:*:*:*:*:*:*",
            "versionStartIncluding": "8.2.0",
            "versionEndExcluding": "8.2.12"
          },
          {
            "vulnerable": true,
            "cpe23Uri": "cpe:2.3:a:splunk:universal_forwarder:*:*:*:*:*:*:*:*",
            "versionStartIncluding": "9.0.0",
            "versionEndExcluding": "9.0.6"
          },
          {
            "vulnerable": true,
            "cpe23Uri": "cpe:2.3:a:splunk:universal_forwarder:9.1.0:*:*:*:*:*:*:*"
          }
        ]
      }
    ]
  },
  "impact": {
    "baseMetricV2": {
      "cvssV2": {
        "accessComplexity": "LOW",
        "accessVector": "NETWORK",
        "authentication": "SINGLE",
        "availabilityImpact": "NONE",
        "baseScore": 5.5,
        "confidentialityImpact": "PARTIAL",
        "integrityImpact": "PARTIAL",
        "vectorString": "AV:N/AC:L/Au:S/C:P/I:P/A:N",
        "version": "2.0"
      },
      "exploitabilityScore": 8,
      "impactScore": 4.9,
      "severity": "MEDIUM"
    },
    "baseMetricV3": {
      "cvssV3": {
        "attackComplexity": "LOW",
        "attackVector": "NETWORK",
        "availabilityImpact": "NONE",
        "baseScore": 8.1,
        "baseSeverity": "HIGH",
        "confidentialityImpact": "HIGH",
        "integrityImpact": "HIGH",
        "privilegesRequired": "LOW",
        "scope": "UNCHANGED",
        "userInteraction": "NONE",
        "vectorString": "CVSS:3.1/AV:N/AC:L/PR:L/UI:N/S:U/C:H/I:H/A:N",
        "version": "3.1"
      },
      "exploitabilityScore": 2.8,
      "impactScore": 5.2
    }
  },
  "publicationDate": "2022-05-26T17:15:09.077",
  "lastModifiedDate": "2024-03-27T15:02:35.557"
}
