{
  "cve": {
    "id": "CVE-2022-39260",
    "sourceIdentifier": "security-advisories@github.com",
    "published": "2022-10-19T12:15:10.160",
    "lastModified": "2023-12-27T10:15:37.793",
    "vulnStatus": "Modified",
    "descriptions": [
      {
        "lang": "en",
        "value": "Git is an open source, scalable, distributed revision control system. `git shell` is a restricted login shell that can be used to implement Git's push/pull functionality via SSH. In versions prior to 2.30.6, 2.31.5, 2.32.4, 2.33.5, 2.34.5, 2.35.5, 2.36.3, and 2.37.4, the function that splits the command arguments into an array improperly uses an `int` to represent the number of entries in the array, allowing a malicious actor to intentionally overflow the return value, leading to arbitrary heap writes. Because the resulting array is then passed to `execv()`, it is possible to leverage this attack to gain remote code execution on a victim machine. Note that a victim must first allow access to `git shell` as a login shell in order to be vulnerable to this attack. This problem is patched in versions 2.30.6, 2.31.5, 2.32.4, 2.33.5, 2.34.5, 2.35.5, 2.36.3, and 2.37.4 and users are advised to upgrade to the latest version. Disabling `git shell` access via remote logins is a viable short-term workaround."
      },
      {
        "lang": "es",
        "value": "Git es un sistema de control de revisiones distribuido, escalable y de código abierto. \"git shell\" es un shell de acceso restringido que puede ser usado para implementar la funcionalidad push/pull de Git por medio de SSH. En versiones anteriores a 2.30.6, 2.31.5, 2.32.4, 2.33.5, 2.34.5, 2.35.5, 2.36.3 y 2.37.4, la función que divide los argumentos del comando en un array usa incorrectamente un \"int\" para representar el número de entradas en el array, permitiendo a un actor malicioso desbordar intencionadamente el valor de retorno, conllevando a escrituras arbitrarias en la pila. Dado que la matriz resultante es pasada a \"execv()\", es posible aprovechar este ataque para obtener la ejecución de código remota en una máquina víctima. Tenga en cuenta que una víctima debe permitir primero el acceso a \"git shell\" como shell de inicio de sesión para ser vulnerable a este ataque. Este problema está parcheado en versiones 2.30.6, 2.31.5, 2.32.4, 2.33.5, 2.34.5, 2.35.5, 2.36.3 y 2.37.4 y es recomendado a usuarios actualizar a la última versión. Deshabilitar el acceso al \"git shell\" por medio de inicios de sesión remotos es una mitigación viable a corto plazo"
      }
    ],
    "metrics": {
      "cvssMetricV31": [
        {
          "source": "nvd@nist.gov",
          "type": "Primary",
          "cvssData": {
            "attackComplexity": "LOW",
            "attackVector": "NETWORK",
            "availabilityImpact": "HIGH",
            "baseScore": 8.8,
            "baseSeverity": "HIGH",
            "confidentialityImpact": "HIGH",
            "integrityImpact": "HIGH",
            "privilegesRequired": "NONE",
            "scope": "UNCHANGED",
            "userInteraction": "REQUIRED",
            "vectorString": "CVSS:3.1/AV:N/AC:L/PR:N/UI:R/S:U/C:H/I:H/A:H",
            "version": "3.1"
          },
          "exploitabilityScore": 2.8,
          "impactScore": 5.9
        },
        {
          "source": "security-advisories@github.com",
          "type": "Secondary",
          "cvssData": {
            "attackComplexity": "HIGH",
            "attackVector": "NETWORK",
            "availabilityImpact": "HIGH",
            "baseScore": 8.5,
            "baseSeverity": "HIGH",
            "confidentialityImpact": "HIGH",
            "integrityImpact": "HIGH",
            "privilegesRequired": "LOW",
            "scope": "CHANGED",
            "userInteraction": "NONE",
            "vectorString": "CVSS:3.1/AV:N/AC:H/PR:L/UI:N/S:C/C:H/I:H/A:H",
            "version": "3.1"
          },
          "exploitabilityScore": 1.8,
          "impactScore": 6
        }
      ],
      "cvssMetricV30": null,
      "cvssMetricV2": null
    },
    "weaknesses": [
      {
        "source": "security-advisories@github.com",
        "type": "Primary",
        "description": [
          {
            "lang": "en",
            "value": "CWE-122"
          },
          {
            "lang": "en",
            "value": "CWE-787"
          }
        ]
      },
      {
        "source": "nvd@nist.gov",
        "type": "Secondary",
        "description": [
          {
            "lang": "en",
            "value": "CWE-787"
          }
        ]
      }
    ],
    "configurations": [
      {
        "nodes": [
          {
            "operator": "OR",
            "negate": false,
            "cpeMatch": [
              {
                "vulnerable": true,
                "criteria": "cpe:2.3:a:git-scm:git:*:*:*:*:*:*:*:*",
                "matchCriteriaId": "28199E8F-36D0-46F8-AF0A-9460390BE56F",
                "versionEndExcluding": "2.30.6"
              },
              {
                "vulnerable": true,
                "criteria": "cpe:2.3:a:git-scm:git:*:*:*:*:*:*:*:*",
                "matchCriteriaId": "E095AAE7-18C2-4957-9740-FC804860B9C2",
                "versionStartIncluding": "2.31.0",
                "versionEndExcluding": "2.31.5"
              },
              {
                "vulnerable": true,
                "criteria": "cpe:2.3:a:git-scm:git:*:*:*:*:*:*:*:*",
                "matchCriteriaId": "459EE43E-40FB-45BE-A1CC-51435E9F92AD",
                "versionStartIncluding": "2.32.0",
                "versionEndExcluding": "2.32.4"
              },
              {
                "vulnerable": true,
                "criteria": "cpe:2.3:a:git-scm:git:*:*:*:*:*:*:*:*",
                "matchCriteriaId": "2CBDDA42-F5EC-4747-BF3C-16683D684702",
                "versionStartIncluding": "2.33.0",
                "versionEndExcluding": "2.33.5"
              },
              {
                "vulnerable": true,
                "criteria": "cpe:2.3:a:git-scm:git:*:*:*:*:*:*:*:*",
                "matchCriteriaId": "D7691E22-145E-4D97-A6E0-6515742781B9",
                "versionStartIncluding": "2.34.0",
                "versionEndExcluding": "2.34.5"
              },
              {
                "vulnerable": true,
                "criteria": "cpe:2.3:a:git-scm:git:*:*:*:*:*:*:*:*",
                "matchCriteriaId": "E02396C2-BB34-4D18-917E-DA56EA7B58B9",
                "versionStartIncluding": "2.35.0",
                "versionEndExcluding": "2.35.5"
              },
              {
                "vulnerable": true,
                "criteria": "cpe:2.3:a:git-scm:git:*:*:*:*:*:*:*:*",
                "matchCriteriaId": "51BEAEEC-9D9D-4CFE-8958-43BFE87DE501",
                "versionStartIncluding": "2.36.0",
                "versionEndExcluding": "2.36.3"
              },
              {
                "vulnerable": true,
                "criteria": "cpe:2.3:a:git-scm:git:*:*:*:*:*:*:*:*",
                "matchCriteriaId": "566CF89C-AC39-47D7-B3DE-633B2237F816",
                "versionStartIncluding": "2.37.0",
                "versionEndExcluding": "2.37.4"
              },
              {
                "vulnerable": true,
                "criteria": "cpe:2.3:a:git-scm:git:2.38.0:*:*:*:*:*:*:*",
                "matchCriteriaId": "1AFEECCB-B8DB-4270-A860-C2BA1C7B267C"
              }
            ]
          }
        ]
      },
      {
        "nodes": [
          {
            "operator": "OR",
            "negate": false,
            "cpeMatch": [
              {
                "vulnerable": true,
                "criteria": "cpe:2.3:o:fedoraproject:fedora:35:*:*:*:*:*:*:*",
                "matchCriteriaId": "80E516C0-98A4-4ADE-B69F-66A772E2BAAA"
              },
              {
                "vulnerable": true,
                "criteria": "cpe:2.3:o:fedoraproject:fedora:36:*:*:*:*:*:*:*",
                "matchCriteriaId": "5C675112-476C-4D7C-BCB9-A2FB2D0BC9FD"
              },
              {
                "vulnerable": true,
                "criteria": "cpe:2.3:o:fedoraproject:fedora:37:*:*:*:*:*:*:*",
                "matchCriteriaId": "E30D0E6F-4AE8-4284-8716-991DFA48CC5D"
              }
            ]
          }
        ]
      },
      {
        "nodes": [
          {
            "operator": "OR",
            "negate": false,
            "cpeMatch": [
              {
                "vulnerable": true,
                "criteria": "cpe:2.3:a:apple:xcode:*:*:*:*:*:*:*:*",
                "matchCriteriaId": "CECD39AA-41F4-4638-B59A-C5E928B585C3",
                "versionEndExcluding": "14.1"
              }
            ]
          }
        ]
      },
      {
        "nodes": [
          {
            "operator": "OR",
            "negate": false,
            "cpeMatch": [
              {
                "vulnerable": true,
                "criteria": "cpe:2.3:o:debian:debian_linux:10.0:*:*:*:*:*:*:*",
                "matchCriteriaId": "07B237A9-69A3-4A9C-9DA0-4E06BD37AE73"
              }
            ]
          }
        ]
      }
    ],
    "references": [
      {
        "url": "http://seclists.org/fulldisclosure/2022/Nov/1",
        "source": "security-advisories@github.com",
        "tags": [
          "Mailing List",
          "Third Party Advisory"
        ]
      },
      {
        "url": "https://github.com/git/git/security/advisories/GHSA-rjr6-wcq6-83p6",
        "source": "security-advisories@github.com",
        "tags": [
          "Mitigation",
          "Third Party Advisory"
        ]
      },
      {
        "url": "https://lists.debian.org/debian-lts-announce/2022/12/msg00025.html",
        "source": "security-advisories@github.com",
        "tags": [
          "Mailing List",
          "Third Party Advisory"
        ]
      },
      {
        "url": "https://lists.fedoraproject.org/archives/list/package-announce%40lists.fedoraproject.org/message/C7B6JPKX5CGGLAHXJVQMIZNNEEB72FHD/",
        "source": "security-advisories@github.com"
      },
      {
        "url": "https://lists.fedoraproject.org/archives/list/package-announce%40lists.fedoraproject.org/message/OHNO2FB55CPX47BAXMBWUBGWHO6N6ZZH/",
        "source": "security-advisories@github.com"
      },
      {
        "url": "https://lists.fedoraproject.org/archives/list/package-announce%40lists.fedoraproject.org/message/UKFHE4KVD7EKS5J3KTDFVBEKU3CLXGVV/",
        "source": "security-advisories@github.com"
      },
      {
        "url": "https://security.gentoo.org/glsa/202312-15",
        "source": "security-advisories@github.com"
      },
      {
        "url": "https://support.apple.com/kb/HT213496",
        "source": "security-advisories@github.com",
        "tags": [
          "Third Party Advisory"
        ]
      }
    ],
    "data_type": "MITRE",
    "data_format": "CVE",
    "data_version": "4.0",
    "CVE_data_meta": {
      "ASSIGNER": "security-advisories@github.com",
      "ID": "CVE-2022-39260"
    },
    "problemtype": {
      "problemtype_data": [
        {
          "description": [
            {
              "lang": "en",
              "value": "CWE-122"
            },
            {
              "lang": "en",
              "value": "CWE-787"
            }
          ]
        },
        {
          "description": [
            {
              "lang": "en",
              "value": "CWE-787"
            }
          ]
        }
      ]
    },
    "description": {
      "description_data": [
        {
          "lang": "en",
          "value": "Git is an open source, scalable, distributed revision control system. `git shell` is a restricted login shell that can be used to implement Git's push/pull functionality via SSH. In versions prior to 2.30.6, 2.31.5, 2.32.4, 2.33.5, 2.34.5, 2.35.5, 2.36.3, and 2.37.4, the function that splits the command arguments into an array improperly uses an `int` to represent the number of entries in the array, allowing a malicious actor to intentionally overflow the return value, leading to arbitrary heap writes. Because the resulting array is then passed to `execv()`, it is possible to leverage this attack to gain remote code execution on a victim machine. Note that a victim must first allow access to `git shell` as a login shell in order to be vulnerable to this attack. This problem is patched in versions 2.30.6, 2.31.5, 2.32.4, 2.33.5, 2.34.5, 2.35.5, 2.36.3, and 2.37.4 and users are advised to upgrade to the latest version. Disabling `git shell` access via remote logins is a viable short-term workaround."
        },
        {
          "lang": "es",
          "value": "Git es un sistema de control de revisiones distribuido, escalable y de código abierto. \"git shell\" es un shell de acceso restringido que puede ser usado para implementar la funcionalidad push/pull de Git por medio de SSH. En versiones anteriores a 2.30.6, 2.31.5, 2.32.4, 2.33.5, 2.34.5, 2.35.5, 2.36.3 y 2.37.4, la función que divide los argumentos del comando en un array usa incorrectamente un \"int\" para representar el número de entradas en el array, permitiendo a un actor malicioso desbordar intencionadamente el valor de retorno, conllevando a escrituras arbitrarias en la pila. Dado que la matriz resultante es pasada a \"execv()\", es posible aprovechar este ataque para obtener la ejecución de código remota en una máquina víctima. Tenga en cuenta que una víctima debe permitir primero el acceso a \"git shell\" como shell de inicio de sesión para ser vulnerable a este ataque. Este problema está parcheado en versiones 2.30.6, 2.31.5, 2.32.4, 2.33.5, 2.34.5, 2.35.5, 2.36.3 y 2.37.4 y es recomendado a usuarios actualizar a la última versión. Deshabilitar el acceso al \"git shell\" por medio de inicios de sesión remotos es una mitigación viable a corto plazo"
        }
      ]
    }
  },
  "configurations": {
    "CVE_data_version": "4.0",
    "nodes": [
      {
        "operator": "OR",
        "cpe_match": [
          {
            "vulnerable": true,
            "cpe23Uri": "cpe:2.3:a:git-scm:git:*:*:*:*:*:*:*:*",
            "versionEndExcluding": "2.30.6"
          },
          {
            "vulnerable": true,
            "cpe23Uri": "cpe:2.3:a:git-scm:git:*:*:*:*:*:*:*:*",
            "versionStartIncluding": "2.31.0",
            "versionEndExcluding": "2.31.5"
          },
          {
            "vulnerable": true,
            "cpe23Uri": "cpe:2.3:a:git-scm:git:*:*:*:*:*:*:*:*",
            "versionStartIncluding": "2.32.0",
            "versionEndExcluding": "2.32.4"
          },
          {
            "vulnerable": true,
            "cpe23Uri": "cpe:2.3:a:git-scm:git:*:*:*:*:*:*:*:*",
            "versionStartIncluding": "2.33.0",
            "versionEndExcluding": "2.33.5"
          },
          {
            "vulnerable": true,
            "cpe23Uri": "cpe:2.3:a:git-scm:git:*:*:*:*:*:*:*:*",
            "versionStartIncluding": "2.34.0",
            "versionEndExcluding": "2.34.5"
          },
          {
            "vulnerable": true,
            "cpe23Uri": "cpe:2.3:a:git-scm:git:*:*:*:*:*:*:*:*",
            "versionStartIncluding": "2.35.0",
            "versionEndExcluding": "2.35.5"
          },
          {
            "vulnerable": true,
            "cpe23Uri": "cpe:2.3:a:git-scm:git:*:*:*:*:*:*:*:*",
            "versionStartIncluding": "2.36.0",
            "versionEndExcluding": "2.36.3"
          },
          {
            "vulnerable": true,
            "cpe23Uri": "cpe:2.3:a:git-scm:git:*:*:*:*:*:*:*:*",
            "versionStartIncluding": "2.37.0",
            "versionEndExcluding": "2.37.4"
          },
          {
            "vulnerable": true,
            "cpe23Uri": "cpe:2.3:a:git-scm:git:2.38.0:*:*:*:*:*:*:*"
          }
        ]
      },
      {
        "operator": "OR",
        "cpe_match": [
          {
            "vulnerable": true,
            "cpe23Uri": "cpe:2.3:o:fedoraproject:fedora:35:*:*:*:*:*:*:*"
          },
          {
            "vulnerable": true,
            "cpe23Uri": "cpe:2.3:o:fedoraproject:fedora:36:*:*:*:*:*:*:*"
          },
          {
            "vulnerable": true,
            "cpe23Uri": "cpe:2.3:o:fedoraproject:fedora:37:*:*:*:*:*:*:*"
          }
        ]
      },
      {
        "operator": "OR",
        "cpe_match": [
          {
            "vulnerable": true,
            "cpe23Uri": "cpe:2.3:a:apple:xcode:*:*:*:*:*:*:*:*",
            "versionEndExcluding": "14.1"
          }
        ]
      },
      {
        "operator": "OR",
        "cpe_match": [
          {
            "vulnerable": true,
            "cpe23Uri": "cpe:2.3:o:debian:debian_linux:10.0:*:*:*:*:*:*:*"
          }
        ]
      }
    ]
  },
  "impact": {
    "baseMetricV2": {
      "cvssV2": {}
    },
    "baseMetricV3": {
      "cvssV3": {
        "attackComplexity": "LOW",
        "attackVector": "NETWORK",
        "availabilityImpact": "HIGH",
        "baseScore": 8.8,
        "baseSeverity": "HIGH",
        "confidentialityImpact": "HIGH",
        "integrityImpact": "HIGH",
        "privilegesRequired": "NONE",
        "scope": "UNCHANGED",
        "userInteraction": "REQUIRED",
        "vectorString": "CVSS:3.1/AV:N/AC:L/PR:N/UI:R/S:U/C:H/I:H/A:H",
        "version": "3.1"
      },
      "exploitabilityScore": 2.8,
      "impactScore": 5.9
    }
  },
  "publicationDate": "2022-10-19T12:15:10.160",
  "lastModifiedDate": "2023-12-27T10:15:37.793"
}
