module gitlab-depscan

go 1.20

require (
	github.com/logrusorgru/aurora v0.0.0-20200102142835-e9ef32dff381
	github.com/sirupsen/logrus v1.8.1
	github.com/spiegel-im-spiegel/go-cvss v0.2.1
	github.com/stretchr/testify v1.9.0
	github.com/umisama/go-cvss v0.0.0-20150430082624-a4ad666ead9b
	github.com/urfave/cli/v2 v2.4.4
	gitlab.com/gitlab-org/security-products/analyzers/command/v2 v2.2.0
	gitlab.com/gitlab-org/security-products/analyzers/common/v3 v3.2.2
	gitlab.com/gitlab-org/security-products/analyzers/report/v4 v4.1.5
	gitlab.com/gitlab-org/security-products/cwe-info-go v1.0.2
	golang.org/x/mod v0.18.0
)

require (
	github.com/Microsoft/go-winio v0.5.1 // indirect
	github.com/ProtonMail/go-crypto v0.0.0-20211112122917-428f8eabeeb3 // indirect
	github.com/acomagu/bufpipe v1.0.3 // indirect
	github.com/bmatcuk/doublestar v1.3.4 // indirect
	github.com/cpuguy83/go-md2man/v2 v2.0.1 // indirect
	github.com/davecgh/go-spew v1.1.1 // indirect
	github.com/emirpasic/gods v1.12.0 // indirect
	github.com/go-git/gcfg v1.5.0 // indirect
	github.com/go-git/go-billy/v5 v5.3.1 // indirect
	github.com/go-git/go-git/v5 v5.4.2 // indirect
	github.com/imdario/mergo v0.3.12 // indirect
	github.com/jbenet/go-context v0.0.0-20150711004518-d14ea06fba99 // indirect
	github.com/kevinburke/ssh_config v1.1.0 // indirect
	github.com/mitchellh/go-homedir v1.1.0 // indirect
	github.com/otiai10/copy v1.7.0 // indirect
	github.com/pelletier/go-toml v1.9.4 // indirect
	github.com/pmezard/go-difflib v1.0.0 // indirect
	github.com/russross/blackfriday/v2 v2.1.0 // indirect
	github.com/sergi/go-diff v1.2.0 // indirect
	github.com/spiegel-im-spiegel/errs v0.3.4 // indirect
	github.com/xanzy/ssh-agent v0.3.1 // indirect
	gitlab.com/gitlab-org/security-products/analyzers/ruleset/v2 v2.0.2 // indirect
	golang.org/x/crypto v0.0.0-20211209193657-4570a0811e8b // indirect
	golang.org/x/net v0.0.0-20211206223403-eba003a116a9 // indirect
	golang.org/x/sys v0.0.0-20211205182925-97ca703d548d // indirect
	golang.org/x/text v0.3.6 // indirect
	gopkg.in/warnings.v0 v0.1.2 // indirect
	gopkg.in/yaml.v2 v2.4.0 // indirect
	gopkg.in/yaml.v3 v3.0.1 // indirect
)
