{
  "cve": {
    "id": "CVE-2022-24765",
    "sourceIdentifier": "security-advisories@github.com",
    "published": "2022-04-12T18:15:09.390",
    "lastModified": "2023-12-27T10:15:37.267",
    "vulnStatus": "Modified",
    "descriptions": [
      {
        "lang": "en",
        "value": "Git for Windows is a fork of Git containing Windows-specific patches. This vulnerability affects users working on multi-user machines, where untrusted parties have write access to the same hard disk. Those untrusted parties could create the folder `C:\\.git`, which would be picked up by Git operations run supposedly outside a repository while searching for a Git directory. Git would then respect any config in said Git directory. Git Bash users who set `GIT_PS1_SHOWDIRTYSTATE` are vulnerable as well. Users who installed posh-gitare vulnerable simply by starting a PowerShell. Users of IDEs such as Visual Studio are vulnerable: simply creating a new project would already read and respect the config specified in `C:\\.git\\config`. Users of the Microsoft fork of Git are vulnerable simply by starting a Git Bash. The problem has been patched in Git for Windows v2.35.2. Users unable to upgrade may create the folder `.git` on all drives where Git commands are run, and remove read/write access from those folders as a workaround. Alternatively, define or extend `GIT_CEILING_DIRECTORIES` to cover the _parent_ directory of the user profile, e.g. `C:\\Users` if the user profile is located in `C:\\Users\\my-user-name`."
      },
      {
        "lang": "es",
        "value": "Git para Windows es un fork de Git que contiene parches específicos para Windows. Esta vulnerabilidad afecta a usuarios que trabajan en máquinas multiusuario, donde partes no confiables presentan acceso de escritura al mismo disco duro. Estas partes no confiables podrían crear la carpeta \"C:\\.git\", que sería recogida por las operaciones de Git ejecutadas supuestamente fuera de un repositorio mientras es buscado un directorio Git. Git respetaría entonces cualquier configuración en dicho directorio Git. Los usuarios de Git Bash que configuren \"GIT_PS1_SHOWDIRTYSTATE\" también son vulnerables. Los usuarios que hayan instalado posh-git son vulnerables simplemente al iniciar un PowerShell. Los usuarios de IDEs como Visual Studio son vulnerables: la simple creación de un nuevo proyecto ya leería y respetaría la configuración especificada en \"C:\\.git\\config\". Los usuarios del fork de Microsoft de Git son vulnerables simplemente al iniciar un Git Bash. El problema ha sido parcheado en Git para Windows versión v2.35.2. Los usuarios que no puedan actualizarse pueden crear la carpeta \".git\" en todas las unidades en las que sean ejecutados comandos de Git, y eliminar el acceso de lectura/escritura de esas carpetas como medida de mitigación. Como alternativa, defina o amplíe \"GIT_CEILING_DIRECTORIES\" para que cubra el directorio _parent_ del perfil de usuario, por ejemplo, \"C:\\Users\" si el perfil de usuario es encontrado en \"C:\\Users\\my-user-name\""
      }
    ],
    "metrics": {
      "cvssMetricV31": [
        {
          "source": "nvd@nist.gov",
          "type": "Primary",
          "cvssData": {
            "attackComplexity": "LOW",
            "attackVector": "LOCAL",
            "availabilityImpact": "HIGH",
            "baseScore": 7.8,
            "baseSeverity": "HIGH",
            "confidentialityImpact": "HIGH",
            "integrityImpact": "HIGH",
            "privilegesRequired": "LOW",
            "scope": "UNCHANGED",
            "userInteraction": "NONE",
            "vectorString": "CVSS:3.1/AV:L/AC:L/PR:L/UI:N/S:U/C:H/I:H/A:H",
            "version": "3.1"
          },
          "exploitabilityScore": 1.8,
          "impactScore": 5.9
        },
        {
          "source": "security-advisories@github.com",
          "type": "Secondary",
          "cvssData": {
            "attackComplexity": "HIGH",
            "attackVector": "LOCAL",
            "availabilityImpact": "NONE",
            "baseScore": 6,
            "baseSeverity": "MEDIUM",
            "confidentialityImpact": "HIGH",
            "integrityImpact": "HIGH",
            "privilegesRequired": "LOW",
            "scope": "UNCHANGED",
            "userInteraction": "REQUIRED",
            "vectorString": "CVSS:3.1/AV:L/AC:H/PR:L/UI:R/S:U/C:H/I:H/A:N",
            "version": "3.1"
          },
          "exploitabilityScore": 0.8,
          "impactScore": 5.2
        }
      ],
      "cvssMetricV30": null,
      "cvssMetricV2": [
        {
          "source": "nvd@nist.gov",
          "type": "Primary",
          "cvssData": {
            "accessComplexity": "MEDIUM",
            "accessVector": "LOCAL",
            "authentication": "NONE",
            "availabilityImpact": "COMPLETE",
            "baseScore": 6.9,
            "confidentialityImpact": "COMPLETE",
            "integrityImpact": "COMPLETE",
            "vectorString": "AV:L/AC:M/Au:N/C:C/I:C/A:C",
            "version": "2.0"
          },
          "baseSeverity": "MEDIUM",
          "exploitabilityScore": 3.4,
          "impactScore": 10,
          "acInsufInfo": false,
          "obtainAllPrivilege": false,
          "obtainUserPrivilege": false,
          "obtainOtherPrivilege": false,
          "userInteractionRequired": false
        }
      ]
    },
    "weaknesses": [
      {
        "source": "security-advisories@github.com",
        "type": "Primary",
        "description": [
          {
            "lang": "en",
            "value": "CWE-427"
          }
        ]
      }
    ],
    "configurations": [
      {
        "nodes": [
          {
            "operator": "OR",
            "negate": false,
            "cpeMatch": [
              {
                "vulnerable": false,
                "criteria": "cpe:2.3:o:microsoft:windows:-:*:*:*:*:*:*:*",
                "matchCriteriaId": "A2572D17-1DE6-457B-99CC-64AFD54487EA"
              }
            ]
          },
          {
            "operator": "OR",
            "negate": false,
            "cpeMatch": [
              {
                "vulnerable": true,
                "criteria": "cpe:2.3:a:git-scm:git:*:*:*:*:*:*:*:*",
                "matchCriteriaId": "F3ACE235-32E1-429A-9A82-628C9D25CADE",
                "versionEndExcluding": "2.35.2"
              }
            ]
          }
        ]
      },
      {
        "nodes": [
          {
            "operator": "OR",
            "negate": false,
            "cpeMatch": [
              {
                "vulnerable": true,
                "criteria": "cpe:2.3:o:fedoraproject:fedora:34:*:*:*:*:*:*:*",
                "matchCriteriaId": "A930E247-0B43-43CB-98FF-6CE7B8189835"
              },
              {
                "vulnerable": true,
                "criteria": "cpe:2.3:o:fedoraproject:fedora:35:*:*:*:*:*:*:*",
                "matchCriteriaId": "80E516C0-98A4-4ADE-B69F-66A772E2BAAA"
              },
              {
                "vulnerable": true,
                "criteria": "cpe:2.3:o:fedoraproject:fedora:36:*:*:*:*:*:*:*",
                "matchCriteriaId": "5C675112-476C-4D7C-BCB9-A2FB2D0BC9FD"
              },
              {
                "vulnerable": true,
                "criteria": "cpe:2.3:o:fedoraproject:fedora:37:*:*:*:*:*:*:*",
                "matchCriteriaId": "E30D0E6F-4AE8-4284-8716-991DFA48CC5D"
              }
            ]
          }
        ]
      },
      {
        "nodes": [
          {
            "operator": "OR",
            "negate": false,
            "cpeMatch": [
              {
                "vulnerable": true,
                "criteria": "cpe:2.3:a:apple:xcode:*:*:*:*:*:*:*:*",
                "matchCriteriaId": "ABC5ECCF-B646-4686-AE1E-6F1122B108BB",
                "versionEndExcluding": "13.4"
              }
            ]
          }
        ]
      },
      {
        "nodes": [
          {
            "operator": "OR",
            "negate": false,
            "cpeMatch": [
              {
                "vulnerable": true,
                "criteria": "cpe:2.3:o:debian:debian_linux:10.0:*:*:*:*:*:*:*",
                "matchCriteriaId": "07B237A9-69A3-4A9C-9DA0-4E06BD37AE73"
              }
            ]
          }
        ]
      }
    ],
    "references": [
      {
        "url": "http://seclists.org/fulldisclosure/2022/May/31",
        "source": "security-advisories@github.com",
        "tags": [
          "Mailing List",
          "Third Party Advisory"
        ]
      },
      {
        "url": "http://www.openwall.com/lists/oss-security/2022/04/12/7",
        "source": "security-advisories@github.com",
        "tags": [
          "Mailing List",
          "Third Party Advisory"
        ]
      },
      {
        "url": "https://git-scm.com/book/en/v2/Appendix-A%3A-Git-in-Other-Environments-Git-in-Bash",
        "source": "security-advisories@github.com",
        "tags": [
          "Vendor Advisory"
        ]
      },
      {
        "url": "https://git-scm.com/docs/git#Documentation/git.txt-codeGITCEILINGDIRECTORIEScode",
        "source": "security-advisories@github.com",
        "tags": [
          "Vendor Advisory"
        ]
      },
      {
        "url": "https://github.com/git-for-windows/git/security/advisories/GHSA-vw2c-22j4-2fh2",
        "source": "security-advisories@github.com",
        "tags": [
          "Mitigation",
          "Third Party Advisory"
        ]
      },
      {
        "url": "https://lists.debian.org/debian-lts-announce/2022/12/msg00025.html",
        "source": "security-advisories@github.com",
        "tags": [
          "Mailing List",
          "Third Party Advisory"
        ]
      },
      {
        "url": "https://lists.fedoraproject.org/archives/list/package-announce%40lists.fedoraproject.org/message/5PTN5NYEHYN2OQSHSAMCNICZNK2U4QH6/",
        "source": "security-advisories@github.com"
      },
      {
        "url": "https://lists.fedoraproject.org/archives/list/package-announce%40lists.fedoraproject.org/message/BENQYTDGUL6TF3UALY6GSIEXIHUIYNWM/",
        "source": "security-advisories@github.com"
      },
      {
        "url": "https://lists.fedoraproject.org/archives/list/package-announce%40lists.fedoraproject.org/message/DDI325LOO2XBDDKLINOAQJEG6MHAURZE/",
        "source": "security-advisories@github.com"
      },
      {
        "url": "https://lists.fedoraproject.org/archives/list/package-announce%40lists.fedoraproject.org/message/DIKWISWUDFT2FAITYIA6372BVLH3OOOC/",
        "source": "security-advisories@github.com"
      },
      {
        "url": "https://lists.fedoraproject.org/archives/list/package-announce%40lists.fedoraproject.org/message/HVOLER2PIGMHPQMDGG4RDE2KZB74QLA2/",
        "source": "security-advisories@github.com"
      },
      {
        "url": "https://lists.fedoraproject.org/archives/list/package-announce%40lists.fedoraproject.org/message/SLP42KIZ6HACTVZMZLJLFJQ4W2XYT27M/",
        "source": "security-advisories@github.com"
      },
      {
        "url": "https://lists.fedoraproject.org/archives/list/package-announce%40lists.fedoraproject.org/message/TRZG5CDUQ27OWTPC5MQOR4UASNXHWEZS/",
        "source": "security-advisories@github.com"
      },
      {
        "url": "https://lists.fedoraproject.org/archives/list/package-announce%40lists.fedoraproject.org/message/UDZRZAL7QULOB6V7MKT66MOMWJLBJPX4/",
        "source": "security-advisories@github.com"
      },
      {
        "url": "https://lists.fedoraproject.org/archives/list/package-announce%40lists.fedoraproject.org/message/YROCMBWYFKRSS64PO6FUNM6L7LKBUKVW/",
        "source": "security-advisories@github.com"
      },
      {
        "url": "https://security.gentoo.org/glsa/202312-15",
        "source": "security-advisories@github.com"
      },
      {
        "url": "https://support.apple.com/kb/HT213261",
        "source": "security-advisories@github.com",
        "tags": [
          "Third Party Advisory"
        ]
      }
    ],
    "data_type": "MITRE",
    "data_format": "CVE",
    "data_version": "4.0",
    "CVE_data_meta": {
      "ASSIGNER": "security-advisories@github.com",
      "ID": "CVE-2022-24765"
    },
    "problemtype": {
      "problemtype_data": [
        {
          "description": [
            {
              "lang": "en",
              "value": "CWE-427"
            }
          ]
        }
      ]
    },
    "description": {
      "description_data": [
        {
          "lang": "en",
          "value": "Git for Windows is a fork of Git containing Windows-specific patches. This vulnerability affects users working on multi-user machines, where untrusted parties have write access to the same hard disk. Those untrusted parties could create the folder `C:\\.git`, which would be picked up by Git operations run supposedly outside a repository while searching for a Git directory. Git would then respect any config in said Git directory. Git Bash users who set `GIT_PS1_SHOWDIRTYSTATE` are vulnerable as well. Users who installed posh-gitare vulnerable simply by starting a PowerShell. Users of IDEs such as Visual Studio are vulnerable: simply creating a new project would already read and respect the config specified in `C:\\.git\\config`. Users of the Microsoft fork of Git are vulnerable simply by starting a Git Bash. The problem has been patched in Git for Windows v2.35.2. Users unable to upgrade may create the folder `.git` on all drives where Git commands are run, and remove read/write access from those folders as a workaround. Alternatively, define or extend `GIT_CEILING_DIRECTORIES` to cover the _parent_ directory of the user profile, e.g. `C:\\Users` if the user profile is located in `C:\\Users\\my-user-name`."
        },
        {
          "lang": "es",
          "value": "Git para Windows es un fork de Git que contiene parches específicos para Windows. Esta vulnerabilidad afecta a usuarios que trabajan en máquinas multiusuario, donde partes no confiables presentan acceso de escritura al mismo disco duro. Estas partes no confiables podrían crear la carpeta \"C:\\.git\", que sería recogida por las operaciones de Git ejecutadas supuestamente fuera de un repositorio mientras es buscado un directorio Git. Git respetaría entonces cualquier configuración en dicho directorio Git. Los usuarios de Git Bash que configuren \"GIT_PS1_SHOWDIRTYSTATE\" también son vulnerables. Los usuarios que hayan instalado posh-git son vulnerables simplemente al iniciar un PowerShell. Los usuarios de IDEs como Visual Studio son vulnerables: la simple creación de un nuevo proyecto ya leería y respetaría la configuración especificada en \"C:\\.git\\config\". Los usuarios del fork de Microsoft de Git son vulnerables simplemente al iniciar un Git Bash. El problema ha sido parcheado en Git para Windows versión v2.35.2. Los usuarios que no puedan actualizarse pueden crear la carpeta \".git\" en todas las unidades en las que sean ejecutados comandos de Git, y eliminar el acceso de lectura/escritura de esas carpetas como medida de mitigación. Como alternativa, defina o amplíe \"GIT_CEILING_DIRECTORIES\" para que cubra el directorio _parent_ del perfil de usuario, por ejemplo, \"C:\\Users\" si el perfil de usuario es encontrado en \"C:\\Users\\my-user-name\""
        }
      ]
    }
  },
  "configurations": {
    "CVE_data_version": "4.0",
    "nodes": [
      {
        "operator": "OR",
        "cpe_match": [
          {
            "cpe23Uri": "cpe:2.3:o:microsoft:windows:-:*:*:*:*:*:*:*"
          }
        ]
      },
      {
        "operator": "OR",
        "cpe_match": [
          {
            "vulnerable": true,
            "cpe23Uri": "cpe:2.3:a:git-scm:git:*:*:*:*:*:*:*:*",
            "versionEndExcluding": "2.35.2"
          }
        ]
      },
      {
        "operator": "OR",
        "cpe_match": [
          {
            "vulnerable": true,
            "cpe23Uri": "cpe:2.3:o:fedoraproject:fedora:34:*:*:*:*:*:*:*"
          },
          {
            "vulnerable": true,
            "cpe23Uri": "cpe:2.3:o:fedoraproject:fedora:35:*:*:*:*:*:*:*"
          },
          {
            "vulnerable": true,
            "cpe23Uri": "cpe:2.3:o:fedoraproject:fedora:36:*:*:*:*:*:*:*"
          },
          {
            "vulnerable": true,
            "cpe23Uri": "cpe:2.3:o:fedoraproject:fedora:37:*:*:*:*:*:*:*"
          }
        ]
      },
      {
        "operator": "OR",
        "cpe_match": [
          {
            "vulnerable": true,
            "cpe23Uri": "cpe:2.3:a:apple:xcode:*:*:*:*:*:*:*:*",
            "versionEndExcluding": "13.4"
          }
        ]
      },
      {
        "operator": "OR",
        "cpe_match": [
          {
            "vulnerable": true,
            "cpe23Uri": "cpe:2.3:o:debian:debian_linux:10.0:*:*:*:*:*:*:*"
          }
        ]
      }
    ]
  },
  "impact": {
    "baseMetricV2": {
      "cvssV2": {
        "accessComplexity": "MEDIUM",
        "accessVector": "LOCAL",
        "authentication": "NONE",
        "availabilityImpact": "COMPLETE",
        "baseScore": 6.9,
        "confidentialityImpact": "COMPLETE",
        "integrityImpact": "COMPLETE",
        "vectorString": "AV:L/AC:M/Au:N/C:C/I:C/A:C",
        "version": "2.0"
      },
      "exploitabilityScore": 3.4,
      "impactScore": 10,
      "severity": "MEDIUM"
    },
    "baseMetricV3": {
      "cvssV3": {
        "attackComplexity": "LOW",
        "attackVector": "LOCAL",
        "availabilityImpact": "HIGH",
        "baseScore": 7.8,
        "baseSeverity": "HIGH",
        "confidentialityImpact": "HIGH",
        "integrityImpact": "HIGH",
        "privilegesRequired": "LOW",
        "scope": "UNCHANGED",
        "userInteraction": "NONE",
        "vectorString": "CVSS:3.1/AV:L/AC:L/PR:L/UI:N/S:U/C:H/I:H/A:H",
        "version": "3.1"
      },
      "exploitabilityScore": 1.8,
      "impactScore": 5.9
    }
  },
  "publicationDate": "2022-04-12T18:15:09.390",
  "lastModifiedDate": "2023-12-27T10:15:37.267"
}
