{
  "cve": {
    "id": "CVE-2022-36883",
    "sourceIdentifier": "jenkinsci-cert@googlegroups.com",
    "published": "2022-07-27T15:15:08.880",
    "lastModified": "2023-11-22T21:12:01.140",
    "vulnStatus": "Analyzed",
    "descriptions": [
      {
        "lang": "en",
        "value": "A missing permission check in Jenkins Git Plugin 4.11.3 and earlier allows unauthenticated attackers to trigger builds of jobs configured to use an attacker-specified Git repository and to cause them to check out an attacker-specified commit."
      },
      {
        "lang": "es",
        "value": "Una falta de comprobación de permisos en Jenkins Git Plugin versiones 4.11.3 y anteriores, permite a atacantes no autenticados desencadenar construcciones de trabajos configurados para usar un repositorio Git especificado por el atacante y causarles una comprobación de un commit especificado por el atacante"
      }
    ],
    "metrics": {
      "cvssMetricV31": [
        {
          "source": "nvd@nist.gov",
          "type": "Primary",
          "cvssData": {
            "attackComplexity": "LOW",
            "attackVector": "NETWORK",
            "availabilityImpact": "NONE",
            "baseScore": 7.5,
            "baseSeverity": "HIGH",
            "confidentialityImpact": "NONE",
            "integrityImpact": "HIGH",
            "privilegesRequired": "NONE",
            "scope": "UNCHANGED",
            "userInteraction": "NONE",
            "vectorString": "CVSS:3.1/AV:N/AC:L/PR:N/UI:N/S:U/C:N/I:H/A:N",
            "version": "3.1"
          },
          "exploitabilityScore": 3.9,
          "impactScore": 3.6
        }
      ],
      "cvssMetricV30": null,
      "cvssMetricV2": null
    },
    "weaknesses": [
      {
        "source": "nvd@nist.gov",
        "type": "Primary",
        "description": [
          {
            "lang": "en",
            "value": "CWE-862"
          }
        ]
      }
    ],
    "configurations": [
      {
        "nodes": [
          {
            "operator": "OR",
            "negate": false,
            "cpeMatch": [
              {
                "vulnerable": true,
                "criteria": "cpe:2.3:a:jenkins:git:*:*:*:*:*:jenkins:*:*",
                "matchCriteriaId": "3CFA4D2B-B59E-406D-81B2-D1E91B0DABB9",
                "versionEndIncluding": "4.11.3"
              }
            ]
          }
        ]
      }
    ],
    "references": [
      {
        "url": "http://www.openwall.com/lists/oss-security/2022/07/27/1",
        "source": "jenkinsci-cert@googlegroups.com",
        "tags": [
          "Mailing List",
          "Third Party Advisory"
        ]
      },
      {
        "url": "https://www.jenkins.io/security/advisory/2022-07-27/#SECURITY-284",
        "source": "jenkinsci-cert@googlegroups.com",
        "tags": [
          "Vendor Advisory"
        ]
      }
    ],
    "data_type": "MITRE",
    "data_format": "CVE",
    "data_version": "4.0",
    "CVE_data_meta": {
      "ASSIGNER": "jenkinsci-cert@googlegroups.com",
      "ID": "CVE-2022-36883"
    },
    "problemtype": {
      "problemtype_data": [
        {
          "description": [
            {
              "lang": "en",
              "value": "CWE-862"
            }
          ]
        }
      ]
    },
    "description": {
      "description_data": [
        {
          "lang": "en",
          "value": "A missing permission check in Jenkins Git Plugin 4.11.3 and earlier allows unauthenticated attackers to trigger builds of jobs configured to use an attacker-specified Git repository and to cause them to check out an attacker-specified commit."
        },
        {
          "lang": "es",
          "value": "Una falta de comprobación de permisos en Jenkins Git Plugin versiones 4.11.3 y anteriores, permite a atacantes no autenticados desencadenar construcciones de trabajos configurados para usar un repositorio Git especificado por el atacante y causarles una comprobación de un commit especificado por el atacante"
        }
      ]
    }
  },
  "configurations": {
    "CVE_data_version": "4.0",
    "nodes": [
      {
        "operator": "OR",
        "cpe_match": [
          {
            "vulnerable": true,
            "cpe23Uri": "cpe:2.3:a:jenkins:git:*:*:*:*:*:jenkins:*:*",
            "versionEndIncluding": "4.11.3"
          }
        ]
      }
    ]
  },
  "impact": {
    "baseMetricV2": {
      "cvssV2": {}
    },
    "baseMetricV3": {
      "cvssV3": {
        "attackComplexity": "LOW",
        "attackVector": "NETWORK",
        "availabilityImpact": "NONE",
        "baseScore": 7.5,
        "baseSeverity": "HIGH",
        "confidentialityImpact": "NONE",
        "integrityImpact": "HIGH",
        "privilegesRequired": "NONE",
        "scope": "UNCHANGED",
        "userInteraction": "NONE",
        "vectorString": "CVSS:3.1/AV:N/AC:L/PR:N/UI:N/S:U/C:N/I:H/A:N",
        "version": "3.1"
      },
      "exploitabilityScore": 3.9,
      "impactScore": 3.6
    }
  },
  "publicationDate": "2022-07-27T15:15:08.880",
  "lastModifiedDate": "2023-11-22T21:12:01.140"
}
