{
  "cve": {
    "id": "CVE-2022-3647",
    "sourceIdentifier": "cna@vuldb.com",
    "published": "2022-10-21T18:15:10.183",
    "lastModified": "2024-05-17T02:13:01.677",
    "vulnStatus": "Modified",
    "descriptions": [
      {
        "lang": "en",
        "value": "** DISPUTED ** A vulnerability, which was classified as problematic, was found in Redis up to 6.2.7/7.0.5. Affected is the function sigsegvHandler of the file debug.c of the component Crash Report. The manipulation leads to denial of service. The complexity of an attack is rather high. The exploitability is told to be difficult. The real existence of this vulnerability is still doubted at the moment. Upgrading to version 6.2.8 and 7.0.6 is able to address this issue. The patch is identified as 0bf90d944313919eb8e63d3588bf63a367f020a3. It is recommended to apply a patch to fix this issue. VDB-211962 is the identifier assigned to this vulnerability. NOTE: The vendor claims that this is not a DoS because it applies to the crash logging mechanism which is triggered after a crash has occurred."
      },
      {
        "lang": "es",
        "value": "** EN DISPUTA ** Se ha encontrado una vulnerabilidad, clasificada como problemática, en Redis. La función afectada es sigsegvHandler del archivo debug.c del componente Crash Report. La manipulación conlleva a una denegación de servicio. El nombre del parche es 0bf90d944313919eb8e63d3588bf63a367f020a3. Es recomendado aplicar un parche para corregir este problema. VDB-211962 es el identificador asignado a esta vulnerabilidad. NOTA: El proveedor afirma que esto no es un DoS porque se aplica al mecanismo de registro de fallos que se activa después de que se haya producido un fallo"
      }
    ],
    "metrics": {
      "cvssMetricV31": [
        {
          "source": "nvd@nist.gov",
          "type": "Primary",
          "cvssData": {
            "attackComplexity": "LOW",
            "attackVector": "LOCAL",
            "availabilityImpact": "LOW",
            "baseScore": 3.3,
            "baseSeverity": "LOW",
            "confidentialityImpact": "NONE",
            "integrityImpact": "NONE",
            "privilegesRequired": "LOW",
            "scope": "UNCHANGED",
            "userInteraction": "NONE",
            "vectorString": "CVSS:3.1/AV:L/AC:L/PR:L/UI:N/S:U/C:N/I:N/A:L",
            "version": "3.1"
          },
          "exploitabilityScore": 1.8,
          "impactScore": 1.4
        },
        {
          "source": "cna@vuldb.com",
          "type": "Secondary",
          "cvssData": {
            "attackComplexity": "HIGH",
            "attackVector": "ADJACENT_NETWORK",
            "availabilityImpact": "LOW",
            "baseScore": 3.1,
            "baseSeverity": "LOW",
            "confidentialityImpact": "NONE",
            "integrityImpact": "NONE",
            "privilegesRequired": "NONE",
            "scope": "UNCHANGED",
            "userInteraction": "NONE",
            "vectorString": "CVSS:3.1/AV:A/AC:H/PR:N/UI:N/S:U/C:N/I:N/A:L",
            "version": "3.1"
          },
          "exploitabilityScore": 1.6,
          "impactScore": 1.4
        }
      ],
      "cvssMetricV30": null,
      "cvssMetricV2": [
        {
          "source": "cna@vuldb.com",
          "type": "Secondary",
          "cvssData": {
            "accessComplexity": "HIGH",
            "accessVector": "ADJACENT_NETWORK",
            "authentication": "NONE",
            "availabilityImpact": "PARTIAL",
            "baseScore": 1.8,
            "confidentialityImpact": "NONE",
            "integrityImpact": "NONE",
            "vectorString": "AV:A/AC:H/Au:N/C:N/I:N/A:P",
            "version": "2.0"
          },
          "baseSeverity": "LOW",
          "exploitabilityScore": 3.2,
          "impactScore": 2.9,
          "acInsufInfo": false,
          "obtainAllPrivilege": false,
          "obtainUserPrivilege": false,
          "obtainOtherPrivilege": false,
          "userInteractionRequired": false
        }
      ]
    },
    "weaknesses": [
      {
        "source": "cna@vuldb.com",
        "type": "Primary",
        "description": [
          {
            "lang": "en",
            "value": "CWE-404"
          }
        ]
      }
    ],
    "configurations": [
      {
        "nodes": [
          {
            "operator": "OR",
            "negate": false,
            "cpeMatch": [
              {
                "vulnerable": true,
                "criteria": "cpe:2.3:a:redis:redis:*:*:*:*:*:*:*:*",
                "matchCriteriaId": "3AB9C586-1F6D-4C22-8F85-034DBE4D0D9F",
                "versionEndExcluding": "6.2.8"
              },
              {
                "vulnerable": true,
                "criteria": "cpe:2.3:a:redis:redis:*:*:*:*:*:*:*:*",
                "matchCriteriaId": "685E9820-B344-40FE-9379-60A2826EB459",
                "versionStartIncluding": "7.0.0",
                "versionEndExcluding": "7.0.6"
              }
            ]
          }
        ]
      }
    ],
    "references": [
      {
        "url": "https://github.com/redis/redis/commit/0bf90d944313919eb8e63d3588bf63a367f020a3",
        "source": "cna@vuldb.com",
        "tags": [
          "Exploit",
          "Patch",
          "Third Party Advisory"
        ]
      },
      {
        "url": "https://vuldb.com/?ctiid.211962",
        "source": "cna@vuldb.com",
        "tags": [
          "Permissions Required",
          "Third Party Advisory",
          "VDB Entry"
        ]
      },
      {
        "url": "https://vuldb.com/?id.211962",
        "source": "cna@vuldb.com",
        "tags": [
          "Third Party Advisory",
          "VDB Entry"
        ]
      }
    ],
    "data_type": "MITRE",
    "data_format": "CVE",
    "data_version": "4.0",
    "CVE_data_meta": {
      "ASSIGNER": "cna@vuldb.com",
      "ID": "CVE-2022-3647"
    },
    "problemtype": {
      "problemtype_data": [
        {
          "description": [
            {
              "lang": "en",
              "value": "CWE-404"
            }
          ]
        }
      ]
    },
    "description": {
      "description_data": [
        {
          "lang": "en",
          "value": "** DISPUTED ** A vulnerability, which was classified as problematic, was found in Redis up to 6.2.7/7.0.5. Affected is the function sigsegvHandler of the file debug.c of the component Crash Report. The manipulation leads to denial of service. The complexity of an attack is rather high. The exploitability is told to be difficult. The real existence of this vulnerability is still doubted at the moment. Upgrading to version 6.2.8 and 7.0.6 is able to address this issue. The patch is identified as 0bf90d944313919eb8e63d3588bf63a367f020a3. It is recommended to apply a patch to fix this issue. VDB-211962 is the identifier assigned to this vulnerability. NOTE: The vendor claims that this is not a DoS because it applies to the crash logging mechanism which is triggered after a crash has occurred."
        },
        {
          "lang": "es",
          "value": "** EN DISPUTA ** Se ha encontrado una vulnerabilidad, clasificada como problemática, en Redis. La función afectada es sigsegvHandler del archivo debug.c del componente Crash Report. La manipulación conlleva a una denegación de servicio. El nombre del parche es 0bf90d944313919eb8e63d3588bf63a367f020a3. Es recomendado aplicar un parche para corregir este problema. VDB-211962 es el identificador asignado a esta vulnerabilidad. NOTA: El proveedor afirma que esto no es un DoS porque se aplica al mecanismo de registro de fallos que se activa después de que se haya producido un fallo"
        }
      ]
    }
  },
  "configurations": {
    "CVE_data_version": "4.0",
    "nodes": [
      {
        "operator": "OR",
        "cpe_match": [
          {
            "vulnerable": true,
            "cpe23Uri": "cpe:2.3:a:redis:redis:*:*:*:*:*:*:*:*",
            "versionEndExcluding": "6.2.8"
          },
          {
            "vulnerable": true,
            "cpe23Uri": "cpe:2.3:a:redis:redis:*:*:*:*:*:*:*:*",
            "versionStartIncluding": "7.0.0",
            "versionEndExcluding": "7.0.6"
          }
        ]
      }
    ]
  },
  "impact": {
    "baseMetricV2": {
      "cvssV2": {
        "accessComplexity": "HIGH",
        "accessVector": "ADJACENT_NETWORK",
        "authentication": "NONE",
        "availabilityImpact": "PARTIAL",
        "baseScore": 1.8,
        "confidentialityImpact": "NONE",
        "integrityImpact": "NONE",
        "vectorString": "AV:A/AC:H/Au:N/C:N/I:N/A:P",
        "version": "2.0"
      },
      "exploitabilityScore": 3.2,
      "impactScore": 2.9,
      "severity": "LOW"
    },
    "baseMetricV3": {
      "cvssV3": {
        "attackComplexity": "LOW",
        "attackVector": "LOCAL",
        "availabilityImpact": "LOW",
        "baseScore": 3.3,
        "baseSeverity": "LOW",
        "confidentialityImpact": "NONE",
        "integrityImpact": "NONE",
        "privilegesRequired": "LOW",
        "scope": "UNCHANGED",
        "userInteraction": "NONE",
        "vectorString": "CVSS:3.1/AV:L/AC:L/PR:L/UI:N/S:U/C:N/I:N/A:L",
        "version": "3.1"
      },
      "exploitabilityScore": 1.8,
      "impactScore": 1.4
    }
  },
  "publicationDate": "2022-10-21T18:15:10.183",
  "lastModifiedDate": "2024-05-17T02:13:01.677"
}
