module github.com/aquasecurity/trivy

go 1.22.0

toolchain go1.22.4

require (
	github.com/Azure/azure-sdk-for-go v68.0.0+incompatible
	github.com/Azure/azure-sdk-for-go/sdk/azcore v1.14.0
	github.com/Azure/azure-sdk-for-go/sdk/azidentity v1.7.0
	github.com/BurntSushi/toml v1.4.0
	github.com/CycloneDX/cyclonedx-go v0.9.0
	github.com/GoogleCloudPlatform/docker-credential-gcr v2.0.5+incompatible
	github.com/Masterminds/sprig/v3 v3.3.0
	github.com/NYTimes/gziphandler v1.1.1
	github.com/alecthomas/chroma v0.10.0
	github.com/alicebob/miniredis/v2 v2.33.0
	github.com/antchfx/htmlquery v1.3.2
	github.com/apparentlymart/go-cidr v1.1.0
	github.com/aquasecurity/bolt-fixtures v0.0.0-20200903104109-d34e7f983986
	github.com/aquasecurity/go-gem-version v0.0.0-20201115065557-8eed6fe000ce
	github.com/aquasecurity/go-npm-version v0.0.0-20201110091526-0b796d180798
	github.com/aquasecurity/go-pep440-version v0.0.0-20210121094942-22b2f8951d46
	github.com/aquasecurity/go-version v0.0.0-20240603093900-cf8a8d29271d
	github.com/aquasecurity/table v1.8.0
	github.com/aquasecurity/testdocker v0.0.0-20240730042311-4642e94c7fc8
	github.com/aquasecurity/tml v0.6.1
	github.com/aquasecurity/trivy-checks v0.13.1-0.20240830230553-53ddbbade784
	github.com/aquasecurity/trivy-db v0.0.0-20240718084044-d23a6ca8ba04
	github.com/aquasecurity/trivy-java-db v0.0.0-20240109071736-184bd7481d48
	github.com/aquasecurity/trivy-kubernetes v0.6.7-0.20240707095038-0300bc49b68b
	github.com/aws/aws-sdk-go-v2 v1.30.5
	github.com/aws/aws-sdk-go-v2/config v1.27.33
	github.com/aws/aws-sdk-go-v2/credentials v1.17.32
	github.com/aws/aws-sdk-go-v2/service/ec2 v1.177.2
	github.com/aws/aws-sdk-go-v2/service/ecr v1.32.4
	github.com/aws/aws-sdk-go-v2/service/s3 v1.61.2
	github.com/aws/aws-sdk-go-v2/service/sts v1.30.7 // indirect
	github.com/aws/smithy-go v1.20.4
	github.com/bitnami/go-version v0.0.0-20231130084017-bb00604d650c
	github.com/bmatcuk/doublestar/v4 v4.6.1
	github.com/cenkalti/backoff/v4 v4.3.0
	github.com/cheggaaa/pb/v3 v3.1.5
	github.com/containerd/containerd v1.7.21
	github.com/csaf-poc/csaf_distribution/v3 v3.0.0
	github.com/docker/docker v27.2.0+incompatible
	github.com/docker/go-connections v0.5.0
	github.com/fatih/color v1.17.0
	github.com/go-git/go-git/v5 v5.12.0
	github.com/go-openapi/runtime v0.28.0 // indirect
	github.com/go-openapi/strfmt v0.23.0 // indirect
	github.com/go-redis/redis/v8 v8.11.5
	github.com/golang-jwt/jwt/v5 v5.2.1
	github.com/google/go-containerregistry v0.20.2
	github.com/google/go-github/v62 v62.0.0
	github.com/google/licenseclassifier/v2 v2.0.0
	github.com/google/uuid v1.6.0
	github.com/google/wire v0.6.0
	github.com/hashicorp/go-getter v1.7.6
	github.com/hashicorp/go-multierror v1.1.1
	github.com/hashicorp/go-retryablehttp v0.7.7
	github.com/hashicorp/go-uuid v1.0.3
	github.com/hashicorp/go-version v1.7.0
	github.com/hashicorp/golang-lru/v2 v2.0.7
	github.com/hashicorp/hc-install v0.8.0
	github.com/hashicorp/hcl/v2 v2.22.0
	github.com/hashicorp/terraform-exec v0.21.0
	github.com/in-toto/in-toto-golang v0.9.0
	github.com/knqyf263/go-apk-version v0.0.0-20200609155635-041fdbb8563f
	github.com/knqyf263/go-deb-version v0.0.0-20230223133812-3ed183d23422
	github.com/knqyf263/go-rpm-version v0.0.0-20220614171824-631e686d1075
	github.com/knqyf263/go-rpmdb v0.1.1
	github.com/knqyf263/nested v0.0.1
	github.com/kylelemons/godebug v1.1.0
	github.com/liamg/iamgo v0.0.9
	github.com/liamg/jfather v0.0.7
	github.com/liamg/memoryfs v1.6.0
	github.com/magefile/mage v1.15.0
	github.com/masahiro331/go-disk v0.0.0-20240625071113-56c933208fee
	github.com/masahiro331/go-ebs-file v0.0.0-20240112135404-d5fbb1d46323
	github.com/masahiro331/go-ext4-filesystem v0.0.0-20240620024024-ca14e6327bbd
	github.com/masahiro331/go-mvn-version v0.0.0-20210429150710-d3157d602a08
	github.com/masahiro331/go-vmdk-parser v0.0.0-20221225061455-612096e4bbbd
	github.com/masahiro331/go-xfs-filesystem v0.0.0-20231205045356-1b22259a6c44
	github.com/mattn/go-shellwords v1.0.12
	github.com/microsoft/go-rustaudit v0.0.0-20220808201409-204dfee52032
	github.com/mitchellh/go-homedir v1.1.0
	github.com/mitchellh/hashstructure/v2 v2.0.2
	github.com/mitchellh/mapstructure v1.5.0
	github.com/moby/buildkit v0.15.2
	github.com/open-policy-agent/opa v0.67.1
	github.com/opencontainers/go-digest v1.0.0
	github.com/opencontainers/image-spec v1.1.0
	github.com/openvex/discovery v0.1.0
	github.com/openvex/go-vex v0.2.5
	github.com/owenrumney/go-sarif/v2 v2.3.3
	github.com/owenrumney/squealer v1.2.4
	github.com/package-url/packageurl-go v0.1.3
	github.com/quasilyte/go-ruleguard/dsl v0.3.22
	github.com/samber/lo v1.47.0
	github.com/secure-systems-lab/go-securesystemslib v0.8.0
	github.com/sigstore/rekor v1.3.6
	github.com/sirupsen/logrus v1.9.3
	github.com/sosedoff/gitkit v0.4.0
	github.com/spdx/tools-golang v0.5.5 // v0.5.3 with necessary changes. Can be upgraded to version 0.5.4 after release.
	github.com/spf13/cast v1.7.0
	github.com/spf13/cobra v1.8.1
	github.com/spf13/pflag v1.0.5
	github.com/spf13/viper v1.19.0
	github.com/stretchr/testify v1.9.0
	github.com/testcontainers/testcontainers-go v0.33.0
	github.com/testcontainers/testcontainers-go/modules/localstack v0.33.0
	github.com/tetratelabs/wazero v1.8.0
	github.com/twitchtv/twirp v8.1.3+incompatible
	github.com/xeipuuv/gojsonschema v1.2.0
	github.com/xlab/treeprint v1.2.0
	github.com/zclconf/go-cty v1.15.0
	github.com/zclconf/go-cty-yaml v1.0.3
	go.etcd.io/bbolt v1.3.11
	golang.org/x/crypto v0.26.0
	golang.org/x/exp v0.0.0-20231110203233-9a3e6036ecaa // indirect
	golang.org/x/mod v0.20.0
	golang.org/x/net v0.28.0
	golang.org/x/sync v0.8.0
	golang.org/x/term v0.23.0
	golang.org/x/text v0.17.0
	golang.org/x/vuln v1.1.3
	golang.org/x/xerrors v0.0.0-20231012003039-104605ab7028
	google.golang.org/protobuf v1.34.2
	gopkg.in/yaml.v3 v3.0.1
	helm.sh/helm/v3 v3.15.4
	k8s.io/api v0.30.3
	k8s.io/utils v0.0.0-20240711033017-18e509b52bc8
	modernc.org/sqlite v1.32.0
	sigs.k8s.io/yaml v1.4.0
)

require (
	cloud.google.com/go v0.112.1 // indirect
	cloud.google.com/go/compute/metadata v0.3.0 // indirect
	cloud.google.com/go/iam v1.1.6 // indirect
	cloud.google.com/go/storage v1.39.1 // indirect
	dario.cat/mergo v1.0.1 // indirect
	github.com/AdaLogics/go-fuzz-headers v0.0.0-20230811130428-ced1acdcaa24 // indirect
	github.com/AdamKorcz/go-118-fuzz-build v0.0.0-20230306123547-8075edf89bb0 // indirect
	github.com/Azure/azure-sdk-for-go/sdk/internal v1.10.0 // indirect
	github.com/Azure/go-ansiterm v0.0.0-20230124172434-306776ec8161 // indirect
	github.com/Azure/go-autorest v14.2.0+incompatible // indirect
	github.com/Azure/go-autorest/autorest v0.11.29 // indirect
	github.com/Azure/go-autorest/autorest/adal v0.9.23 // indirect
	github.com/Azure/go-autorest/autorest/date v0.3.0 // indirect
	github.com/Azure/go-autorest/logger v0.2.1 // indirect
	github.com/Azure/go-autorest/tracing v0.6.0 // indirect
	github.com/AzureAD/microsoft-authentication-library-for-go v1.2.2 // indirect
	github.com/Intevation/gval v1.3.0 // indirect
	github.com/Intevation/jsonpath v0.2.1 // indirect
	github.com/MakeNowJust/heredoc v1.0.0 // indirect
	github.com/Masterminds/goutils v1.1.1 // indirect
	github.com/Masterminds/semver/v3 v3.3.0 // indirect
	github.com/Masterminds/squirrel v1.5.4 // indirect
	github.com/Microsoft/go-winio v0.6.2 // indirect
	github.com/Microsoft/hcsshim v0.12.0 // indirect
	github.com/OneOfOne/xxhash v1.2.8 // indirect
	github.com/ProtonMail/go-crypto v1.1.0-alpha.2 // indirect
	github.com/VividCortex/ewma v1.2.0 // indirect
	github.com/agext/levenshtein v1.2.3 // indirect
	github.com/agnivade/levenshtein v1.1.1 // indirect
	github.com/alicebob/gopher-json v0.0.0-20200520072559-a9ecdc9d1d3a // indirect
	github.com/anchore/go-struct-converter v0.0.0-20221118182256-c68fdcfa2092 // indirect
	github.com/antchfx/xpath v1.3.1 // indirect
	github.com/apparentlymart/go-textseg/v15 v15.0.0 // indirect
	github.com/asaskevich/govalidator v0.0.0-20230301143203-a9d515a09cc2 // indirect
	github.com/aws/aws-sdk-go v1.54.6 // indirect
	github.com/aws/aws-sdk-go-v2/feature/ec2/imds v1.16.13 // indirect
	github.com/aws/aws-sdk-go-v2/internal/configsources v1.3.17 // indirect
	github.com/aws/aws-sdk-go-v2/internal/endpoints/v2 v2.6.17 // indirect
	github.com/aws/aws-sdk-go-v2/internal/ini v1.8.1 // indirect
	github.com/aws/aws-sdk-go-v2/service/ebs v1.21.7 // indirect
	github.com/aws/aws-sdk-go-v2/service/internal/accept-encoding v1.11.4 // indirect
	github.com/aws/aws-sdk-go-v2/service/internal/presigned-url v1.11.19 // indirect
	github.com/aws/aws-sdk-go-v2/service/sso v1.22.7 // indirect
	github.com/aws/aws-sdk-go-v2/service/ssooidc v1.26.7 // indirect
	github.com/beorn7/perks v1.0.1 // indirect
	github.com/bgentry/go-netrc v0.0.0-20140422174119-9fd32a8b3d3d // indirect
	github.com/blang/semver v3.5.1+incompatible // indirect
	github.com/briandowns/spinner v1.23.0 // indirect
	github.com/cespare/xxhash/v2 v2.3.0 // indirect
	github.com/chai2010/gettext-go v1.0.2 // indirect
	github.com/cloudflare/circl v1.3.7 // indirect
	github.com/containerd/cgroups/v3 v3.0.2 // indirect
	github.com/containerd/containerd/api v1.7.19 // indirect
	github.com/containerd/continuity v0.4.3 // indirect
	github.com/containerd/errdefs v0.1.0 // indirect
	github.com/containerd/fifo v1.1.0 // indirect
	github.com/containerd/log v0.1.0 // indirect
	github.com/containerd/platforms v0.2.1 // indirect
	github.com/containerd/stargz-snapshotter/estargz v0.15.1 // indirect
	github.com/containerd/ttrpc v1.2.5 // indirect
	github.com/containerd/typeurl/v2 v2.1.1 // indirect
	github.com/cpuguy83/dockercfg v0.3.1 // indirect
	github.com/cpuguy83/go-md2man/v2 v2.0.4 // indirect
	github.com/cyberphone/json-canonicalization v0.0.0-20231011164504-785e29786b46 // indirect
	github.com/cyphar/filepath-securejoin v0.2.4 // indirect
	github.com/davecgh/go-spew v1.1.2-0.20180830191138-d8f796af33cc // indirect
	github.com/dgryski/go-rendezvous v0.0.0-20200823014737-9f7001d12a5f // indirect
	github.com/digitorus/pkcs7 v0.0.0-20230818184609-3a137a874352 // indirect
	github.com/digitorus/timestamp v0.0.0-20231217203849-220c5c2851b7 // indirect
	github.com/distribution/reference v0.6.0 // indirect
	github.com/dlclark/regexp2 v1.4.0 // indirect
	github.com/docker/cli v27.1.1+incompatible // indirect
	github.com/docker/distribution v2.8.3+incompatible // indirect
	github.com/docker/docker-credential-helpers v0.8.2 // indirect
	github.com/docker/go-events v0.0.0-20190806004212-e31b211e4f1c // indirect
	github.com/docker/go-metrics v0.0.1 // indirect
	github.com/docker/go-units v0.5.0 // indirect
	github.com/docker/libtrust v0.0.0-20160708172513-aabc10ec26b7 // indirect
	github.com/dsnet/compress v0.0.1 // indirect
	github.com/dustin/go-humanize v1.0.1 // indirect
	github.com/emicklei/go-restful/v3 v3.11.0 // indirect
	github.com/emirpasic/gods v1.18.1 // indirect
	github.com/evanphx/json-patch v5.7.0+incompatible // indirect
	github.com/exponent-io/jsonpath v0.0.0-20151013193312-d6023ce2651d // indirect
	github.com/felixge/httpsnoop v1.0.4 // indirect
	github.com/fsnotify/fsnotify v1.7.0 // indirect
	github.com/fxamacker/cbor/v2 v2.7.0 // indirect
	github.com/go-chi/chi v4.1.2+incompatible // indirect
	github.com/go-errors/errors v1.4.2 // indirect
	github.com/go-git/gcfg v1.5.1-0.20230307220236-3a3c6141e376 // indirect
	github.com/go-git/go-billy/v5 v5.5.0 // indirect
	github.com/go-gorp/gorp/v3 v3.1.0 // indirect
	github.com/go-ini/ini v1.67.0 // indirect
	github.com/go-logr/logr v1.4.2 // indirect
	github.com/go-logr/stdr v1.2.2 // indirect
	github.com/go-ole/go-ole v1.3.0 // indirect
	github.com/go-openapi/analysis v0.23.0 // indirect
	github.com/go-openapi/errors v0.22.0 // indirect
	github.com/go-openapi/jsonpointer v0.21.0 // indirect
	github.com/go-openapi/jsonreference v0.21.0 // indirect
	github.com/go-openapi/loads v0.22.0 // indirect
	github.com/go-openapi/spec v0.21.0 // indirect
	github.com/go-openapi/swag v0.23.0 // indirect
	github.com/go-openapi/validate v0.24.0 // indirect
	github.com/gobwas/glob v0.2.3 // indirect
	github.com/goccy/go-yaml v1.9.5 // indirect
	github.com/gofrs/uuid v4.3.1+incompatible // indirect
	github.com/gogo/protobuf v1.3.2 // indirect
	github.com/golang-jwt/jwt/v4 v4.5.0 // indirect
	github.com/golang/groupcache v0.0.0-20210331224755-41bb18bfe9da // indirect
	github.com/golang/protobuf v1.5.4 // indirect
	github.com/golang/snappy v0.0.4 // indirect
	github.com/google/btree v1.1.2 // indirect
	github.com/google/certificate-transparency-go v1.1.8 // indirect
	github.com/google/gnostic-models v0.6.9-0.20230804172637-c7be7c783f49 // indirect
	github.com/google/go-cmp v0.6.0 // indirect
	github.com/google/go-querystring v1.1.0 // indirect
	github.com/google/gofuzz v1.2.0 // indirect
	github.com/google/s2a-go v0.1.7 // indirect
	github.com/google/shlex v0.0.0-20191202100458-e7afc7fbc510 // indirect
	github.com/googleapis/enterprise-certificate-proxy v0.3.2 // indirect
	github.com/googleapis/gax-go/v2 v2.12.3 // indirect
	github.com/gorilla/mux v1.8.1 // indirect
	github.com/gorilla/websocket v1.5.0 // indirect
	github.com/gosuri/uitable v0.0.4 // indirect
	github.com/gregjones/httpcache v0.0.0-20190611155906-901d90724c79 // indirect
	github.com/hashicorp/errwrap v1.1.0 // indirect
	github.com/hashicorp/go-cleanhttp v0.5.2 // indirect
	github.com/hashicorp/go-safetemp v1.0.0 // indirect
	github.com/hashicorp/golang-lru v0.6.0 // indirect
	github.com/hashicorp/hcl v1.0.1-vault-5 // indirect
	github.com/hashicorp/terraform-json v0.22.1 // indirect
	github.com/huandu/xstrings v1.5.0 // indirect
	github.com/imdario/mergo v0.3.16 // indirect
	github.com/inconshreveable/mousetrap v1.1.0 // indirect
	github.com/jbenet/go-context v0.0.0-20150711004518-d14ea06fba99 // indirect
	github.com/jedisct1/go-minisign v0.0.0-20230811132847-661be99b8267 // indirect
	github.com/jmespath/go-jmespath v0.4.0 // indirect
	github.com/jmoiron/sqlx v1.3.5 // indirect
	github.com/josharian/intern v1.0.0 // indirect
	github.com/json-iterator/go v1.1.12 // indirect
	github.com/kevinburke/ssh_config v1.2.0 // indirect
	github.com/klauspost/compress v1.17.9 // indirect
	github.com/lann/builder v0.0.0-20180802200727-47ae307949d0 // indirect
	github.com/lann/ps v0.0.0-20150810152359-62de8c46ede0 // indirect
	github.com/letsencrypt/boulder v0.0.0-20231026200631-000cd05d5491 // indirect
	github.com/lib/pq v1.10.9 // indirect
	github.com/liggitt/tabwriter v0.0.0-20181228230101-89fcab3d43de // indirect
	github.com/lufia/plan9stats v0.0.0-20240226150601-1dcf7310316a // indirect
	github.com/lunixbochs/struc v0.0.0-20200707160740-784aaebc1d40 // indirect
	github.com/magiconair/properties v1.8.7 // indirect
	github.com/mailru/easyjson v0.7.7 // indirect
	github.com/mattn/go-colorable v0.1.13 // indirect
	github.com/mattn/go-isatty v0.0.20 // indirect
	github.com/mattn/go-runewidth v0.0.15 // indirect
	github.com/mitchellh/copystructure v1.2.0 // indirect
	github.com/mitchellh/go-testing-interface v1.14.1 // indirect
	github.com/mitchellh/go-wordwrap v1.0.1 // indirect
	github.com/mitchellh/reflectwalk v1.0.2 // indirect
	github.com/moby/docker-image-spec v1.3.1 // indirect
	github.com/moby/locker v1.0.1 // indirect
	github.com/moby/patternmatcher v0.6.0 // indirect
	github.com/moby/spdystream v0.4.0 // indirect
	github.com/moby/sys/mountinfo v0.7.1 // indirect
	github.com/moby/sys/sequential v0.5.0 // indirect
	github.com/moby/sys/signal v0.7.0 // indirect
	github.com/moby/sys/user v0.3.0 // indirect
	github.com/moby/sys/userns v0.1.0 // indirect
	github.com/moby/term v0.5.0 // indirect
	github.com/modern-go/concurrent v0.0.0-20180306012644-bacd9c7ef1dd // indirect
	github.com/modern-go/reflect2 v1.0.2 // indirect
	github.com/monochromegane/go-gitignore v0.0.0-20200626010858-205db1a8cc00 // indirect
	github.com/morikuni/aec v1.0.0 // indirect
	github.com/munnerz/goautoneg v0.0.0-20191010083416-a7dc8b61c822 // indirect
	github.com/mxk/go-flowrate v0.0.0-20140419014527-cca7078d478f // indirect
	github.com/ncruces/go-strftime v0.1.9 // indirect
	github.com/nozzle/throttler v0.0.0-20180817012639-2ea982251481 // indirect
	github.com/oklog/ulid v1.3.1 // indirect
	github.com/opencontainers/runtime-spec v1.2.0 // indirect
	github.com/opencontainers/selinux v1.11.0 // indirect
	github.com/opentracing/opentracing-go v1.2.0 // indirect
	github.com/pelletier/go-toml/v2 v2.2.2 // indirect
	github.com/peterbourgon/diskv v2.0.1+incompatible // indirect
	github.com/pjbgf/sha1cd v0.3.0 // indirect
	github.com/pkg/browser v0.0.0-20240102092130-5ac0b6a4141c // indirect
	github.com/pkg/errors v0.9.1 // indirect
	github.com/pmezard/go-difflib v1.0.1-0.20181226105442-5d4384ee4fb2 // indirect
	github.com/power-devops/perfstat v0.0.0-20240221224432-82ca36839d55 // indirect
	github.com/prometheus/client_golang v1.20.1 // indirect
	github.com/prometheus/client_model v0.6.1 // indirect
	github.com/prometheus/common v0.55.0 // indirect
	github.com/prometheus/procfs v0.15.1 // indirect
	github.com/rcrowley/go-metrics v0.0.0-20201227073835-cf1acfcdf475 // indirect
	github.com/remyoudompheng/bigfft v0.0.0-20230129092748-24d4a6f8daec // indirect
	github.com/rivo/uniseg v0.4.4 // indirect
	github.com/rubenv/sql-migrate v1.5.2 // indirect
	github.com/russross/blackfriday/v2 v2.1.0 // indirect
	github.com/sagikazarmark/locafero v0.4.0 // indirect
	github.com/sagikazarmark/slog-shim v0.1.0 // indirect
	github.com/santhosh-tekuri/jsonschema/v5 v5.3.1 // indirect
	github.com/sassoftware/relic v7.2.1+incompatible // indirect
	github.com/sergi/go-diff v1.3.2-0.20230802210424-5b0b94c5c0d3 // indirect
	github.com/shibumi/go-pathspec v1.3.0 // indirect
	github.com/shirou/gopsutil/v3 v3.24.2 // indirect
	github.com/shoenig/go-m1cpu v0.1.6 // indirect
	github.com/shopspring/decimal v1.4.0 // indirect
	github.com/sigstore/cosign/v2 v2.2.4 // indirect
	github.com/sigstore/sigstore v1.8.3 // indirect
	github.com/sigstore/timestamp-authority v1.2.2 // indirect
	github.com/skeema/knownhosts v1.2.2 // indirect
	github.com/sourcegraph/conc v0.3.0 // indirect
	github.com/spf13/afero v1.11.0 // indirect
	github.com/stretchr/objx v0.5.2 // indirect
	github.com/subosito/gotenv v1.6.0 // indirect
	github.com/syndtr/goleveldb v1.0.1-0.20220721030215-126854af5e6d // indirect
	github.com/tchap/go-patricia/v2 v2.3.1 // indirect
	github.com/theupdateframework/go-tuf v0.7.0 // indirect
	github.com/titanous/rocacheck v0.0.0-20171023193734-afe73141d399 // indirect
	github.com/tklauser/go-sysconf v0.3.13 // indirect
	github.com/tklauser/numcpus v0.7.0 // indirect
	github.com/tonistiigi/go-csvvalue v0.0.0-20240710180619-ddb21b71c0b4 // indirect
	github.com/transparency-dev/merkle v0.0.2 // indirect
	github.com/ulikunitz/xz v0.5.11 // indirect
	github.com/vbatts/tar-split v0.11.5 // indirect
	github.com/vmihailenco/msgpack/v5 v5.3.5 // indirect
	github.com/vmihailenco/tagparser/v2 v2.0.0 // indirect
	github.com/x448/float16 v0.8.4 // indirect
	github.com/xanzy/ssh-agent v0.3.3 // indirect
	github.com/xeipuuv/gojsonpointer v0.0.0-20190905194746-02993c407bfb // indirect
	github.com/xeipuuv/gojsonreference v0.0.0-20180127040603-bd5ef7bd5415 // indirect
	github.com/yashtewari/glob-intersection v0.2.0 // indirect
	github.com/yuin/gopher-lua v1.1.1 // indirect
	github.com/yusufpapurcu/wmi v1.2.4 // indirect
	go.mongodb.org/mongo-driver v1.14.0 // indirect
	go.opencensus.io v0.24.0 // indirect
	go.opentelemetry.io/contrib/instrumentation/google.golang.org/grpc/otelgrpc v0.49.0 // indirect
	go.opentelemetry.io/contrib/instrumentation/net/http/otelhttp v0.53.0 // indirect
	go.opentelemetry.io/otel v1.28.0 // indirect
	go.opentelemetry.io/otel/metric v1.28.0 // indirect
	go.opentelemetry.io/otel/sdk v1.28.0 // indirect
	go.opentelemetry.io/otel/trace v1.28.0 // indirect
	go.starlark.net v0.0.0-20230525235612-a134d8f9ddca // indirect
	go.uber.org/multierr v1.11.0 // indirect
	go.uber.org/zap v1.27.0 // indirect
	golang.org/x/oauth2 v0.21.0 // indirect
	golang.org/x/sys v0.23.0 // indirect
	golang.org/x/telemetry v0.0.0-20240522233618-39ace7a40ae7 // indirect
	golang.org/x/time v0.6.0 // indirect
	golang.org/x/tools v0.23.0 // indirect
	google.golang.org/api v0.172.0 // indirect
	google.golang.org/genproto v0.0.0-20240311173647-c811ad7063a7 // indirect
	google.golang.org/genproto/googleapis/api v0.0.0-20240701130421-f6361c86f094 // indirect
	google.golang.org/genproto/googleapis/rpc v0.0.0-20240701130421-f6361c86f094 // indirect
	google.golang.org/grpc v1.65.0 // indirect
	gopkg.in/cheggaaa/pb.v1 v1.0.28 // indirect
	gopkg.in/go-jose/go-jose.v2 v2.6.3 // indirect
	gopkg.in/inf.v0 v0.9.1 // indirect
	gopkg.in/ini.v1 v1.67.0 // indirect
	gopkg.in/warnings.v0 v0.1.2 // indirect
	gopkg.in/yaml.v2 v2.4.0 // indirect
	k8s.io/apiextensions-apiserver v0.30.3 // indirect
	k8s.io/apimachinery v0.31.0 // indirect
	k8s.io/apiserver v0.30.3 // indirect
	k8s.io/cli-runtime v0.30.3 // indirect
	k8s.io/client-go v0.30.3 // indirect
	k8s.io/component-base v0.30.3 // indirect
	k8s.io/klog/v2 v2.130.1 // indirect
	k8s.io/kube-openapi v0.0.0-20240228011516-70dd3763d340 // indirect
	k8s.io/kubectl v0.30.3 // indirect
	modernc.org/gc/v3 v3.0.0-20240107210532-573471604cb6 // indirect
	modernc.org/libc v1.55.3 // indirect
	modernc.org/mathutil v1.6.0 // indirect
	modernc.org/memory v1.8.0 // indirect
	modernc.org/strutil v1.2.0 // indirect
	modernc.org/token v1.1.0 // indirect
	mvdan.cc/sh/v3 v3.8.0 // indirect
	oras.land/oras-go v1.2.5 // indirect
	sigs.k8s.io/json v0.0.0-20221116044647-bc3834ca7abd // indirect
	sigs.k8s.io/kustomize/api v0.13.5-0.20230601165947-6ce0bf390ce3 // indirect
	sigs.k8s.io/kustomize/kyaml v0.14.3-0.20230601165947-6ce0bf390ce3 // indirect
	sigs.k8s.io/structured-merge-diff/v4 v4.4.1 // indirect
)

// cf. https://github.com/openvex/discovery/pull/40
replace github.com/openvex/discovery => github.com/knqyf263/discovery v0.1.1-0.20240726113521-97873005fd03

// see https://github.com/open-policy-agent/opa/pull/6970
replace github.com/open-policy-agent/opa => github.com/nikpivkin/opa v0.0.0-20240829080621-16999fcb5464
